Build: #190 failed

Job: Test Tasks Many Linux 2.28 Rocky 8.10 Py3.12 failed

Job result summary

Completed
Duration
4 minutes
Agent
cvpost134.cv.nrao.edu
Revision
188b64ce030a360ced17720a68d5af3bbcffaf87
Total tests
1
Failing since
#180 (Child of CASASPECS-MASTERBUILDCASALITHGPU-195 – )

Tests

  • 1 test in total
  • 1 test failed
  • 1 failure is new
  • < 1 second taken in total.
New test failures 1
Status Test Duration
Collapse Failed pytest internal
< 1 sec
internal error
Traceback (most recent call last):
  File "/home/casatest/venv/lib/python3.12/site-packages/_pytest/main.py", line 333, in wrap_session
    session.exitstatus = doit(config, session) or 0
                         ^^^^^^^^^^^^^^^^^^^^^
  File "/home/casatest/venv/lib/python3.12/site-packages/_pytest/main.py", line 387, in _main
    config.hook.pytest_runtestloop(session=session)
  File "/home/casatest/venv/lib/python3.12/site-packages/pluggy/_caller.py", line 197, in __call__
(57 more lines...)

Error summary

The build generated some errors. See the full build log for more details.

/export/cvpost134-nvme/casa/bamboohome/temp/CASASPECS-MASTERTESTGPUPY312-TTM228PY312-190-ScriptBuildTask-1414154094928907771.sh: line 1: cd: /opt/casa/data/master: No such file or directory
/export/cvpost134-nvme/casa/bamboohome/temp/CASASPECS-MASTERTESTGPUPY312-TTM228PY312-190-ScriptBuildTask-1414154094928907771.sh: line 2: cd: /opt/casa/data/casa-data-req: No such file or directory
/export/cvpost134-nvme/casa/bamboohome/temp/CASASPECS-MASTERTESTGPUPY312-TTM228PY312-190-ScriptBuildTask-1414154094928907771.sh: line 3: cd: /opt/casa/data/casatestdata: No such file or directory
Error response from daemon: No such container: wheel-container-test
Error response from daemon: No such container: wheel-container-test
  % Total    % Received % Xferd  Average Speed   Time    Time     Time  Current
                                 Dload  Upload   Total   Spent    Left  Speed

  0     0    0     0    0     0      0      0 --:--:-- --:--:-- --:--:--     0
100 6002k  100 6002k    0     0  68.9M      0 --:--:-- --:--:-- --:--:-- 68.9M
[4020928] Failed to execute script 'atlutil' due to unhandled exception!
Traceback (most recent call last):
  File "atlutil.py", line 194, in <module>
  File "atlutil.py", line 112, in get_ticket_components
KeyError: 'fields'
[4021000] Failed to execute script 'atlutil' due to unhandled exception!
Traceback (most recent call last):
  File "atlutil.py", line 200, in <module>
  File "atlutil.py", line 165, in has_fix_version
KeyError: 'fields'
Already on 'master'
tar: work: Cannot stat: No such file or directory
tar: Exiting with failure status due to previous errors