Build: #190 failed
Job: Test Tools Many Linux 2.28 Rocky 8.10 Py3.12 failed
Build log
The build generated 404 lines of output. Download or view full build log.
| 28-Oct-2026 07:06:26 | Build CASASPECS - Master Test GPU 3.12 - Test Tools Many Linux 2.28 Rocky 8.10 Py3.12 #190 (CASASPECS-MASTERTESTGPUPY312-TTOMLPY312-190) is being prepared for building on agent cvpost134.cv.nrao.edu, bamboo version: 9.6.26 |
| 28-Oct-2026 07:06:26 | Remote agent on host cvpost134.cv.nrao.edu |
| 28-Oct-2026 07:06:26 | Build working directory is /export/cvpost134-nvme/casa/bamboohome/xml-data/build-dir/CASASPECS-MASTERTESTGPUPY312-TTOMLPY312 |
| 28-Oct-2026 07:06:26 | Executing build CASASPECS - Master Test GPU 3.12 - Test Tools Many Linux 2.28 Rocky 8.10 Py3.12 #190 (CASASPECS-MASTERTESTGPUPY312-TTOMLPY312-190) |
| 28-Oct-2026 07:06:26 | Starting task 'Source Code Checkout' of type 'com.atlassian.bamboo.plugins.vcs:task.vcs.checkout' |
| 28-Oct-2026 07:06:26 | Build always requires a clean checkout |
| 28-Oct-2026 07:06:26 | Cleaning build directory '/export/cvpost134-nvme/casa/bamboohome/xml-data/build-dir/CASASPECS-MASTERTESTGPUPY312-TTOMLPY312' |
| 28-Oct-2026 07:06:27 | Checking out into /export/cvpost134-nvme/casa/bamboohome/xml-data/build-dir/CASASPECS-MASTERTESTGPUPY312-TTOMLPY312 |
| 28-Oct-2026 07:06:27 | Updating source code to revision: 188b64ce030a360ced17720a68d5af3bbcffaf87 |
| 28-Oct-2026 07:06:27 | Fetching 'refs/heads/master' from 'ssh://git@open-bitbucket.nrao.edu:7999/casa/casa6.git'. |
| 28-Oct-2026 07:06:27 | Warning: Permanently added '[127.0.0.1]:33159' (RSA) to the list of known hosts. |
| 28-Oct-2026 07:06:27 | X11 forwarding request failed on channel 0 |
| 28-Oct-2026 07:06:30 | Checking out revision 188b64ce030a360ced17720a68d5af3bbcffaf87. |
| 28-Oct-2026 07:06:30 | Creating local git repository in '/export/cvpost134-nvme/casa/bamboohome/xml-data/build-dir/CASASPECS-MASTERTESTGPUPY312-TTOMLPY312/.git'. |
| 28-Oct-2026 07:06:30 | Cloning into '/export/cvpost134-nvme/casa/bamboohome/xml-data/build-dir/CASASPECS-MASTERTESTGPUPY312-TTOMLPY312'... |
| 28-Oct-2026 07:06:30 | done. |
| 28-Oct-2026 07:06:49 | Already on 'master' |
| 28-Oct-2026 07:06:49 | Your branch is up to date with 'origin/master'. |
| 28-Oct-2026 07:06:49 | Submodule 'casatools/casacore' (https://github.com/casacore/casacore.git) registered for path 'casatools/casacore' |
| 28-Oct-2026 07:06:49 | Submodule 'casatools/grpc-source' (https://github.com/grpc/grpc) registered for path 'casatools/grpc-source' |
| 28-Oct-2026 07:06:49 | Cloning into '/export/cvpost134-nvme/casa/bamboohome/xml-data/build-dir/CASASPECS-MASTERTESTGPUPY312-TTOMLPY312/casatools/casacore'... |
| 28-Oct-2026 07:07:00 | Cloning into '/export/cvpost134-nvme/casa/bamboohome/xml-data/build-dir/CASASPECS-MASTERTESTGPUPY312-TTOMLPY312/casatools/grpc-source'... |
| 28-Oct-2026 07:07:32 | Submodule path 'casatools/casacore': checked out 'aaf72eb7edd5a5fecefa78ca04713233b7b6ffd6' |
| 28-Oct-2026 07:07:33 | Submodule path 'casatools/grpc-source': checked out 'cca868ac8f3641df4003a82b7fc54c921e14f765' |
| 28-Oct-2026 07:07:33 | Submodule 'third_party/abseil-cpp' (https://github.com/abseil/abseil-cpp) registered for path 'casatools/grpc-source/third_party/abseil-cpp' |
| 28-Oct-2026 07:07:33 | Submodule 'third_party/benchmark' (https://github.com/google/benchmark) registered for path 'casatools/grpc-source/third_party/benchmark' |
| 28-Oct-2026 07:07:33 | Submodule 'third_party/bloaty' (https://github.com/google/bloaty.git) registered for path 'casatools/grpc-source/third_party/bloaty' |
| 28-Oct-2026 07:07:33 | Submodule 'third_party/boringssl' (https://github.com/google/boringssl.git) registered for path 'casatools/grpc-source/third_party/boringssl' |
| 28-Oct-2026 07:07:33 | Submodule 'third_party/boringssl-with-bazel' (https://github.com/google/boringssl.git) registered for path 'casatools/grpc-source/third_party/boringssl-with-bazel' |
| 28-Oct-2026 07:07:33 | Submodule 'third_party/cares/cares' (https://github.com/c-ares/c-ares.git) registered for path 'casatools/grpc-source/third_party/cares/cares' |
| 28-Oct-2026 07:07:33 | Submodule 'third_party/gflags' (https://github.com/gflags/gflags.git) registered for path 'casatools/grpc-source/third_party/gflags' |
| 28-Oct-2026 07:07:33 | Submodule 'third_party/googletest' (https://github.com/google/googletest.git) registered for path 'casatools/grpc-source/third_party/googletest' |
| 28-Oct-2026 07:07:33 | Submodule 'third_party/protobuf' (https://github.com/google/protobuf.git) registered for path 'casatools/grpc-source/third_party/protobuf' |
| 28-Oct-2026 07:07:33 | Submodule 'third_party/zlib' (https://github.com/madler/zlib) registered for path 'casatools/grpc-source/third_party/zlib' |
| 28-Oct-2026 07:07:33 | Cloning into '/export/cvpost134-nvme/casa/bamboohome/xml-data/build-dir/CASASPECS-MASTERTESTGPUPY312-TTOMLPY312/casatools/grpc-source/third_party/abseil-cpp'... |
| 28-Oct-2026 07:07:35 | Cloning into '/export/cvpost134-nvme/casa/bamboohome/xml-data/build-dir/CASASPECS-MASTERTESTGPUPY312-TTOMLPY312/casatools/grpc-source/third_party/benchmark'... |
| 28-Oct-2026 07:07:36 | Cloning into '/export/cvpost134-nvme/casa/bamboohome/xml-data/build-dir/CASASPECS-MASTERTESTGPUPY312-TTOMLPY312/casatools/grpc-source/third_party/bloaty'... |
| 28-Oct-2026 07:07:36 | Cloning into '/export/cvpost134-nvme/casa/bamboohome/xml-data/build-dir/CASASPECS-MASTERTESTGPUPY312-TTOMLPY312/casatools/grpc-source/third_party/boringssl'... |
| 28-Oct-2026 07:07:49 | Cloning into '/export/cvpost134-nvme/casa/bamboohome/xml-data/build-dir/CASASPECS-MASTERTESTGPUPY312-TTOMLPY312/casatools/grpc-source/third_party/boringssl-with-bazel'... |
| 28-Oct-2026 07:08:02 | Cloning into '/export/cvpost134-nvme/casa/bamboohome/xml-data/build-dir/CASASPECS-MASTERTESTGPUPY312-TTOMLPY312/casatools/grpc-source/third_party/cares/cares'... |
| 28-Oct-2026 07:08:03 | Cloning into '/export/cvpost134-nvme/casa/bamboohome/xml-data/build-dir/CASASPECS-MASTERTESTGPUPY312-TTOMLPY312/casatools/grpc-source/third_party/gflags'... |
| 28-Oct-2026 07:08:03 | Cloning into '/export/cvpost134-nvme/casa/bamboohome/xml-data/build-dir/CASASPECS-MASTERTESTGPUPY312-TTOMLPY312/casatools/grpc-source/third_party/googletest'... |
| 28-Oct-2026 07:08:04 | Cloning into '/export/cvpost134-nvme/casa/bamboohome/xml-data/build-dir/CASASPECS-MASTERTESTGPUPY312-TTOMLPY312/casatools/grpc-source/third_party/protobuf'... |
| 28-Oct-2026 07:08:15 | Cloning into '/export/cvpost134-nvme/casa/bamboohome/xml-data/build-dir/CASASPECS-MASTERTESTGPUPY312-TTOMLPY312/casatools/grpc-source/third_party/zlib'... |
| 28-Oct-2026 07:08:15 | Submodule path 'casatools/grpc-source/third_party/abseil-cpp': checked out 'cc4bed2d74f7c8717e31f9579214ab52a9c9c610' |
| 28-Oct-2026 07:08:16 | Submodule path 'casatools/grpc-source/third_party/benchmark': checked out '5b7683f49e1e9223cf9927b24f6fd3d6bd82e3f8' |
| 28-Oct-2026 07:08:16 | Submodule path 'casatools/grpc-source/third_party/bloaty': checked out '73594cde8c9a52a102c4341c244c833aa61b9c06' |
| 28-Oct-2026 07:08:16 | Submodule 'third_party/googletest' (https://github.com/google/googletest.git) registered for path 'casatools/grpc-source/third_party/bloaty/third_party/googletest' |
| 28-Oct-2026 07:08:16 | Submodule 'third_party/libFuzzer' (https://chromium.googlesource.com/chromium/llvm-project/llvm/lib/Fuzzer) registered for path 'casatools/grpc-source/third_party/bloaty/third_party/libFuzzer' |
| 28-Oct-2026 07:08:16 | Submodule 'third_party/re2' (https://github.com/google/re2) registered for path 'casatools/grpc-source/third_party/bloaty/third_party/re2' |
| 28-Oct-2026 07:08:16 | Cloning into '/export/cvpost134-nvme/casa/bamboohome/xml-data/build-dir/CASASPECS-MASTERTESTGPUPY312-TTOMLPY312/casatools/grpc-source/third_party/bloaty/third_party/googletest'... |
| 28-Oct-2026 07:08:17 | Cloning into '/export/cvpost134-nvme/casa/bamboohome/xml-data/build-dir/CASASPECS-MASTERTESTGPUPY312-TTOMLPY312/casatools/grpc-source/third_party/bloaty/third_party/libFuzzer'... |
| 28-Oct-2026 07:08:17 | Cloning into '/export/cvpost134-nvme/casa/bamboohome/xml-data/build-dir/CASASPECS-MASTERTESTGPUPY312-TTOMLPY312/casatools/grpc-source/third_party/bloaty/third_party/re2'... |
| 28-Oct-2026 07:08:18 | Submodule path 'casatools/grpc-source/third_party/bloaty/third_party/googletest': checked out 'a2b8a8e07628e5fd60644b6dd99c1b5e7d7f1f47' |
| 28-Oct-2026 07:08:18 | Submodule path 'casatools/grpc-source/third_party/bloaty/third_party/libFuzzer': checked out '1b543d6e5073b56be214394890c9193979a3d7e1' |
| 28-Oct-2026 07:08:18 | Submodule path 'casatools/grpc-source/third_party/bloaty/third_party/re2': checked out 'c964d9b07816f9b52ca692e23b8b3dba33beec54' |
| 28-Oct-2026 07:08:18 | Submodule path 'casatools/grpc-source/third_party/boringssl': checked out 'be2ee342d3781ddb954f91f8a7e660c6f59e87e5' |
| 28-Oct-2026 07:08:19 | Submodule path 'casatools/grpc-source/third_party/boringssl-with-bazel': checked out '886e7d75368e3f4fab3f4d0d3584e4abfc557755' |
| 28-Oct-2026 07:08:19 | Submodule path 'casatools/grpc-source/third_party/cares/cares': checked out '3be1924221e1326df520f8498d704a5c4c8d0cce' |
| 28-Oct-2026 07:08:19 | Submodule path 'casatools/grpc-source/third_party/gflags': checked out '30dbc81fb5ffdc98ea9b14b1918bfe4e8779b26e' |
| 28-Oct-2026 07:08:19 | Submodule 'doc' (https://github.com/gflags/gflags.git) registered for path 'casatools/grpc-source/third_party/gflags/doc' |
| 28-Oct-2026 07:08:19 | Cloning into '/export/cvpost134-nvme/casa/bamboohome/xml-data/build-dir/CASASPECS-MASTERTESTGPUPY312-TTOMLPY312/casatools/grpc-source/third_party/gflags/doc'... |
| 28-Oct-2026 07:08:20 | Submodule path 'casatools/grpc-source/third_party/gflags/doc': checked out '971dd2a4fadac9cdab174c523c22df79efd63aa5' |
| 28-Oct-2026 07:08:20 | Submodule path 'casatools/grpc-source/third_party/googletest': checked out 'ec44c6c1675c25b9827aacd08c02433cccde7780' |
| 28-Oct-2026 07:08:20 | Submodule path 'casatools/grpc-source/third_party/protobuf': checked out '2761122b810fe8861004ae785cc3ab39f384d342' |
| 28-Oct-2026 07:08:20 | Submodule 'third_party/benchmark' (https://github.com/google/benchmark.git) registered for path 'casatools/grpc-source/third_party/protobuf/third_party/benchmark' |
| 28-Oct-2026 07:08:20 | Cloning into '/export/cvpost134-nvme/casa/bamboohome/xml-data/build-dir/CASASPECS-MASTERTESTGPUPY312-TTOMLPY312/casatools/grpc-source/third_party/protobuf/third_party/benchmark'... |
| 28-Oct-2026 07:08:20 | Submodule path 'casatools/grpc-source/third_party/protobuf/third_party/benchmark': checked out '360e66c1c4777c99402cf8cd535aa510fee16573' |
| 28-Oct-2026 07:08:21 | Submodule path 'casatools/grpc-source/third_party/zlib': checked out 'cacf7f1d4e3d44d871b605da3b647f07d718623f' |
| 28-Oct-2026 07:08:21 | Updated source code to revision: 188b64ce030a360ced17720a68d5af3bbcffaf87 |
| 28-Oct-2026 07:08:21 | Finished task 'Source Code Checkout' with result: Success |
| 28-Oct-2026 07:08:21 | Running pre-build action: Build Log Labeller Pre Build Action |
| 28-Oct-2026 07:08:21 | Running pre-build action: VCS Version Collector |
| 28-Oct-2026 07:08:21 | Build CASASPECS - Master Test GPU 3.12 - Test Tools Many Linux 2.28 Rocky 8.10 Py3.12 #190 (CASASPECS-MASTERTESTGPUPY312-TTOMLPY312-190) started building on agent 'cvpost134.cv.nrao.edu' (Remote agent on host cvpost134.cv.nrao.edu) |
| 28-Oct-2026 07:08:21 | Starting task 'Update data' of type 'com.atlassian.bamboo.plugins.scripttask:task.builder.script' |
| 28-Oct-2026 07:08:21 | Beginning to execute external process for build 'CASASPECS - Master Test GPU 3.12 - Test Tools Many Linux 2.28 Rocky 8.10 Py3.12 #190 (CASASPECS-MASTERTESTGPUPY312-TTOMLPY312-190)' ... running command line: /export/cvpost134-nvme/casa/bamboohome/temp/CASASPECS-MASTERTESTGPUPY312-TTOMLPY312-190-ScriptBuildTask-8550243567646207092.sh ... in: /export/cvpost134-nvme/casa/bamboohome/xml-data/build-dir/CASASPECS-MASTERTESTGPUPY312-TTOMLPY312 |
| 28-Oct-2026 07:08:21 | /export/cvpost134-nvme/casa/bamboohome/temp/CASASPECS-MASTERTESTGPUPY312-TTOMLPY312-190-ScriptBuildTask-8550243567646207092.sh: line 1: cd: /opt/casa/data/master: No such file or directory |
| 28-Oct-2026 07:08:21 | /export/cvpost134-nvme/casa/bamboohome/temp/CASASPECS-MASTERTESTGPUPY312-TTOMLPY312-190-ScriptBuildTask-8550243567646207092.sh: line 2: cd: /opt/casa/data/casa-data-req: No such file or directory |
| 28-Oct-2026 07:08:21 | /export/cvpost134-nvme/casa/bamboohome/temp/CASASPECS-MASTERTESTGPUPY312-TTOMLPY312-190-ScriptBuildTask-8550243567646207092.sh: line 3: cd: /opt/casa/data/casatestdata: No such file or directory |
| 28-Oct-2026 07:08:21 | Data update complete |
| 28-Oct-2026 07:08:21 | Finished task 'Update data' with result: Success |
| 28-Oct-2026 07:08:21 | Substituting variable: ${bamboo.repository.branch.name} with master |
| 28-Oct-2026 07:08:21 | Starting task 'Create wheeldirectory' of type 'com.atlassian.bamboo.plugins.scripttask:task.builder.script' |
| 28-Oct-2026 07:08:21 | Beginning to execute external process for build 'CASASPECS - Master Test GPU 3.12 - Test Tools Many Linux 2.28 Rocky 8.10 Py3.12 #190 (CASASPECS-MASTERTESTGPUPY312-TTOMLPY312-190)' ... running command line: /export/cvpost134-nvme/casa/bamboohome/temp/CASASPECS-MASTERTESTGPUPY312-TTOMLPY312-190-ScriptBuildTask-18034761131314727924.sh ... in: /export/cvpost134-nvme/casa/bamboohome/xml-data/build-dir/CASASPECS-MASTERTESTGPUPY312-TTOMLPY312 |
| 28-Oct-2026 07:08:21 | Finished task 'Create wheeldirectory' with result: Success |
| 28-Oct-2026 07:08:21 | Starting task 'Get wheel from parent build plan' of type 'com.atlassian.bamboo.plugins.bamboo-artifact-downloader-plugin:artifactdownloadertask' |
| 28-Oct-2026 07:08:21 | Preparing to download plan result CASASPECS-MASTERBUILDCASALITHGPU-203 artifact: Required shared artifact Http Compression On : [ManyLinux228 3.12 Casatestutils], patterns: [casatestutils*.whl] anchored at: [source/wheels] |
| 28-Oct-2026 07:08:21 | Retrieving artifact ManyLinux228 3.12 Casatestutils for CASASPECS-MASTERBUILDCASALITHGPU-203 using Bamboo server artifact handler |
| 28-Oct-2026 07:08:21 | Artifact [ManyLinux228 3.12 Casatestutils] downloaded successfully in 24.09 ms to wheeldirectory/ |
| 28-Oct-2026 07:08:21 | Preparing to download plan result CASASPECS-MASTERBUILDCASALITHGPU-203 artifact: Non required shared artifact Http Compression On : [ManyLinux228 Python 3.12 Tool wheel], patterns: [casatools*.whl] anchored at: [source/wheels] |
| 28-Oct-2026 07:08:21 | Retrieving artifact ManyLinux228 Python 3.12 Tool wheel for CASASPECS-MASTERBUILDCASALITHGPU-203 using Bamboo server artifact handler |
| 28-Oct-2026 07:08:34 | Artifact [ManyLinux228 Python 3.12 Tool wheel] downloaded successfully in 12.95 s to wheeldirectory/ |
| 28-Oct-2026 07:08:34 | Finished task 'Get wheel from parent build plan' with result: Success |
| 28-Oct-2026 07:08:34 | Starting task 'Stop and remove running wheel-container-test' of type 'com.atlassian.bamboo.plugins.scripttask:task.builder.script' |
| 28-Oct-2026 07:08:34 | Beginning to execute external process for build 'CASASPECS - Master Test GPU 3.12 - Test Tools Many Linux 2.28 Rocky 8.10 Py3.12 #190 (CASASPECS-MASTERTESTGPUPY312-TTOMLPY312-190)' ... running command line: /export/cvpost134-nvme/casa/bamboohome/temp/CASASPECS-MASTERTESTGPUPY312-TTOMLPY312-190-ScriptBuildTask-4864342472377546517.sh ... in: /export/cvpost134-nvme/casa/bamboohome/xml-data/build-dir/CASASPECS-MASTERTESTGPUPY312-TTOMLPY312 |
| 28-Oct-2026 07:08:34 | Error response from daemon: No such container: wheel-container-test |
| 28-Oct-2026 07:08:34 | Error response from daemon: No such container: wheel-container-test |
| 28-Oct-2026 07:08:34 | Removed wheel-container-test |
| 28-Oct-2026 07:08:34 | Finished task 'Stop and remove running wheel-container-test' with result: Success |
| 28-Oct-2026 07:08:34 | Substituting variable: ${bamboo.capability.hostname} with cvpost134 |
| 28-Oct-2026 07:08:34 | Substituting variable: ${bamboo.capability.hostname} with cvpost134 |
| 28-Oct-2026 07:08:34 | Substituting variable: ${bamboo.capability.hostname} with cvpost134 |
| 28-Oct-2026 07:08:34 | Substituting variable: ${bamboo.build.working.directory} with /export/cvpost134-nvme/casa/bamboohome/xml-data/build-dir/CASASPECS-MASTERTESTGPUPY312-TTOMLPY312 |
| 28-Oct-2026 07:08:34 | Starting task 'start docker with conditional arguments' of type 'com.atlassian.bamboo.plugins.scripttask:task.builder.script' |
| 28-Oct-2026 07:08:34 | Beginning to execute external process for build 'CASASPECS - Master Test GPU 3.12 - Test Tools Many Linux 2.28 Rocky 8.10 Py3.12 #190 (CASASPECS-MASTERTESTGPUPY312-TTOMLPY312-190)' ... running command line: /export/cvpost134-nvme/casa/bamboohome/temp/CASASPECS-MASTERTESTGPUPY312-TTOMLPY312-190-ScriptBuildTask-5286667625999911399.sh ... in: /export/cvpost134-nvme/casa/bamboohome/xml-data/build-dir/CASASPECS-MASTERTESTGPUPY312-TTOMLPY312 |
| 28-Oct-2026 07:08:34 | Already up to date. |
| 28-Oct-2026 07:08:34 | Already up to date. |
| 28-Oct-2026 07:08:34 | Data update complete |
| 28-Oct-2026 07:08:52 | d30ab521eb576da3f647f94ca6709cd9d1b1225e574f02074afd989a9a616672 |
| 28-Oct-2026 07:08:56 | CONTAINER ID IMAGE COMMAND CREATED STATUS PORTS NAMES |
| 28-Oct-2026 07:08:56 | d30ab521eb57 casa-docker.nrao.edu:5000/casa-test-rocky-8.10:4 "tail -f /dev/null" 22 seconds ago Up Less than a second wheel-container-test |
| 28-Oct-2026 07:08:56 | e3f4c92a1c32 hello-world "/hello" 3 weeks ago Exited (0) 3 weeks ago suspicious_northcutt |
| 28-Oct-2026 07:08:57 | Wed Oct 28 07:08:57 2026 |
| 28-Oct-2026 07:08:57 | +-----------------------------------------------------------------------------------------+ |
| 28-Oct-2026 07:08:57 | | NVIDIA-SMI 555.42.06 Driver Version: 555.42.06 CUDA Version: 12.5 | |
| 28-Oct-2026 07:08:57 | |-----------------------------------------+------------------------+----------------------+ |
| 28-Oct-2026 07:08:57 | | GPU Name Persistence-M | Bus-Id Disp.A | Volatile Uncorr. ECC | |
| 28-Oct-2026 07:08:57 | | Fan Temp Perf Pwr:Usage/Cap | Memory-Usage | GPU-Util Compute M. | |
| 28-Oct-2026 07:08:57 | | | | MIG M. | |
| 28-Oct-2026 07:08:57 | |=========================================+========================+======================| |
| 28-Oct-2026 07:08:57 | | 0 NVIDIA L4 Off | 00000000:3B:00.0 Off | 0 | |
| 28-Oct-2026 07:08:57 | | N/A 47C P0 28W / 72W | 1MiB / 23034MiB | 1% Default | |
| 28-Oct-2026 07:08:57 | | | | N/A | |
| 28-Oct-2026 07:08:57 | +-----------------------------------------+------------------------+----------------------+ |
| 28-Oct-2026 07:08:57 | |
| 28-Oct-2026 07:08:57 | +-----------------------------------------------------------------------------------------+ |
| 28-Oct-2026 07:08:57 | | Processes: | |
| 28-Oct-2026 07:08:57 | | GPU GI CI PID Type Process name GPU Memory | |
| 28-Oct-2026 07:08:57 | | ID ID Usage | |
| 28-Oct-2026 07:08:57 | |=========================================================================================| |
| 28-Oct-2026 07:08:57 | | No running processes found | |
| 28-Oct-2026 07:08:57 | +-----------------------------------------------------------------------------------------+ |
| 28-Oct-2026 07:08:58 | Finished task 'start docker with conditional arguments' with result: Success |
| 28-Oct-2026 07:08:58 | Substituting variable: ${bamboo.planRepository.branchName} with master |
| 28-Oct-2026 07:08:58 | Starting task 'Test wheel' of type 'com.atlassian.bamboo.plugins.scripttask:task.builder.script' |
| 28-Oct-2026 07:08:58 | Beginning to execute external process for build 'CASASPECS - Master Test GPU 3.12 - Test Tools Many Linux 2.28 Rocky 8.10 Py3.12 #190 (CASASPECS-MASTERTESTGPUPY312-TTOMLPY312-190)' ... running command line: /export/cvpost134-nvme/casa/bamboohome/temp/CASASPECS-MASTERTESTGPUPY312-TTOMLPY312-190-ScriptBuildTask-11318574598882341900.sh ... in: /export/cvpost134-nvme/casa/bamboohome/xml-data/build-dir/CASASPECS-MASTERTESTGPUPY312-TTOMLPY312 |
| 28-Oct-2026 07:08:58 | branch: master |
| 28-Oct-2026 07:08:58 | Python version: 3.12 |
| 28-Oct-2026 07:08:58 | % Total % Received % Xferd Average Speed Time Time Time Current |
| 28-Oct-2026 07:08:58 | Dload Upload Total Spent Left Speed |
| 28-Oct-2026 07:08:58 | |
| 28-Oct-2026 07:08:58 | 0 0 0 0 0 0 0 0 --:--:-- --:--:-- --:--:-- 0 |
| 28-Oct-2026 07:08:58 | 100 6002k 100 6002k 0 0 56.9M 0 --:--:-- --:--:-- --:--:-- 56.9M |
| 28-Oct-2026 07:08:58 | bamboo_jira_components:'' |
| 28-Oct-2026 07:08:58 | bamboo_testlist:'' |
| 28-Oct-2026 07:08:58 | [4018549] Failed to execute script 'atlutil' due to unhandled exception! |
| 28-Oct-2026 07:08:58 | Traceback (most recent call last): |
| 28-Oct-2026 07:08:58 | File "atlutil.py", line 194, in <module> |
| 28-Oct-2026 07:08:58 | File "atlutil.py", line 112, in get_ticket_components |
| 28-Oct-2026 07:08:58 | KeyError: 'fields' |
| 28-Oct-2026 07:08:58 | Ticket components: -j "" |
| 28-Oct-2026 07:08:58 | datapath=[ "/opt/casa/data/master", "/opt/casa/data/casatestdata" ] |
| 28-Oct-2026 07:08:58 | measurespath="/opt/casa/data/master" |
| 28-Oct-2026 07:08:58 | measures_auto_update=False |
| 28-Oct-2026 07:08:58 | data_auto_update=False |
| 28-Oct-2026 07:08:59 | [4018621] Failed to execute script 'atlutil' due to unhandled exception! |
| 28-Oct-2026 07:08:59 | Traceback (most recent call last): |
| 28-Oct-2026 07:08:59 | File "atlutil.py", line 200, in <module> |
| 28-Oct-2026 07:08:59 | File "atlutil.py", line 165, in has_fix_version |
| 28-Oct-2026 07:08:59 | KeyError: 'fields' |
| 28-Oct-2026 07:08:59 | datapath=[ "/opt/casa/data/master", "/opt/casa/data/casatestdata" ] |
| 28-Oct-2026 07:08:59 | measurespath="/opt/casa/data/master" |
| 28-Oct-2026 07:08:59 | measures_auto_update=False |
| 28-Oct-2026 07:08:59 | data_auto_update=False |
| 28-Oct-2026 07:09:02 | Requirement already satisfied: pip in /home/casatest/venv/lib/python3.12/site-packages (24.3.1) |
| 28-Oct-2026 07:09:02 | Collecting pip |
| 28-Oct-2026 07:09:02 | Downloading pip-26.2.2-py3-none-any.whl.metadata (4.6 kB) |
| 28-Oct-2026 07:09:02 | Collecting numpy |
| 28-Oct-2026 07:09:02 | Downloading numpy-2.5.4-cp312-cp312-manylinux_2_27_x86_64.manylinux_2_28_x86_64.whl.metadata (6.6 kB) |
| 28-Oct-2026 07:09:02 | Downloading pip-26.2.2-py3-none-any.whl (1.8 MB) |
| 28-Oct-2026 07:09:02 | ━━━━━━━━━━━━━━━━━━━━━━━━━━━━━━━━━━━━━━━━ 1.8/1.8 MB 45.4 MB/s eta 0:00:00 |
| 28-Oct-2026 07:09:02 | Downloading numpy-2.5.4-cp312-cp312-manylinux_2_27_x86_64.manylinux_2_28_x86_64.whl (16.7 MB) |
| 28-Oct-2026 07:09:02 | ━━━━━━━━━━━━━━━━━━━━━━━━━━━━━━━━━━━━━━━━ 16.7/16.7 MB 66.5 MB/s eta 0:00:00 |
| 28-Oct-2026 07:09:02 | Installing collected packages: pip, numpy |
| 28-Oct-2026 07:09:02 | Attempting uninstall: pip |
| 28-Oct-2026 07:09:02 | Found existing installation: pip 24.3.1 |
| 28-Oct-2026 07:09:03 | Uninstalling pip-24.3.1: |
| 28-Oct-2026 07:09:03 | Successfully uninstalled pip-24.3.1 |
| 28-Oct-2026 07:09:06 | Successfully installed numpy-2.5.4 pip-26.2.2 |
| 28-Oct-2026 07:09:06 | Processing ./casatestutils-6.8.0.2-py3-none-any.whl |
| 28-Oct-2026 07:09:06 | Collecting pytest>=6.0 (from casatestutils==6.8.0.2) |
| 28-Oct-2026 07:09:07 | Downloading pytest-9.2.0-py3-none-any.whl.metadata (7.9 kB) |
| 28-Oct-2026 07:09:07 | Collecting astropy (from casatestutils==6.8.0.2) |
| 28-Oct-2026 07:09:07 | Downloading astropy-8.0.2-cp311-abi3-manylinux2014_x86_64.manylinux_2_17_x86_64.manylinux_2_28_x86_64.whl.metadata (11 kB) |
| 28-Oct-2026 07:09:07 | Collecting iniconfig>=2 (from pytest>=6.0->casatestutils==6.8.0.2) |
| 28-Oct-2026 07:09:07 | Downloading iniconfig-2.3.1-py3-none-any.whl.metadata (2.8 kB) |
| 28-Oct-2026 07:09:07 | Collecting packaging>=24 (from pytest>=6.0->casatestutils==6.8.0.2) |
| 28-Oct-2026 07:09:07 | Downloading packaging-26.3-py3-none-any.whl.metadata (3.5 kB) |
| 28-Oct-2026 07:09:07 | Collecting pluggy<2,>=1.6 (from pytest>=6.0->casatestutils==6.8.0.2) |
| 28-Oct-2026 07:09:07 | Downloading pluggy-1.7.0-py3-none-any.whl.metadata (5.0 kB) |
| 28-Oct-2026 07:09:07 | Collecting pygments>=2.15 (from pytest>=6.0->casatestutils==6.8.0.2) |
| 28-Oct-2026 07:09:07 | Downloading pygments-2.21.0-py3-none-any.whl.metadata (2.5 kB) |
| 28-Oct-2026 07:09:07 | Collecting astropy-iers-data>=0.2026.9.28.0.59.37 (from astropy->casatestutils==6.8.0.2) |
| 28-Oct-2026 07:09:07 | Downloading astropy_iers_data-0.2026.10.19.0.52.1-py3-none-any.whl.metadata (3.4 kB) |
| 28-Oct-2026 07:09:07 | Requirement already satisfied: numpy>=2.0 in /home/casatest/venv/lib/python3.12/site-packages (from astropy->casatestutils==6.8.0.2) (2.5.4) |
| 28-Oct-2026 07:09:07 | Collecting pyerfa>=2.0.1.3 (from astropy->casatestutils==6.8.0.2) |
| 28-Oct-2026 07:09:07 | Downloading pyerfa-2.0.1.5-cp39-abi3-manylinux_2_17_x86_64.manylinux2014_x86_64.whl.metadata (5.7 kB) |
| 28-Oct-2026 07:09:07 | Collecting PyYAML>=6.0.0 (from astropy->casatestutils==6.8.0.2) |
| 28-Oct-2026 07:09:07 | Downloading pyyaml-6.0.3-cp312-cp312-manylinux2014_x86_64.manylinux_2_17_x86_64.manylinux_2_28_x86_64.whl.metadata (2.4 kB) |
| 28-Oct-2026 07:09:07 | Downloading pytest-9.2.0-py3-none-any.whl (411 kB) |
| 28-Oct-2026 07:09:07 | Downloading pluggy-1.7.0-py3-none-any.whl (27 kB) |
| 28-Oct-2026 07:09:07 | Downloading iniconfig-2.3.1-py3-none-any.whl (7.6 kB) |
| 28-Oct-2026 07:09:07 | Downloading packaging-26.3-py3-none-any.whl (129 kB) |
| 28-Oct-2026 07:09:07 | Downloading pygments-2.21.0-py3-none-any.whl (1.3 MB) |
| 28-Oct-2026 07:09:07 | ━━━━━━━━━━━━━━━━━━━━━━━━━━━━━━━━━━━━━━━━ 1.3/1.3 MB 30.5 MB/s 0:00:00 |
| 28-Oct-2026 07:09:07 | Downloading astropy-8.0.2-cp311-abi3-manylinux2014_x86_64.manylinux_2_17_x86_64.manylinux_2_28_x86_64.whl (10.4 MB) |
| 28-Oct-2026 07:09:08 | ━━━━━━━━━━━━━━━━━━━━━━━━━━━━━━━━━━━━━━━━ 10.4/10.4 MB 35.4 MB/s 0:00:00 |
| 28-Oct-2026 07:09:08 | Downloading astropy_iers_data-0.2026.10.19.0.52.1-py3-none-any.whl (2.0 MB) |
| 28-Oct-2026 07:09:08 | ━━━━━━━━━━━━━━━━━━━━━━━━━━━━━━━━━━━━━━━━ 2.0/2.0 MB 44.5 MB/s 0:00:00 |
| 28-Oct-2026 07:09:08 | Downloading pyerfa-2.0.1.5-cp39-abi3-manylinux_2_17_x86_64.manylinux2014_x86_64.whl (738 kB) |
| 28-Oct-2026 07:09:08 | ━━━━━━━━━━━━━━━━━━━━━━━━━━━━━━━━━━━━━━━━ 738.7/738.7 kB 20.3 MB/s 0:00:00 |
| 28-Oct-2026 07:09:08 | Downloading pyyaml-6.0.3-cp312-cp312-manylinux2014_x86_64.manylinux_2_17_x86_64.manylinux_2_28_x86_64.whl (807 kB) |
| 28-Oct-2026 07:09:08 | ━━━━━━━━━━━━━━━━━━━━━━━━━━━━━━━━━━━━━━━━ 807.9/807.9 kB 18.5 MB/s 0:00:00 |
| 28-Oct-2026 07:09:08 | Installing collected packages: PyYAML, pygments, pyerfa, pluggy, packaging, iniconfig, astropy-iers-data, pytest, astropy, casatestutils |
| 28-Oct-2026 07:09:13 | |
| 28-Oct-2026 07:09:13 | Successfully installed PyYAML-6.0.3 astropy-8.0.2 astropy-iers-data-0.2026.10.19.0.52.1 casatestutils-6.8.0.2 iniconfig-2.3.1 packaging-26.3 pluggy-1.7.0 pyerfa-2.0.1.5 pygments-2.21.0 pytest-9.2.0 |
| 28-Oct-2026 07:09:13 | Processing ./casatools-6.8.0.2-cp312-cp312-manylinux_2_28_x86_64.whl |
| 28-Oct-2026 07:09:14 | Requirement already satisfied: numpy in /home/casatest/venv/lib/python3.12/site-packages (from casatools==6.8.0.2) (2.5.4) |
| 28-Oct-2026 07:09:14 | Collecting casaconfig (from casatools==6.8.0.2) |
| 28-Oct-2026 07:09:14 | Downloading casaconfig-1.5.2-py3-none-any.whl.metadata (4.0 kB) |
| 28-Oct-2026 07:09:14 | Collecting certifi>=2023.5.7 (from casaconfig->casatools==6.8.0.2) |
| 28-Oct-2026 07:09:14 | Downloading certifi-2026.10.23-py3-none-any.whl.metadata (2.5 kB) |
| 28-Oct-2026 07:09:14 | Downloading casaconfig-1.5.2-py3-none-any.whl (77 kB) |
| 28-Oct-2026 07:09:14 | Downloading certifi-2026.10.23-py3-none-any.whl (135 kB) |
| 28-Oct-2026 07:09:14 | Installing collected packages: certifi, casaconfig, casatools |
| 28-Oct-2026 07:09:18 | |
| 28-Oct-2026 07:09:18 | Successfully installed casaconfig-1.5.2 casatools-6.8.0.2 certifi-2026.10.23 |
| 28-Oct-2026 07:10:56 | Already on 'master' |
| 28-Oct-2026 07:10:56 | Your branch is up to date with 'origin/master'. |
| 28-Oct-2026 07:10:57 | % Total % Received % Xferd Average Speed Time Time Time Current |
| 28-Oct-2026 07:10:57 | Dload Upload Total Spent Left Speed |
| 28-Oct-2026 07:10:57 | |
| 28-Oct-2026 07:10:57 | 0 0 0 0 0 0 0 0 --:--:-- --:--:-- --:--:-- 0 |
| 28-Oct-2026 07:10:57 | 100 669 0 669 0 0 44600 0 --:--:-- --:--:-- --:--:-- 44600 |
| 28-Oct-2026 07:11:10 | ============================= test session starts ============================== |
| 28-Oct-2026 07:11:10 | platform linux -- Python 3.12.9, pytest-9.2.0, pluggy-1.7.0 -- /home/casatest/venv/bin/python3.12 |
| 28-Oct-2026 07:11:10 | cachedir: .pytest_cache |
| 28-Oct-2026 07:11:10 | rootdir: /home/casatest/casa6/casatestutils/nosedir/test_tool_agentflagger |
| 28-Oct-2026 07:11:10 | configfile: pytest.ini |
| 28-Oct-2026 07:11:10 | collecting ... collected 35 items |
| 28-Oct-2026 07:11:10 | INTERNALERROR> Traceback (most recent call last): |
| 28-Oct-2026 07:11:10 | INTERNALERROR> File "/home/casatest/venv/lib/python3.12/site-packages/_pytest/main.py", line 333, in wrap_session |
| 28-Oct-2026 07:11:10 | INTERNALERROR> session.exitstatus = doit(config, session) or 0 |
| 28-Oct-2026 07:11:10 | INTERNALERROR> ^^^^^^^^^^^^^^^^^^^^^ |
| 28-Oct-2026 07:11:10 | INTERNALERROR> File "/home/casatest/venv/lib/python3.12/site-packages/_pytest/main.py", line 387, in _main |
| 28-Oct-2026 07:11:10 | INTERNALERROR> config.hook.pytest_runtestloop(session=session) |
| 28-Oct-2026 07:11:10 | INTERNALERROR> File "/home/casatest/venv/lib/python3.12/site-packages/pluggy/_caller.py", line 197, in __call__ |
| 28-Oct-2026 07:11:10 | INTERNALERROR> return self._hookexec( |
| 28-Oct-2026 07:11:10 | INTERNALERROR> ^^^^^^^^^^^^^^^ |
| 28-Oct-2026 07:11:10 | INTERNALERROR> File "/home/casatest/venv/lib/python3.12/site-packages/pluggy/_manager.py", line 183, in _hookexec |
| 28-Oct-2026 07:11:10 | INTERNALERROR> return self._inner_hookexec(hook_name, methods, kwargs, firstresult) |
| 28-Oct-2026 07:11:10 | INTERNALERROR> ^^^^^^^^^^^^^^^^^^^^^^^^^^^^^^^^^^^^^^^^^^^^^^^^^^^^^^^^^^^^^ |
| 28-Oct-2026 07:11:10 | INTERNALERROR> File "/home/casatest/venv/lib/python3.12/site-packages/pluggy/_execution.py", line 195, in _multicall |
| 28-Oct-2026 07:11:10 | INTERNALERROR> raise exception |
| 28-Oct-2026 07:11:10 | INTERNALERROR> File "/home/casatest/venv/lib/python3.12/site-packages/pluggy/_execution.py", line 167, in _multicall |
| 28-Oct-2026 07:11:10 | INTERNALERROR> teardown.throw(exception) |
| 28-Oct-2026 07:11:10 | INTERNALERROR> File "/home/casatest/venv/lib/python3.12/site-packages/_pytest/logging.py", line 829, in pytest_runtestloop |
| 28-Oct-2026 07:11:10 | INTERNALERROR> return (yield) # Run all the tests. |
| 28-Oct-2026 07:11:10 | INTERNALERROR> ^^^^^ |
| 28-Oct-2026 07:11:10 | INTERNALERROR> File "/home/casatest/venv/lib/python3.12/site-packages/pluggy/_execution.py", line 167, in _multicall |
| 28-Oct-2026 07:11:10 | INTERNALERROR> teardown.throw(exception) |
| 28-Oct-2026 07:11:10 | INTERNALERROR> File "/home/casatest/venv/lib/python3.12/site-packages/_pytest/terminal.py", line 723, in pytest_runtestloop |
| 28-Oct-2026 07:11:10 | INTERNALERROR> result = yield |
| 28-Oct-2026 07:11:10 | INTERNALERROR> ^^^^^ |
| 28-Oct-2026 07:11:10 | INTERNALERROR> File "/home/casatest/venv/lib/python3.12/site-packages/pluggy/_execution.py", line 147, in _multicall |
| 28-Oct-2026 07:11:10 | INTERNALERROR> res = hook_impl.function(*args) |
| 28-Oct-2026 07:11:10 | INTERNALERROR> ^^^^^^^^^^^^^^^^^^^^^^^^^ |
| 28-Oct-2026 07:11:10 | INTERNALERROR> File "/home/casatest/venv/lib/python3.12/site-packages/_pytest/main.py", line 411, in pytest_runtestloop |
| 28-Oct-2026 07:11:10 | INTERNALERROR> item.config.hook.pytest_runtest_protocol(item=item, nextitem=nextitem) |
| 28-Oct-2026 07:11:10 | INTERNALERROR> File "/home/casatest/venv/lib/python3.12/site-packages/pluggy/_caller.py", line 197, in __call__ |
| 28-Oct-2026 07:11:10 | INTERNALERROR> return self._hookexec( |
| 28-Oct-2026 07:11:10 | INTERNALERROR> ^^^^^^^^^^^^^^^ |
| 28-Oct-2026 07:11:10 | INTERNALERROR> File "/home/casatest/venv/lib/python3.12/site-packages/pluggy/_manager.py", line 183, in _hookexec |
| 28-Oct-2026 07:11:10 | INTERNALERROR> return self._inner_hookexec(hook_name, methods, kwargs, firstresult) |
| 28-Oct-2026 07:11:10 | INTERNALERROR> ^^^^^^^^^^^^^^^^^^^^^^^^^^^^^^^^^^^^^^^^^^^^^^^^^^^^^^^^^^^^^ |
| 28-Oct-2026 07:11:10 | INTERNALERROR> File "/home/casatest/venv/lib/python3.12/site-packages/pluggy/_execution.py", line 195, in _multicall |
| 28-Oct-2026 07:11:10 | INTERNALERROR> raise exception |
| 28-Oct-2026 07:11:10 | INTERNALERROR> File "/home/casatest/venv/lib/python3.12/site-packages/pluggy/_execution.py", line 167, in _multicall |
| 28-Oct-2026 07:11:10 | INTERNALERROR> teardown.throw(exception) |
| 28-Oct-2026 07:11:10 | INTERNALERROR> File "/home/casatest/venv/lib/python3.12/site-packages/_pytest/warnings.py", line 75, in pytest_runtest_protocol |
| 28-Oct-2026 07:11:10 | INTERNALERROR> return (yield) |
| 28-Oct-2026 07:11:10 | INTERNALERROR> ^^^^^ |
| 28-Oct-2026 07:11:10 | INTERNALERROR> File "/home/casatest/venv/lib/python3.12/site-packages/pluggy/_execution.py", line 167, in _multicall |
| 28-Oct-2026 07:11:10 | INTERNALERROR> teardown.throw(exception) |
| 28-Oct-2026 07:11:10 | INTERNALERROR> File "/home/casatest/venv/lib/python3.12/site-packages/_pytest/assertion/__init__.py", line 212, in pytest_runtest_protocol |
| 28-Oct-2026 07:11:10 | INTERNALERROR> return (yield) |
| 28-Oct-2026 07:11:10 | INTERNALERROR> ^^^^^ |
| 28-Oct-2026 07:11:10 | INTERNALERROR> File "/home/casatest/venv/lib/python3.12/site-packages/pluggy/_execution.py", line 167, in _multicall |
| 28-Oct-2026 07:11:10 | INTERNALERROR> teardown.throw(exception) |
| 28-Oct-2026 07:11:10 | INTERNALERROR> File "/home/casatest/venv/lib/python3.12/site-packages/_pytest/unittest.py", line 610, in pytest_runtest_protocol |
| 28-Oct-2026 07:11:10 | INTERNALERROR> return (yield) |
| 28-Oct-2026 07:11:10 | INTERNALERROR> ^^^^^ |
| 28-Oct-2026 07:11:10 | INTERNALERROR> File "/home/casatest/venv/lib/python3.12/site-packages/pluggy/_execution.py", line 167, in _multicall |
| 28-Oct-2026 07:11:10 | INTERNALERROR> teardown.throw(exception) |
| 28-Oct-2026 07:11:10 | INTERNALERROR> File "/home/casatest/venv/lib/python3.12/site-packages/_pytest/faulthandler.py", line 102, in pytest_runtest_protocol |
| 28-Oct-2026 07:11:10 | INTERNALERROR> return (yield) |
| 28-Oct-2026 07:11:10 | INTERNALERROR> ^^^^^ |
| 28-Oct-2026 07:11:10 | INTERNALERROR> File "/home/casatest/venv/lib/python3.12/site-packages/pluggy/_execution.py", line 147, in _multicall |
| 28-Oct-2026 07:11:10 | INTERNALERROR> res = hook_impl.function(*args) |
| 28-Oct-2026 07:11:10 | INTERNALERROR> ^^^^^^^^^^^^^^^^^^^^^^^^^ |
| 28-Oct-2026 07:11:10 | INTERNALERROR> File "/home/casatest/casa6/casatestutils/nosedir/test_tool_agentflagger/conftest.py", line 24, in pytest_runtest_protocol |
| 28-Oct-2026 07:11:10 | INTERNALERROR> self.funcn = item._nodeid |
| 28-Oct-2026 07:11:10 | INTERNALERROR> ^^^^^^^^^^^^ |
| 28-Oct-2026 07:11:10 | INTERNALERROR> AttributeError: 'TestCaseFunction' object has no attribute '_nodeid'. Did you mean: 'nodeid'? |
| 28-Oct-2026 07:11:10 | |
| 28-Oct-2026 07:11:10 | ============================== 1 warning in 0.40s ============================== |
| 28-Oct-2026 07:11:10 | Traceback (most recent call last): |
| 28-Oct-2026 07:11:10 | File "/home/casatest/casa6/casatestutils/runtest.py", line 1526, in <module> |
| 28-Oct-2026 07:11:10 | run( |
| 28-Oct-2026 07:11:10 | File "/home/casatest/casa6/casatestutils/runtest.py", line 1135, in run |
| 28-Oct-2026 07:11:10 | setup_and_run(cmd, workdir, workpath, dirname, DRY_RUN , pytest_args) |
| 28-Oct-2026 07:11:10 | File "/home/casatest/casa6/casatestutils/runtest.py", line 1016, in setup_and_run |
| 28-Oct-2026 07:11:10 | update_xml(xmlfile, result, name=os.getcwd().split("/")[-1]) |
| 28-Oct-2026 07:11:10 | File "/home/casatest/casa6/casatestutils/runtest.py", line 581, in update_xml |
| 28-Oct-2026 07:11:10 | testclass = element.attrib["classname"].split(".")[1] |
| 28-Oct-2026 07:11:10 | ~~~~~~~~~~~~~~~~~~~~~~~~~~~~~~~~~~~~~~^^^ |
| 28-Oct-2026 07:11:10 | IndexError: list index out of range |
| 28-Oct-2026 07:11:10 | Namespace(list=False, verbose=False, dry_run=False, classes=None, file=None, mapfile=<_io.TextIOWrapper name='/home/casatest/casa6/casatestutils/casatestutils/component_to_test_map.json' mode='r' encoding='utf-8'>, branch='master', merge_target=None, pkg=None, work_dir=None, ncores=2, test_paths=None, test_list=None, test_config=None, test_group='casatools', pmode=None, bamboo=False, cachedir=None, ignore_list=None, run_skipped=False, only_skipped=False) |
| 28-Oct-2026 07:11:10 | |
| 28-Oct-2026 07:11:10 | Operating system: Linux |
| 28-Oct-2026 07:11:10 | |
| 28-Oct-2026 07:11:10 | Testing Components['casatools'] |
| 28-Oct-2026 07:11:10 | |
| 28-Oct-2026 07:11:10 | Arguments Sent Direct To Pytest : [] |
| 28-Oct-2026 07:11:10 | Running 33 Test(s) |
| 28-Oct-2026 07:11:10 | Cleaning: /home/casatest/casa6/casatestutils/nosedir/ |
| 28-Oct-2026 07:11:10 | Tests: ['test_tool_agentflagger', 'test_tool_calanalysis', 'test_tool_calibrater', 'test_tool_componentlist', 'test_tool_coordsys', 'test_tool_image', 'test_tool_image_collapse', 'test_tool_image_deviation', 'test_tool_image_fitprofile', 'test_tool_image_pbcor', 'test_tool_image_pv', 'test_tool_image_rebin', 'test_tool_image_regrid', 'test_tool_image_statistics', 'test_tool_image_subimage', 'test_tool_image_transpose', 'test_tool_imagepol', 'test_tool_linearmosaic', 'test_tool_logsink', 'test_tool_measures', 'test_tool_ms', 'test_tool_ms_createmultims', 'test_tool_ms_statwt', 'test_tool_msmetadata', 'test_tool_msuvbinner', 'test_tool_quanta', 'test_tool_regionmanager', 'test_tool_sdm', 'test_tool_sdm_toms', 'test_tool_simulator', 'test_tool_synthesisutils', 'test_tool_table', 'test_tool_vpmanager'] |
| 28-Oct-2026 07:11:10 | Fetching Repository: casa6 |
| 28-Oct-2026 07:11:10 | Running: git clone https://open-bitbucket.nrao.edu/scm/casa/casa6 |
| 28-Oct-2026 07:11:10 | Running: git checkout origin/master |
| 28-Oct-2026 07:11:10 | |
| 28-Oct-2026 07:11:10 | Fetching Repository: casampi |
| 28-Oct-2026 07:11:10 | Running: git clone https://open-bitbucket.nrao.edu/scm/casa/casampi |
| 28-Oct-2026 07:11:10 | Tag: tags/0.6.0 |
| 28-Oct-2026 07:11:10 | Running: git checkout tags/0.6.0 |
| 28-Oct-2026 07:11:10 | |
| 28-Oct-2026 07:11:10 | Fetching Repository: casaplotms |
| 28-Oct-2026 07:11:10 | Running: git clone https://open-bitbucket.nrao.edu/scm/casa/casaplotms |
| 28-Oct-2026 07:11:10 | Tag: tags/3.0.3 |
| 28-Oct-2026 07:11:10 | Running: git checkout tags/3.0.3 |
| 28-Oct-2026 07:11:10 | |
| 28-Oct-2026 07:11:10 | Fetching Repository: casaviewer |
| 28-Oct-2026 07:11:10 | Running: git clone https://open-bitbucket.nrao.edu/scm/casa/casaviewer |
| 28-Oct-2026 07:11:10 | Tag: tags/2.5.1 |
| 28-Oct-2026 07:11:10 | Running: git checkout tags/2.5.1 |
| 28-Oct-2026 07:11:10 | Directory Of Tests: /home/casatest/casa6/casatestutils/nosedir/tests/ |
| 28-Oct-2026 07:11:10 | |
| 28-Oct-2026 07:11:10 | Setting Working Directory: /home/casatest/casa6/casatestutils/nosedir/test_tool_agentflagger/ |
| 28-Oct-2026 07:11:10 | Test Directory: /home/casatest/casa6/casatestutils/nosedir/test_tool_agentflagger |
| 28-Oct-2026 07:11:10 | |
| 28-Oct-2026 07:11:10 | Running Command: pytest --junitxml=/home/casatest/casa6/casatestutils/nosedir/xml/test_tool_agentflagger/nose.xml -s --disable-pytest-warnings --verbose -ra --tb=short /home/casatest/casa6/casatestutils/nosedir/test_tool_agentflagger/ |
| 28-Oct-2026 07:11:11 | total 290856 |
| 28-Oct-2026 07:11:11 | -rw-r--r-- 1 casaci 15001 161031 Oct 28 07:08 casatestutils-6.8.0.2-py3-none-any.whl |
| 28-Oct-2026 07:11:11 | -rw-r--r-- 1 casaci 15001 297661657 Oct 28 07:08 casatools-6.8.0.2-cp312-cp312-manylinux_2_28_x86_64.whl |
| 28-Oct-2026 07:11:11 | -rw-r--r-- 1 casaci root 4362 Oct 28 07:11 test_tool_agentflagger.xml |
| 28-Oct-2026 07:11:11 | Finished task 'Test wheel' with result: Success |
| 28-Oct-2026 07:11:11 | Starting task 'Tar work directory' of type 'com.atlassian.bamboo.plugins.scripttask:task.builder.script' |
| 28-Oct-2026 07:11:11 | Beginning to execute external process for build 'CASASPECS - Master Test GPU 3.12 - Test Tools Many Linux 2.28 Rocky 8.10 Py3.12 #190 (CASASPECS-MASTERTESTGPUPY312-TTOMLPY312-190)' ... running command line: /export/cvpost134-nvme/casa/bamboohome/temp/CASASPECS-MASTERTESTGPUPY312-TTOMLPY312-190-ScriptBuildTask-7136024740435762315.sh ... in: /export/cvpost134-nvme/casa/bamboohome/xml-data/build-dir/CASASPECS-MASTERTESTGPUPY312-TTOMLPY312 |
| 28-Oct-2026 07:11:11 | Package working directory |
| 28-Oct-2026 07:11:11 | tar: work: Cannot stat: No such file or directory |
| 28-Oct-2026 07:11:11 | tar: Exiting with failure status due to previous errors |
| 28-Oct-2026 07:11:11 | total 290860 |
| 28-Oct-2026 07:11:11 | -rw-r--r-- 1 casaci 15001 161031 Oct 28 07:08 casatestutils-6.8.0.2-py3-none-any.whl |
| 28-Oct-2026 07:11:11 | -rw-r--r-- 1 casaci 15001 297661657 Oct 28 07:08 casatools-6.8.0.2-cp312-cp312-manylinux_2_28_x86_64.whl |
| 28-Oct-2026 07:11:11 | -rw-r--r-- 1 casaci root 4362 Oct 28 07:11 test_tool_agentflagger.xml |
| 28-Oct-2026 07:11:11 | -rw-r--r-- 1 casaci root 45 Oct 28 07:11 work-manylinux_228_casatools-3.12.tar.gz |
| 28-Oct-2026 07:11:11 | Done packaging working directory |
| 28-Oct-2026 07:11:11 | Finished task 'Tar work directory' with result: Success |
| 28-Oct-2026 07:11:11 | Starting task 'Parse tests' of type 'com.atlassian.bamboo.plugins.testresultparser:task.testresultparser.junit' |
| 28-Oct-2026 07:11:11 | Parsing test results under /export/cvpost134-nvme/casa/bamboohome/xml-data/build-dir/CASASPECS-MASTERTESTGPUPY312-TTOMLPY312... |
| 28-Oct-2026 07:11:11 | Failing task since 1 failing test cases were found. |
| 28-Oct-2026 07:11:11 | Finished task 'Parse tests' with result: Failed |
| 28-Oct-2026 07:11:11 | Starting task 'Cleanup' of type 'com.atlassian.bamboo.plugins.scripttask:task.builder.script' |
| 28-Oct-2026 07:11:11 | Beginning to execute external process for build 'CASASPECS - Master Test GPU 3.12 - Test Tools Many Linux 2.28 Rocky 8.10 Py3.12 #190 (CASASPECS-MASTERTESTGPUPY312-TTOMLPY312-190)' ... running command line: /export/cvpost134-nvme/casa/bamboohome/temp/CASASPECS-MASTERTESTGPUPY312-TTOMLPY312-190-ScriptBuildTask-8275276493373541248.sh ... in: /export/cvpost134-nvme/casa/bamboohome/xml-data/build-dir/CASASPECS-MASTERTESTGPUPY312-TTOMLPY312 |
| 28-Oct-2026 07:11:11 | Starting cleanup |
| 28-Oct-2026 07:11:21 | wheel-container-test |
| 28-Oct-2026 07:11:26 | wheel-container-test |
| 28-Oct-2026 07:11:26 | Cleanup complete |
| 28-Oct-2026 07:11:26 | Finished task 'Cleanup' with result: Success |
| 28-Oct-2026 07:11:26 | Running post build plugin 'Docker Container Cleanup' |
| 28-Oct-2026 07:11:26 | Running post build plugin 'NCover Results Collector' |
| 28-Oct-2026 07:11:26 | Running post build plugin 'Build Results Label Collector' |
| 28-Oct-2026 07:11:26 | Running post build plugin 'Clover Results Collector' |
| 28-Oct-2026 07:11:26 | Running post build plugin 'npm Cache Cleanup' |
| 28-Oct-2026 07:11:26 | Running post build plugin 'Artifact Copier' |
| 28-Oct-2026 07:11:26 | Publishing an artifact: Workdir |
| 28-Oct-2026 07:11:26 | Finished publishing of artifact Non required job artifact Http Compression On : [Workdir], patterns: [work*.tar.gz] anchored at: [wheeldirectory/] in 55.18 ms |
| 28-Oct-2026 07:11:26 | Publishing an artifact: Tests |
| 28-Oct-2026 07:11:26 | Finished publishing of artifact Non required job artifact Http Compression On : [Tests], patterns: [*.xml] anchored at: [wheeldirectory/] in 24.86 ms |
| 28-Oct-2026 07:11:26 | Publishing an artifact: xml Directories |
| 28-Oct-2026 07:11:26 | Finished publishing of artifact Non required job artifact Http Compression On : [xml Directories], patterns: [**/*.xml] anchored at: [wheeldirectory/] in 14.46 ms |
| 28-Oct-2026 07:11:26 | Finalising the build... |
| 28-Oct-2026 07:11:26 | Stopping timer. |
| 28-Oct-2026 07:11:26 | Build CASASPECS-MASTERTESTGPUPY312-TTOMLPY312-190 completed. |
| 28-Oct-2026 03:11:26 | Running on server: post build plugin 'Build Hanging Detection Configuration' |
| 28-Oct-2026 03:11:26 | Running on server: post build plugin 'NCover Results Collector' |
| 28-Oct-2026 03:11:26 | Running on server: post build plugin 'Build Labeller' |
| 28-Oct-2026 03:11:26 | Running on server: post build plugin 'Clover Delta Calculator' |
| 28-Oct-2026 03:11:26 | Running on server: post build plugin 'Maven Dependencies Postprocessor' |
| 28-Oct-2026 03:11:26 | All post build plugins have finished |
| 28-Oct-2026 03:11:26 | Generating build results summary... |
| 28-Oct-2026 03:11:26 | Saving build results to disk... |
| 28-Oct-2026 03:11:26 | Store variable context... |
| 28-Oct-2026 03:11:26 | Finished building CASASPECS-MASTERTESTGPUPY312-TTOMLPY312-190. |