Build: #190 failed
Job: Test Casalith Many Linux 2.28 Py3.12 was successful
Job result summary
- Completed
- Duration
- 21 minutes
- Agent
- cvpost134.cv.nrao.edu
- Revision
-
188b64ce030a360ced17720a68d5af3bbcffaf87
- Total tests
- 4
- Successful since
- #178 ()
Tests
- 4 tests in total
- 16 minutes taken in total.
Error summary
The build generated some errors. See the full build log for more details.
% Total % Received % Xferd Average Speed Time Time Time Current
Dload Upload Total Spent Left Speed
0 0 0 0 0 0 0 0 --:--:-- --:--:-- --:--:-- 0
100 6002k 100 6002k 0 0 58.6M 0 --:--:-- --:--:-- --:--:-- 58.6M
[4023038] Failed to execute script 'atlutil' due to unhandled exception!
Traceback (most recent call last):
File "atlutil.py", line 200, in <module>
File "atlutil.py", line 165, in has_fix_version
KeyError: 'fields'
% Total % Received % Xferd Average Speed Time Time Time Current
Dload Upload Total Spent Left Speed
0 0 0 0 0 0 0 0 --:--:-- --:--:-- --:--:-- 0
100 6002k 100 6002k 0 0 65.1M 0 --:--:-- --:--:-- --:--:-- 65.1M
[4023380] Failed to execute script 'atlutil' due to unhandled exception!
Traceback (most recent call last):
File "atlutil.py", line 194, in <module>
File "atlutil.py", line 112, in get_ticket_components
KeyError: 'fields'
Cloning into 'casa6'...
Updating files: 43% (2851/6550)
Updating files: 44% (2882/6550)
Updating files: 45% (2948/6550)
Updating files: 46% (3013/6550)
Updating files: 47% (3079/6550)
Updating files: 48% (3144/6550)
Updating files: 49% (3210/6550)
Updating files: 50% (3275/6550)
Updating files: 51% (3341/6550)
Updating files: 52% (3406/6550)
Updating files: 53% (3472/6550)
Updating files: 54% (3537/6550)
Updating files: 55% (3603/6550)
Updating files: 56% (3668/6550)
Updating files: 57% (3734/6550)
Updating files: 58% (3799/6550)
Updating files: 59% (3865/6550)
Updating files: 60% (3930/6550)
Updating files: 61% (3996/6550)
Updating files: 62% (4061/6550)
Updating files: 63% (4127/6550)
Updating files: 64% (4192/6550)
Updating files: 65% (4258/6550)
Updating files: 66% (4323/6550)
Updating files: 67% (4389/6550)
Updating files: 68% (4454/6550)
Updating files: 69% (4520/6550)
Updating files: 70% (4585/6550)
Updating files: 71% (4651/6550)
Updating files: 72% (4716/6550)
Updating files: 73% (4782/6550)
Updating files: 74% (4847/6550)
Updating files: 75% (4913/6550)
Updating files: 76% (4978/6550)
Updating files: 77% (5044/6550)
Updating files: 78% (5109/6550)
Updating files: 79% (5175/6550)
Updating files: 80% (5240/6550)
Updating files: 81% (5306/6550)
Updating files: 82% (5371/6550)
Updating files: 83% (5437/6550)
Updating files: 84% (5502/6550)
Updating files: 85% (5568/6550)
Updating files: 86% (5633/6550)
Updating files: 86% (5662/6550)
Updating files: 87% (5699/6550)
Updating files: 88% (5764/6550)
Updating files: 89% (5830/6550)
Updating files: 90% (5895/6550)
Updating files: 91% (5961/6550)
Updating files: 92% (6026/6550)
Updating files: 93% (6092/6550)
Updating files: 94% (6157/6550)
Updating files: 95% (6223/6550)
Updating files: 96% (6288/6550)
Updating files: 97% (6354/6550)
Updating files: 98% (6419/6550)
Updating files: 99% (6485/6550)
Updating files: 100% (6550/6550)
Updating files: 100% (6550/6550), done.
Already on 'master'
% Total % Received % Xferd Average Speed Time Time Time Current
Dload Upload Total Spent Left Speed
0 0 0 0 0 0 0 0 --:--:-- --:--:-- --:--:-- 0
100 669 0 669 0 0 33450 0 --:--:-- --:--:-- --:--:-- 33450
find: './proc/113/task/113/net': Invalid argument
find: './proc/113/net': Invalid argument
find: './proc/242/task/242/net': Invalid argument
find: './proc/242/net': Invalid argument
find: './proc/296/task/296/net': Invalid argument
find: './proc/296/net': Invalid argument
find: './proc/297/task/297/net': Invalid argument
find: './proc/297/net': Invalid argument
find: './proc/298/task/298/net': Invalid argument
find: './proc/298/net': Invalid argument
find: './proc/699/task/699/net': Invalid argument
find: './proc/699/net': Invalid argument
find: './proc/703/task/703/net': Invalid argument
find: './proc/703/net': Invalid argument
find: './proc/832/task/832/net': Invalid argument
find: './proc/832/net': Invalid argument
find: './proc/836/task/836/net': Invalid argument
find: './proc/836/net': Invalid argument
find: './proc/969/task/969/net': Invalid argument
find: './proc/969/net': Invalid argument
Dload Upload Total Spent Left Speed
0 0 0 0 0 0 0 0 --:--:-- --:--:-- --:--:-- 0
100 6002k 100 6002k 0 0 58.6M 0 --:--:-- --:--:-- --:--:-- 58.6M
[4023038] Failed to execute script 'atlutil' due to unhandled exception!
Traceback (most recent call last):
File "atlutil.py", line 200, in <module>
File "atlutil.py", line 165, in has_fix_version
KeyError: 'fields'
% Total % Received % Xferd Average Speed Time Time Time Current
Dload Upload Total Spent Left Speed
0 0 0 0 0 0 0 0 --:--:-- --:--:-- --:--:-- 0
100 6002k 100 6002k 0 0 65.1M 0 --:--:-- --:--:-- --:--:-- 65.1M
[4023380] Failed to execute script 'atlutil' due to unhandled exception!
Traceback (most recent call last):
File "atlutil.py", line 194, in <module>
File "atlutil.py", line 112, in get_ticket_components
KeyError: 'fields'
Cloning into 'casa6'...
Updating files: 43% (2851/6550)
Updating files: 44% (2882/6550)
Updating files: 45% (2948/6550)
Updating files: 46% (3013/6550)
Updating files: 47% (3079/6550)
Updating files: 48% (3144/6550)
Updating files: 49% (3210/6550)
Updating files: 50% (3275/6550)
Updating files: 51% (3341/6550)
Updating files: 52% (3406/6550)
Updating files: 53% (3472/6550)
Updating files: 54% (3537/6550)
Updating files: 55% (3603/6550)
Updating files: 56% (3668/6550)
Updating files: 57% (3734/6550)
Updating files: 58% (3799/6550)
Updating files: 59% (3865/6550)
Updating files: 60% (3930/6550)
Updating files: 61% (3996/6550)
Updating files: 62% (4061/6550)
Updating files: 63% (4127/6550)
Updating files: 64% (4192/6550)
Updating files: 65% (4258/6550)
Updating files: 66% (4323/6550)
Updating files: 67% (4389/6550)
Updating files: 68% (4454/6550)
Updating files: 69% (4520/6550)
Updating files: 70% (4585/6550)
Updating files: 71% (4651/6550)
Updating files: 72% (4716/6550)
Updating files: 73% (4782/6550)
Updating files: 74% (4847/6550)
Updating files: 75% (4913/6550)
Updating files: 76% (4978/6550)
Updating files: 77% (5044/6550)
Updating files: 78% (5109/6550)
Updating files: 79% (5175/6550)
Updating files: 80% (5240/6550)
Updating files: 81% (5306/6550)
Updating files: 82% (5371/6550)
Updating files: 83% (5437/6550)
Updating files: 84% (5502/6550)
Updating files: 85% (5568/6550)
Updating files: 86% (5633/6550)
Updating files: 86% (5662/6550)
Updating files: 87% (5699/6550)
Updating files: 88% (5764/6550)
Updating files: 89% (5830/6550)
Updating files: 90% (5895/6550)
Updating files: 91% (5961/6550)
Updating files: 92% (6026/6550)
Updating files: 93% (6092/6550)
Updating files: 94% (6157/6550)
Updating files: 95% (6223/6550)
Updating files: 96% (6288/6550)
Updating files: 97% (6354/6550)
Updating files: 98% (6419/6550)
Updating files: 99% (6485/6550)
Updating files: 100% (6550/6550)
Updating files: 100% (6550/6550), done.
Already on 'master'
% Total % Received % Xferd Average Speed Time Time Time Current
Dload Upload Total Spent Left Speed
0 0 0 0 0 0 0 0 --:--:-- --:--:-- --:--:-- 0
100 669 0 669 0 0 33450 0 --:--:-- --:--:-- --:--:-- 33450
find: './proc/113/task/113/net': Invalid argument
find: './proc/113/net': Invalid argument
find: './proc/242/task/242/net': Invalid argument
find: './proc/242/net': Invalid argument
find: './proc/296/task/296/net': Invalid argument
find: './proc/296/net': Invalid argument
find: './proc/297/task/297/net': Invalid argument
find: './proc/297/net': Invalid argument
find: './proc/298/task/298/net': Invalid argument
find: './proc/298/net': Invalid argument
find: './proc/699/task/699/net': Invalid argument
find: './proc/699/net': Invalid argument
find: './proc/703/task/703/net': Invalid argument
find: './proc/703/net': Invalid argument
find: './proc/832/task/832/net': Invalid argument
find: './proc/832/net': Invalid argument
find: './proc/836/task/836/net': Invalid argument
find: './proc/836/net': Invalid argument
find: './proc/969/task/969/net': Invalid argument
find: './proc/969/net': Invalid argument