Build: #294 failed
Job: Test Tasks Many Linux 2.34 CasaShell Rocky 9.5 failed
Job result summary
- Completed
- Duration
- 804 minutes
- Agent
- cbt-el7-9.cv.nrao.edu
- Revision
-
621bee1f61cc596727495c37db44c514cc2a29b7
- Total tests
- 3681
- Failing since
- #293 (Child of CASASPECS-MASTERBUILDCASALITH-292 – )
Tests
- 3,681 tests in total
- 1 test failed
- 143 tests were quarantined / skipped
- 750 minutes taken in total.
| Status | Test | Failing since | Duration | |
|---|---|---|---|---|
|
test_widefield
test_widefield_mvc_squint_awp2
|
19 mins | |||
AssertionError: False is not true
Traceback (most recent call last):
File "/home/casatest/casa6/casatasks/tests/casashell_tests/test_task_tclean_casashell.py", line 4339, in test_widefield_mvc_squint_awp2
self.assertTrue(self.check_final(report))
AssertionError: False is not true
|
||||
Error summary
The build generated some errors. See the full build log for more details.
Error response from daemon: No such container: wheel-container-test
Error response from daemon: No such container: wheel-container-test
From https://open-bitbucket.nrao.edu/scm/casa/casa-data
c950f29..06da832 master -> origin/master
Downloading geodetic/IERSpredict/table.dat (3.3 KB)
Downloading geodetic/IERSpredict/table.f0 (296 KB)
Downloading geodetic/IERSpredict/table.lock (325 B)
cat: /home/casatest/.casa/toolrc.py: No such file or directory
Already on 'master'
[notice] A new release of pip is available: 24.0 -> 26.2.1
[notice] To update, run: pip3 install --upgrade pip
Error response from daemon: No such container: wheel-container-test
From https://open-bitbucket.nrao.edu/scm/casa/casa-data
c950f29..06da832 master -> origin/master
Downloading geodetic/IERSpredict/table.dat (3.3 KB)
Downloading geodetic/IERSpredict/table.f0 (296 KB)
Downloading geodetic/IERSpredict/table.lock (325 B)
cat: /home/casatest/.casa/toolrc.py: No such file or directory
Already on 'master'
[notice] A new release of pip is available: 24.0 -> 26.2.1
[notice] To update, run: pip3 install --upgrade pip