Build: #294 failed Child of CASASPECS-MASTERBUILDCASALITH-293

Build result summary

Details

Completed
Queue duration
1 second
Duration
804 minutes
Labels
None
Revision
621bee1f61cc596727495c37db44c514cc2a29b7
Total tests
3737
Failing since
#293 (Child of CASASPECS-MASTERBUILDCASALITH-292 – )

Responsible

  • Des Small Des Small Automatically assigned
  • Victor de Souza Magalhaes Victor de Souza Magalhaes Automatically assigned

Code commits

Author Commit Message Commit date
Josh Marvil Josh Marvil 621bee1f61cc596727495c37db44c514cc2a29b7 Pull request #1077: CAS-14850
Merge in CASA/casa6 from CAS-14850 to master

* commit 'e24374b2349024e4e76e9cc146d111cb1eb4572f':
  Revert "check thresholdtype matrix bounds before indexing (CAS-14850)"
  check thresholdtype matrix bounds before indexing (CAS-14850)
  change to allow integer field names (CAS-14850)
Josh Marvil Josh Marvil e24374b2349024e4e76e9cc146d111cb1eb4572f m Revert "check thresholdtype matrix bounds before indexing (CAS-14850)"
This reverts commit 179c76145f66278c131080bdae130adf01e849f3.
Josh Marvil Josh Marvil 179c76145f66278c131080bdae130adf01e849f3 m check thresholdtype matrix bounds before indexing (CAS-14850)
Josh Marvil Josh Marvil e2e91683814e64d97a063cead00ff7edde0ef7e1 m change to allow integer field names (CAS-14850)

Tests

Existing test failures 1
Status Test Failing since View job Duration
AssertionError: False is not true
Traceback (most recent call last):
  File "/home/casatest/casa6/casatasks/tests/casashell_tests/test_task_tclean_casashell.py", line 4339, in test_widefield_mvc_squint_awp2
    self.assertTrue(self.check_final(report))
AssertionError: False is not true

Jira issues

IssueDescriptionStatus
Unknown Issue TypeCAS-14850Could not obtain issue details from Jira