Build: #293 failed

Job: Test Tasks Many Linux 2.34 CasaShell Rocky 9.5 failed

Job result summary

Completed
Duration
696 minutes
Agent
cbt-el7-9.cv.nrao.edu
Revision
b13eec898c7db6ba724c6e911c477e6ae467f6b2
Total tests
3681

Tests

  • 3,681 tests in total
  • 1 test failed
  • 143 tests were quarantined / skipped
  • 646 minutes taken in total.
Existing test failures 1
Status Test Failing since Duration
AssertionError: False is not true
Traceback (most recent call last):
  File "/home/casatest/casa6/casatasks/tests/casashell_tests/test_task_tclean_casashell.py", line 4339, in test_widefield_mvc_squint_awp2
    self.assertTrue(self.check_final(report))
AssertionError: False is not true

Error summary

The build generated some errors. See the full build log for more details.

Error response from daemon: No such container: wheel-container-test
Error response from daemon: No such container: wheel-container-test
From https://open-bitbucket.nrao.edu/scm/casa/casa-data
   e8f5a0f..ce16151  master     -> origin/master
* [new tag]         2026.9.14  -> 2026.9.14
Downloading geodetic/IERSpredict/table.dat (3.3 KB)
Downloading geodetic/IERSpredict/table.f0 (296 KB)
Downloading geodetic/IERSpredict/table.lock (325 B)
cat: /home/casatest/.casa/toolrc.py: No such file or directory
Already on 'master'

[notice] A new release of pip is available: 24.0 -> 26.2.1
[notice] To update, run: pip3 install --upgrade pip