Build: #2 failed

Job: Test Tools Many Linux 2.28 Py3.12 was successful

Build log

The build generated 53,648 lines of output.   The output is too long and has been truncated to the last 1,000 lines. Download or view full build log.

01-Oct-2026 21:00:44 2026-10-02 01:00:45        INFO        ::::image::rebin        Ran ia.rebin
01-Oct-2026 21:00:44 2026-10-02 01:00:45        INFO        ::::image::rebin        ia.rebin(outfile="", bin=[1,1,20], region="", mask="", dropdeg=false, overwrite=false, stretch=false, crop=false)
01-Oct-2026 21:00:44 2026-10-02 01:00:45        INFO        name::        No table opened.
01-Oct-2026 21:00:44 2026-10-02 01:00:45        INFO        showcache::        The Table Cache is empty.
01-Oct-2026 21:00:44 test_tool_image_rebin.py::ia_rebin_test::test_history
01-Oct-2026 21:00:44 Test history writing
01-Oct-2026 21:00:44 PASSED
01-Oct-2026 21:00:44
01-Oct-2026 21:00:44 2026-10-02 01:00:45        INFO        ImageFactory::createImage        Created Paged image 'gd.im' of shape [10, 10, 10] with float valued pixels.
01-Oct-2026 21:00:44 2026-10-02 01:00:45        INFO        image::_casaQuantityFromVar         Will use values specified in major, minor, pa to set beam
01-Oct-2026 21:00:44 2026-10-02 01:00:45        INFO        BeamManipulator::set        This image currently has no beams of any kind. Since channel and/or polarization were specified, a set of per plane beams, each equal to the specified beam, will be created.
01-Oct-2026 21:00:44 2026-10-02 01:00:45        INFO        BeamManipulator::set        Beam parameters:  Major          : 4 arcsec
01-Oct-2026 21:00:44 2026-10-02 01:00:45        INFO        BeamManipulator::set+          Minor          : 2 arcsec
01-Oct-2026 21:00:44 2026-10-02 01:00:45        INFO        BeamManipulator::set+          Position Angle : 0 deg
01-Oct-2026 21:00:44 2026-10-02 01:00:45        INFO        CasacRegionManager::fromBCS        No directional region specified. Using full positional plane.
01-Oct-2026 21:00:44 2026-10-02 01:00:45        INFO        CasacRegionManager::fromBCS        Using all spectral channels.
01-Oct-2026 21:00:44 2026-10-02 01:00:45        INFO        CasacRegionManager::fromBCS        No directional region specified. Using full positional plane.
01-Oct-2026 21:00:44 2026-10-02 01:00:45        INFO        CasacRegionManager::fromBCS        Using all spectral channels.
01-Oct-2026 21:00:44 2026-10-02 01:00:45        SEVERE        image::rebin        Exception Reported: Exception: This image has multiple beams. The spectral axis cannot be rebinned.
01-Oct-2026 21:00:44 2026-10-02 01:00:45        SEVERE        image::rebin+        ... thrown by casacore::RebinImage<T>::RebinImage(const casacore::ImageInterface<T>&, const casacore::IPosition&) [with T = float] at File: /source/casainstall/include/casacore/images/Images/RebinImage.tcc, line: 50
01-Oct-2026 21:00:44 2026-10-02 01:00:45        INFO        name::        No table opened.
01-Oct-2026 21:00:44 2026-10-02 01:00:45        INFO        showcache::        The Table Cache is empty.
01-Oct-2026 21:00:44 test_tool_image_rebin.py::ia_rebin_test::test_multibeam
01-Oct-2026 21:00:44 Test multiple beams
01-Oct-2026 21:00:44 PASSED
01-Oct-2026 21:00:44
01-Oct-2026 21:00:44 2026-10-02 01:00:45        INFO        ImageFactory::createImage        Created Paged image 'maskim' of shape [200, 200, 1, 1] with float valued pixels.
01-Oct-2026 21:00:44 2026-10-02 01:00:45        INFO        ImageFactory::createImage        Created Paged image 'aa.im' of shape [200, 200, 1, 10] with float valued pixels.
01-Oct-2026 21:00:44 2026-10-02 01:00:45        INFO        CasacRegionManager::fromBCS        No directional region specified. Using full positional plane.
01-Oct-2026 21:00:44 2026-10-02 01:00:45        INFO        CasacRegionManager::fromBCS        Using all spectral channels.
01-Oct-2026 21:00:44 2026-10-02 01:00:45        INFO        CasacRegionManager::fromBCS        Using polarizations ALL
01-Oct-2026 21:00:44 2026-10-02 01:00:45        SEVERE        image::rebin        Exception Reported: The input image shape ([200, 200, 1, 10]) and mask shape ([200, 200, 1, 1]) are different, and it was specified that the mask should not be extended, so the mask cannot be applied to the (sub)image. Specifying that the mask should be extended may resolve the issue at File: /source/casainstall/include/casacpp/imageanalysis/ImageAnalysis/SubImageFactory.tcc, line: 306
01-Oct-2026 21:00:44 2026-10-02 01:00:45        INFO        CasacRegionManager::fromBCS        No directional region specified. Using full positional plane.
01-Oct-2026 21:00:44 2026-10-02 01:00:45        INFO        CasacRegionManager::fromBCS        Using all spectral channels.
01-Oct-2026 21:00:44 2026-10-02 01:00:45        INFO        CasacRegionManager::fromBCS        Using polarizations ALL
01-Oct-2026 21:00:44 2026-10-02 01:00:45        INFO        ImageMaskAttacher::makeMask        Created mask `mask0'
01-Oct-2026 21:00:44 2026-10-02 01:00:45        INFO        name::        No table opened.
01-Oct-2026 21:00:44 2026-10-02 01:00:45        INFO        showcache::        The Table Cache is empty.
01-Oct-2026 21:00:44 test_tool_image_rebin.py::ia_rebin_test::test_stretch
01-Oct-2026 21:00:44 ia.rebin(): Test stretch parameter
01-Oct-2026 21:00:44 PASSED
01-Oct-2026 21:00:44
01-Oct-2026 21:00:44 - generated xml file: /home/casatest/casa6/casatestutils/nosedir/xml/test_tool_image_rebin/nose.xml -
01-Oct-2026 21:00:44 ========================= 8 passed, 1 warning in 0.55s =========================
01-Oct-2026 21:00:45 ============================= test session starts ==============================
01-Oct-2026 21:00:45 platform linux -- Python 3.12.9, pytest-9.1.1, pluggy-1.6.0 -- /home/casatest/venv/bin/python3.12
01-Oct-2026 21:00:45 cachedir: .pytest_cache
01-Oct-2026 21:00:45 rootdir: /home/casatest/casa6/casatestutils/nosedir/test_tool_table
01-Oct-2026 21:00:45 configfile: pytest.ini
01-Oct-2026 21:00:45 collecting ... table tool tests will use /opt/casa/data/casatestdata/unittest/table/n08c1_swap1.ms
01-Oct-2026 21:00:45 collected 13 items
01-Oct-2026 21:00:45
01-Oct-2026 21:00:45
01-Oct-2026 21:00:45 2026-10-02 01:00:45        INFO        name::        No table opened.
01-Oct-2026 21:00:45 2026-10-02 01:00:45        INFO        name::        No table opened.
01-Oct-2026 21:00:45 test_tool_table.py::TableGetcoliterTest::test_consistency
01-Oct-2026 21:00:45 PASSED
01-Oct-2026 21:00:45
01-Oct-2026 21:00:45 2026-10-02 01:00:45        INFO        name::        No table opened.
01-Oct-2026 21:00:45 2026-10-02 01:00:45        INFO        name::        No table opened.
01-Oct-2026 21:00:45 test_tool_table.py::TableGetcoliterTest::test_element_match
01-Oct-2026 21:00:45 Test element match using direct comparison and StopIteration assertion. 
01-Oct-2026 21:00:45 [4.71188568e+09 4.71188569e+09 4.71188570e+09 4.71188571e+09
01-Oct-2026 21:00:45 4.71188571e+09 4.71188572e+09 4.71188573e+09 4.71188574e+09]
01-Oct-2026 21:00:45 [4.71188568e+09 4.71188569e+09 4.71188570e+09 4.71188571e+09
01-Oct-2026 21:00:45 4.71188571e+09 4.71188572e+09 4.71188573e+09 4.71188574e+09]
01-Oct-2026 21:00:45 PASSED
01-Oct-2026 21:00:45
01-Oct-2026 21:00:45 2026-10-02 01:00:45        INFO        name::        No table opened.
01-Oct-2026 21:00:45 2026-10-02 01:00:45        INFO        name::        No table opened.
01-Oct-2026 21:00:45 test_tool_table.py::TableGetcoliterTest::test_errors
01-Oct-2026 21:00:45 PASSED
01-Oct-2026 21:00:45
01-Oct-2026 21:00:45 2026-10-02 01:00:45        INFO        name::        No table opened.
01-Oct-2026 21:00:45 2026-10-02 01:00:45        INFO        name::        No table opened.
01-Oct-2026 21:00:45 test_tool_table.py::TableGetcoliterTest::test_values
01-Oct-2026 21:00:45 PASSED
01-Oct-2026 21:00:45
01-Oct-2026 21:00:45 2026-10-02 01:00:46        INFO        name::        No table opened.
01-Oct-2026 21:00:45 2026-10-02 01:00:46        INFO        name::        No table opened.
01-Oct-2026 21:00:45 test_tool_table.py::TableRowTest::test_all_rows
01-Oct-2026 21:00:45 PASSED
01-Oct-2026 21:00:45
01-Oct-2026 21:00:45 2026-10-02 01:00:46        INFO        name::        No table opened.
01-Oct-2026 21:00:45 2026-10-02 01:00:46        INFO        name::        No table opened.
01-Oct-2026 21:00:45 test_tool_table.py::TableRowTest::test_columnnames_exclude
01-Oct-2026 21:00:45 PASSED
01-Oct-2026 21:00:45
01-Oct-2026 21:00:45 2026-10-02 01:00:46        INFO        name::        No table opened.
01-Oct-2026 21:00:45 2026-10-02 01:00:46        INFO        name::        No table opened.
01-Oct-2026 21:00:45 test_tool_table.py::TableRowTest::test_columnnames_include
01-Oct-2026 21:00:45 PASSED
01-Oct-2026 21:00:45
01-Oct-2026 21:00:45 2026-10-02 01:00:46        INFO        name::        No table opened.
01-Oct-2026 21:00:45 2026-10-02 01:00:46        INFO        name::        No table opened.
01-Oct-2026 21:00:45 test_tool_table.py::TableRowTest::test_get
01-Oct-2026 21:00:45 Test get function
01-Oct-2026 21:00:45 PASSED
01-Oct-2026 21:00:45
01-Oct-2026 21:00:45 2026-10-02 01:00:46        INFO        name::        No table opened.
01-Oct-2026 21:00:45 2026-10-02 01:00:46        INFO        name::        No table opened.
01-Oct-2026 21:00:45 2026-10-02 01:00:46        INFO        name::        No table opened.
01-Oct-2026 21:00:45 2026-10-02 01:00:46        INFO        name::        No table opened.
01-Oct-2026 21:00:45 test_tool_table.py::TableRowTest::test_put
01-Oct-2026 21:00:45 Test put function
01-Oct-2026 21:00:45 PASSED
01-Oct-2026 21:00:45
01-Oct-2026 21:00:45 2026-10-02 01:00:46        INFO        name::        No table opened.
01-Oct-2026 21:00:45 2026-10-02 01:00:46        INFO        name::        No table opened.
01-Oct-2026 21:00:45 test_tool_table.py::TableRowTest::test_shape
01-Oct-2026 21:00:45 Test for valid data shape
01-Oct-2026 21:00:45 PASSED
01-Oct-2026 21:00:45
01-Oct-2026 21:00:45 2026-10-02 01:00:46        INFO        name::        No table opened.
01-Oct-2026 21:00:45 2026-10-02 01:00:46        INFO        name::        No table opened.
01-Oct-2026 21:00:45 test_tool_table.py::TableRowTest::test_some_rows
01-Oct-2026 21:00:45 PASSED
01-Oct-2026 21:00:45
01-Oct-2026 21:00:45 2026-10-02 01:00:46        INFO        ImageFactory::createImage        Created Paged image 'tmp.im' of shape [3, 4] with float valued pixels.
01-Oct-2026 21:00:45 2026-10-02 01:00:46        SEVERE        getcellslice::bogus        Exception Reported: Table column bogus is unknown
01-Oct-2026 21:00:45 2026-10-02 01:00:46        SEVERE        getcellslice::map        Exception Reported: TableColumn: row number 1 exceeds #rows 1 in table /home/casatest/casa6/casatestutils/nosedir/test_tool_table/tmp.im
01-Oct-2026 21:00:45 2026-10-02 01:00:46        SEVERE        getcellslice::map        Exception Reported: Exception: blc must have length of 2.
01-Oct-2026 21:00:45 2026-10-02 01:00:46        SEVERE        getcellslice::map+        ... thrown by void casac::table::_checkCorner(const std::vector<long int>&, const casacore::String&, const casacore::IPosition&, const std::pair<std::vector<long int>, std::vector<long int> >* const&) at File: src/tools/table/table_cmpt.cc, line: 1386
01-Oct-2026 21:00:45 2026-10-02 01:00:46        SEVERE        getcellslice::map        Exception Reported: Exception: All elements of blc must be greater than or equal to 0.
01-Oct-2026 21:00:45 2026-10-02 01:00:46        SEVERE        getcellslice::map+        ... thrown by void casac::table::_checkCorner(const std::vector<long int>&, const casacore::String&, const casacore::IPosition&, const std::pair<std::vector<long int>, std::vector<long int> >* const&) at File: src/tools/table/table_cmpt.cc, line: 1390
01-Oct-2026 21:00:45 2026-10-02 01:00:46        SEVERE        getcellslice::map        Exception Reported: Exception: Element 1 of blc must be less than 4.
01-Oct-2026 21:00:45 2026-10-02 01:00:46        SEVERE        getcellslice::map+        ... thrown by void casac::table::_checkCorner(const std::vector<long int>&, const casacore::String&, const casacore::IPosition&, const std::pair<std::vector<long int>, std::vector<long int> >* const&) at File: src/tools/table/table_cmpt.cc, line: 1395
01-Oct-2026 21:00:45 2026-10-02 01:00:46        SEVERE        getcellslice::map        Exception Reported: Exception: trc must have length of 2.
01-Oct-2026 21:00:45 2026-10-02 01:00:46        SEVERE        getcellslice::map+        ... thrown by void casac::table::_checkCorner(const std::vector<long int>&, const casacore::String&, const casacore::IPosition&, const std::pair<std::vector<long int>, std::vector<long int> >* const&) at File: src/tools/table/table_cmpt.cc, line: 1386
01-Oct-2026 21:00:45 2026-10-02 01:00:46        SEVERE        getcellslice::map        Exception Reported: Exception: All elements of trc must be greater than or equal to 0.
01-Oct-2026 21:00:45 2026-10-02 01:00:46        SEVERE        getcellslice::map+        ... thrown by void casac::table::_checkCorner(const std::vector<long int>&, const casacore::String&, const casacore::IPosition&, const std::pair<std::vector<long int>, std::vector<long int> >* const&) at File: src/tools/table/table_cmpt.cc, line: 1390
01-Oct-2026 21:00:45 2026-10-02 01:00:46        SEVERE        getcellslice::map        Exception Reported: Exception: Element 0 of trc must be less than 3.
01-Oct-2026 21:00:45 2026-10-02 01:00:46        SEVERE        getcellslice::map+        ... thrown by void casac::table::_checkCorner(const std::vector<long int>&, const casacore::String&, const casacore::IPosition&, const std::pair<std::vector<long int>, std::vector<long int> >* const&) at File: src/tools/table/table_cmpt.cc, line: 1395
01-Oct-2026 21:00:45 2026-10-02 01:00:46        SEVERE        getcellslice::map        Exception Reported: Exception: All elements of trc must be greater than or equal to their corresponding blc elements.
01-Oct-2026 21:00:45 2026-10-02 01:00:46        SEVERE        getcellslice::map+        ... thrown by void casac::table::_checkCorner(const std::vector<long int>&, const casacore::String&, const casacore::IPosition&, const std::pair<std::vector<long int>, std::vector<long int> >* const&) at File: src/tools/table/table_cmpt.cc, line: 1405
01-Oct-2026 21:00:45 2026-10-02 01:00:46        SEVERE        getcellslice::map        Exception Reported: Exception: incr must have length of 2.
01-Oct-2026 21:00:45 2026-10-02 01:00:46        SEVERE        getcellslice::map+        ... thrown by casac::variant* casac::table::getcellslice(const string&, long int, const std::vector<long int>&, const std::vector<long int>&, const std::vector<long int>&) at File: src/tools/table/table_cmpt.cc, line: 1466
01-Oct-2026 21:00:45 2026-10-02 01:00:46        SEVERE        getcellslice::map        Exception Reported: Exception: All elements of incr must be greater than 0.
01-Oct-2026 21:00:45 2026-10-02 01:00:46        SEVERE        getcellslice::map+        ... thrown by casac::variant* casac::table::getcellslice(const string&, long int, const std::vector<long int>&, const std::vector<long int>&, const std::vector<long int>&) at File: src/tools/table/table_cmpt.cc, line: 1471
01-Oct-2026 21:00:45 2026-10-02 01:00:46        INFO        name::        No table opened.
01-Oct-2026 21:00:45 2026-10-02 01:00:46        INFO        name::        No table opened.
01-Oct-2026 21:00:45 test_tool_table.py::table_getcellslice_test::test_exceptions
01-Oct-2026 21:00:45 Test various exception cases
01-Oct-2026 21:00:45 PASSED
01-Oct-2026 21:00:45
01-Oct-2026 21:00:45 2026-10-02 01:00:46        INFO        ImageFactory::createImage        Created Paged image 'tmp.im' of shape [3, 4] with float valued pixels.
01-Oct-2026 21:00:45 2026-10-02 01:00:46        INFO        name::        No table opened.
01-Oct-2026 21:00:45 2026-10-02 01:00:46        INFO        name::        No table opened.
01-Oct-2026 21:00:45 2026-10-02 01:00:46        INFO        name::        No table opened.
01-Oct-2026 21:00:45 test_tool_table.py::table_getcellslice_test::test_getcellslice
01-Oct-2026 21:00:45 tests for valid inputs
01-Oct-2026 21:00:45 PASSED
01-Oct-2026 21:00:45
01-Oct-2026 21:00:45 - generated xml file: /home/casatest/casa6/casatestutils/nosedir/xml/test_tool_table/nose.xml -
01-Oct-2026 21:00:45 ======================== 13 passed, 1 warning in 0.56s =========================
01-Oct-2026 21:00:45 ============================= test session starts ==============================
01-Oct-2026 21:00:45 platform linux -- Python 3.12.9, pytest-9.1.1, pluggy-1.6.0 -- /home/casatest/venv/bin/python3.12
01-Oct-2026 21:00:45 cachedir: .pytest_cache
01-Oct-2026 21:00:45 rootdir: /home/casatest/casa6/casatestutils/nosedir/test_tool_image_subimage
01-Oct-2026 21:00:45 configfile: pytest.ini
01-Oct-2026 21:00:46 collecting ... collected 5 items
01-Oct-2026 21:00:46
01-Oct-2026 21:00:46
01-Oct-2026 21:00:46 2026-10-02 01:00:46        INFO        ImageFactory::createImage        Created Temp image  of shape [10, 10, 10, 4] with float valued pixels.
01-Oct-2026 21:00:46 2026-10-02 01:00:46        INFO        image::_casaQuantityFromVar         Will use values specified in major, minor, pa to set beam
01-Oct-2026 21:00:46 2026-10-02 01:00:46        INFO        BeamManipulator::set        This image currently has no beams of any kind. Since channel and/or polarization were specified, a set of per plane beams, each equal to the specified beam, will be created.
01-Oct-2026 21:00:46 2026-10-02 01:00:46        INFO        BeamManipulator::set        Beam parameters:  Major          : 4 arcsec
01-Oct-2026 21:00:46 2026-10-02 01:00:46        INFO        BeamManipulator::set+          Minor          : 2 arcsec
01-Oct-2026 21:00:46 2026-10-02 01:00:46        INFO        BeamManipulator::set+          Position Angle : 5 deg
01-Oct-2026 21:00:46 2026-10-02 01:00:46        INFO        image::_casaQuantityFromVar         Will use values specified in major, minor, pa to set beam
01-Oct-2026 21:00:46 2026-10-02 01:00:46        INFO        BeamManipulator::set        Beam parameters:  Major          : 2 arcsec
01-Oct-2026 21:00:46 2026-10-02 01:00:46        INFO        BeamManipulator::set+          Minor          : 1 arcsec
01-Oct-2026 21:00:46 2026-10-02 01:00:46        INFO        BeamManipulator::set+          Position Angle : 5 deg
01-Oct-2026 21:00:46 2026-10-02 01:00:46        INFO        image::_casaQuantityFromVar         Will use values specified in major, minor, pa to set beam
01-Oct-2026 21:00:46 2026-10-02 01:00:46        INFO        BeamManipulator::set        Beam parameters:  Major          : 3 arcsec
01-Oct-2026 21:00:46 2026-10-02 01:00:46        INFO        BeamManipulator::set+          Minor          : 2 arcsec
01-Oct-2026 21:00:46 2026-10-02 01:00:46        INFO        BeamManipulator::set+          Position Angle : 5 deg
01-Oct-2026 21:00:46 2026-10-02 01:00:46        INFO        image::_casaQuantityFromVar         Will use values specified in major, minor, pa to set beam
01-Oct-2026 21:00:46 2026-10-02 01:00:46        INFO        BeamManipulator::set        Beam parameters:  Major          : 4 arcsec
01-Oct-2026 21:00:46 2026-10-02 01:00:46        INFO        BeamManipulator::set+          Minor          : 3 arcsec
01-Oct-2026 21:00:46 2026-10-02 01:00:46        INFO        BeamManipulator::set+          Position Angle : 5 deg
01-Oct-2026 21:00:46 2026-10-02 01:00:46        INFO        image::_casaQuantityFromVar         Will use values specified in major, minor, pa to set beam
01-Oct-2026 21:00:46 2026-10-02 01:00:46        INFO        BeamManipulator::set        Beam parameters:  Major          : 5 arcsec
01-Oct-2026 21:00:46 2026-10-02 01:00:46        INFO        BeamManipulator::set+          Minor          : 4 arcsec
01-Oct-2026 21:00:46 2026-10-02 01:00:46        INFO        BeamManipulator::set+          Position Angle : 5 deg
01-Oct-2026 21:00:46 2026-10-02 01:00:46        INFO        image::_casaQuantityFromVar         Will use values specified in major, minor, pa to set beam
01-Oct-2026 21:00:46 2026-10-02 01:00:46        INFO        BeamManipulator::set        Beam parameters:  Major          : 3 arcsec
01-Oct-2026 21:00:46 2026-10-02 01:00:46        INFO        BeamManipulator::set+          Minor          : 2 arcsec
01-Oct-2026 21:00:46 2026-10-02 01:00:46        INFO        BeamManipulator::set+          Position Angle : 5 deg
01-Oct-2026 21:00:46 2026-10-02 01:00:46        INFO        image::_casaQuantityFromVar         Will use values specified in major, minor, pa to set beam
01-Oct-2026 21:00:46 2026-10-02 01:00:46        INFO        BeamManipulator::set        Beam parameters:  Major          : 4 arcsec
01-Oct-2026 21:00:46 2026-10-02 01:00:46        INFO        BeamManipulator::set+          Minor          : 3 arcsec
01-Oct-2026 21:00:46 2026-10-02 01:00:46        INFO        BeamManipulator::set+          Position Angle : 5 deg
01-Oct-2026 21:00:46 2026-10-02 01:00:46        INFO        image::_casaQuantityFromVar         Will use values specified in major, minor, pa to set beam
01-Oct-2026 21:00:46 2026-10-02 01:00:46        INFO        BeamManipulator::set        Beam parameters:  Major          : 5 arcsec
01-Oct-2026 21:00:46 2026-10-02 01:00:46        INFO        BeamManipulator::set+          Minor          : 4 arcsec
01-Oct-2026 21:00:46 2026-10-02 01:00:46        INFO        BeamManipulator::set+          Position Angle : 5 deg
01-Oct-2026 21:00:46 2026-10-02 01:00:46        INFO        image::_casaQuantityFromVar         Will use values specified in major, minor, pa to set beam
01-Oct-2026 21:00:46 2026-10-02 01:00:46        INFO        BeamManipulator::set        Beam parameters:  Major          : 6 arcsec
01-Oct-2026 21:00:46 2026-10-02 01:00:46        INFO        BeamManipulator::set+          Minor          : 5 arcsec
01-Oct-2026 21:00:46 2026-10-02 01:00:46        INFO        BeamManipulator::set+          Position Angle : 5 deg
01-Oct-2026 21:00:46 2026-10-02 01:00:46        INFO        image::_casaQuantityFromVar         Will use values specified in major, minor, pa to set beam
01-Oct-2026 21:00:46 2026-10-02 01:00:46        INFO        BeamManipulator::set        Beam parameters:  Major          : 4 arcsec
01-Oct-2026 21:00:46 2026-10-02 01:00:46        INFO        BeamManipulator::set+          Minor          : 3 arcsec
01-Oct-2026 21:00:46 2026-10-02 01:00:46        INFO        BeamManipulator::set+          Position Angle : 5 deg
01-Oct-2026 21:00:46 2026-10-02 01:00:46        INFO        image::_casaQuantityFromVar         Will use values specified in major, minor, pa to set beam
01-Oct-2026 21:00:46 2026-10-02 01:00:46        INFO        BeamManipulator::set        Beam parameters:  Major          : 5 arcsec
01-Oct-2026 21:00:46 2026-10-02 01:00:46        INFO        BeamManipulator::set+          Minor          : 4 arcsec
01-Oct-2026 21:00:46 2026-10-02 01:00:46        INFO        BeamManipulator::set+          Position Angle : 5 deg
01-Oct-2026 21:00:46 2026-10-02 01:00:46        INFO        image::_casaQuantityFromVar         Will use values specified in major, minor, pa to set beam
01-Oct-2026 21:00:46 2026-10-02 01:00:46        INFO        BeamManipulator::set        Beam parameters:  Major          : 6 arcsec
01-Oct-2026 21:00:46 2026-10-02 01:00:46        INFO        BeamManipulator::set+          Minor          : 5 arcsec
01-Oct-2026 21:00:46 2026-10-02 01:00:46        INFO        BeamManipulator::set+          Position Angle : 5 deg
01-Oct-2026 21:00:46 2026-10-02 01:00:46        INFO        image::_casaQuantityFromVar         Will use values specified in major, minor, pa to set beam
01-Oct-2026 21:00:46 2026-10-02 01:00:46        INFO        BeamManipulator::set        Beam parameters:  Major          : 7 arcsec
01-Oct-2026 21:00:46 2026-10-02 01:00:46        INFO        BeamManipulator::set+          Minor          : 6 arcsec
01-Oct-2026 21:00:46 2026-10-02 01:00:46        INFO        BeamManipulator::set+          Position Angle : 5 deg
01-Oct-2026 21:00:46 2026-10-02 01:00:46        INFO        image::_casaQuantityFromVar         Will use values specified in major, minor, pa to set beam
01-Oct-2026 21:00:46 2026-10-02 01:00:46        INFO        BeamManipulator::set        Beam parameters:  Major          : 5 arcsec
01-Oct-2026 21:00:46 2026-10-02 01:00:46        INFO        BeamManipulator::set+          Minor          : 4 arcsec
01-Oct-2026 21:00:46 2026-10-02 01:00:46        INFO        BeamManipulator::set+          Position Angle : 5 deg
01-Oct-2026 21:00:46 2026-10-02 01:00:46        INFO        image::_casaQuantityFromVar         Will use values specified in major, minor, pa to set beam
01-Oct-2026 21:00:46 2026-10-02 01:00:46        INFO        BeamManipulator::set        Beam parameters:  Major          : 6 arcsec
01-Oct-2026 21:00:46 2026-10-02 01:00:46        INFO        BeamManipulator::set+          Minor          : 5 arcsec
01-Oct-2026 21:00:46 2026-10-02 01:00:46        INFO        BeamManipulator::set+          Position Angle : 5 deg
01-Oct-2026 21:00:46 2026-10-02 01:00:46        INFO        image::_casaQuantityFromVar         Will use values specified in major, minor, pa to set beam
01-Oct-2026 21:00:46 2026-10-02 01:00:46        INFO        BeamManipulator::set        Beam parameters:  Major          : 7 arcsec
01-Oct-2026 21:00:46 2026-10-02 01:00:46        INFO        BeamManipulator::set+          Minor          : 6 arcsec
01-Oct-2026 21:00:46 2026-10-02 01:00:46        INFO        BeamManipulator::set+          Position Angle : 5 deg
01-Oct-2026 21:00:46 2026-10-02 01:00:46        INFO        image::_casaQuantityFromVar         Will use values specified in major, minor, pa to set beam
01-Oct-2026 21:00:46 2026-10-02 01:00:46        INFO        BeamManipulator::set        Beam parameters:  Major          : 8 arcsec
01-Oct-2026 21:00:46 2026-10-02 01:00:46        INFO        BeamManipulator::set+          Minor          : 7 arcsec
01-Oct-2026 21:00:46 2026-10-02 01:00:46        INFO        BeamManipulator::set+          Position Angle : 5 deg
01-Oct-2026 21:00:46 2026-10-02 01:00:46        INFO        image::_casaQuantityFromVar         Will use values specified in major, minor, pa to set beam
01-Oct-2026 21:00:46 2026-10-02 01:00:46        INFO        BeamManipulator::set        Beam parameters:  Major          : 6 arcsec
01-Oct-2026 21:00:46 2026-10-02 01:00:46        INFO        BeamManipulator::set+          Minor          : 5 arcsec
01-Oct-2026 21:00:46 2026-10-02 01:00:46        INFO        BeamManipulator::set+          Position Angle : 5 deg
01-Oct-2026 21:00:46 2026-10-02 01:00:46        INFO        image::_casaQuantityFromVar         Will use values specified in major, minor, pa to set beam
01-Oct-2026 21:00:46 2026-10-02 01:00:46        INFO        BeamManipulator::set        Beam parameters:  Major          : 7 arcsec
01-Oct-2026 21:00:46 2026-10-02 01:00:46        INFO        BeamManipulator::set+          Minor          : 6 arcsec
01-Oct-2026 21:00:46 2026-10-02 01:00:46        INFO        BeamManipulator::set+          Position Angle : 5 deg
01-Oct-2026 21:00:46 2026-10-02 01:00:46        INFO        image::_casaQuantityFromVar         Will use values specified in major, minor, pa to set beam
01-Oct-2026 21:00:46 2026-10-02 01:00:46        INFO        BeamManipulator::set        Beam parameters:  Major          : 8 arcsec
01-Oct-2026 21:00:46 2026-10-02 01:00:46        INFO        BeamManipulator::set+          Minor          : 7 arcsec
01-Oct-2026 21:00:46 2026-10-02 01:00:46        INFO        BeamManipulator::set+          Position Angle : 5 deg
01-Oct-2026 21:00:46 2026-10-02 01:00:46        INFO        image::_casaQuantityFromVar         Will use values specified in major, minor, pa to set beam
01-Oct-2026 21:00:46 2026-10-02 01:00:46        INFO        BeamManipulator::set        Beam parameters:  Major          : 9 arcsec
01-Oct-2026 21:00:46 2026-10-02 01:00:46        INFO        BeamManipulator::set+          Minor          : 8 arcsec
01-Oct-2026 21:00:46 2026-10-02 01:00:46        INFO        BeamManipulator::set+          Position Angle : 5 deg
01-Oct-2026 21:00:46 2026-10-02 01:00:46        INFO        image::_casaQuantityFromVar         Will use values specified in major, minor, pa to set beam
01-Oct-2026 21:00:46 2026-10-02 01:00:46        INFO        BeamManipulator::set        Beam parameters:  Major          : 7 arcsec
01-Oct-2026 21:00:46 2026-10-02 01:00:46        INFO        BeamManipulator::set+          Minor          : 6 arcsec
01-Oct-2026 21:00:46 2026-10-02 01:00:46        INFO        BeamManipulator::set+          Position Angle : 5 deg
01-Oct-2026 21:00:46 2026-10-02 01:00:46        INFO        image::_casaQuantityFromVar         Will use values specified in major, minor, pa to set beam
01-Oct-2026 21:00:46 2026-10-02 01:00:46        INFO        BeamManipulator::set        Beam parameters:  Major          : 8 arcsec
01-Oct-2026 21:00:46 2026-10-02 01:00:46        INFO        BeamManipulator::set+          Minor          : 7 arcsec
01-Oct-2026 21:00:46 2026-10-02 01:00:46        INFO        BeamManipulator::set+          Position Angle : 5 deg
01-Oct-2026 21:00:46 2026-10-02 01:00:46        INFO        image::_casaQuantityFromVar         Will use values specified in major, minor, pa to set beam
01-Oct-2026 21:00:46 2026-10-02 01:00:46        INFO        BeamManipulator::set        Beam parameters:  Major          : 9 arcsec
01-Oct-2026 21:00:46 2026-10-02 01:00:46        INFO        BeamManipulator::set+          Minor          : 8 arcsec
01-Oct-2026 21:00:46 2026-10-02 01:00:46        INFO        BeamManipulator::set+          Position Angle : 5 deg
01-Oct-2026 21:00:46 2026-10-02 01:00:46        INFO        image::_casaQuantityFromVar         Will use values specified in major, minor, pa to set beam
01-Oct-2026 21:00:46 2026-10-02 01:00:46        INFO        BeamManipulator::set        Beam parameters:  Major          : 10 arcsec
01-Oct-2026 21:00:46 2026-10-02 01:00:46        INFO        BeamManipulator::set+          Minor          : 9 arcsec
01-Oct-2026 21:00:46 2026-10-02 01:00:46        INFO        BeamManipulator::set+          Position Angle : 5 deg
01-Oct-2026 21:00:46 2026-10-02 01:00:46        INFO        image::_casaQuantityFromVar         Will use values specified in major, minor, pa to set beam
01-Oct-2026 21:00:46 2026-10-02 01:00:46        INFO        BeamManipulator::set        Beam parameters:  Major          : 8 arcsec
01-Oct-2026 21:00:46 2026-10-02 01:00:46        INFO        BeamManipulator::set+          Minor          : 7 arcsec
01-Oct-2026 21:00:46 2026-10-02 01:00:46        INFO        BeamManipulator::set+          Position Angle : 5 deg
01-Oct-2026 21:00:46 2026-10-02 01:00:46        INFO        image::_casaQuantityFromVar         Will use values specified in major, minor, pa to set beam
01-Oct-2026 21:00:46 2026-10-02 01:00:46        INFO        BeamManipulator::set        Beam parameters:  Major          : 9 arcsec
01-Oct-2026 21:00:46 2026-10-02 01:00:46        INFO        BeamManipulator::set+          Minor          : 8 arcsec
01-Oct-2026 21:00:46 2026-10-02 01:00:46        INFO        BeamManipulator::set+          Position Angle : 5 deg
01-Oct-2026 21:00:46 2026-10-02 01:00:46        INFO        image::_casaQuantityFromVar         Will use values specified in major, minor, pa to set beam
01-Oct-2026 21:00:46 2026-10-02 01:00:46        INFO        BeamManipulator::set        Beam parameters:  Major          : 10 arcsec
01-Oct-2026 21:00:46 2026-10-02 01:00:46        INFO        BeamManipulator::set+          Minor          : 9 arcsec
01-Oct-2026 21:00:46 2026-10-02 01:00:46        INFO        BeamManipulator::set+          Position Angle : 5 deg
01-Oct-2026 21:00:46 2026-10-02 01:00:46        INFO        image::_casaQuantityFromVar         Will use values specified in major, minor, pa to set beam
01-Oct-2026 21:00:46 2026-10-02 01:00:46        INFO        BeamManipulator::set        Beam parameters:  Major          : 11 arcsec
01-Oct-2026 21:00:46 2026-10-02 01:00:46        INFO        BeamManipulator::set+          Minor          : 10 arcsec
01-Oct-2026 21:00:46 2026-10-02 01:00:46        INFO        BeamManipulator::set+          Position Angle : 5 deg
01-Oct-2026 21:00:46 2026-10-02 01:00:46        INFO        image::_casaQuantityFromVar         Will use values specified in major, minor, pa to set beam
01-Oct-2026 21:00:46 2026-10-02 01:00:46        INFO        BeamManipulator::set        Beam parameters:  Major          : 9 arcsec
01-Oct-2026 21:00:46 2026-10-02 01:00:46        INFO        BeamManipulator::set+          Minor          : 8 arcsec
01-Oct-2026 21:00:46 2026-10-02 01:00:46        INFO        BeamManipulator::set+          Position Angle : 5 deg
01-Oct-2026 21:00:46 2026-10-02 01:00:46        INFO        image::_casaQuantityFromVar         Will use values specified in major, minor, pa to set beam
01-Oct-2026 21:00:46 2026-10-02 01:00:46        INFO        BeamManipulator::set        Beam parameters:  Major          : 10 arcsec
01-Oct-2026 21:00:46 2026-10-02 01:00:46        INFO        BeamManipulator::set+          Minor          : 9 arcsec
01-Oct-2026 21:00:46 2026-10-02 01:00:46        INFO        BeamManipulator::set+          Position Angle : 5 deg
01-Oct-2026 21:00:46 2026-10-02 01:00:46        INFO        image::_casaQuantityFromVar         Will use values specified in major, minor, pa to set beam
01-Oct-2026 21:00:46 2026-10-02 01:00:46        INFO        BeamManipulator::set        Beam parameters:  Major          : 11 arcsec
01-Oct-2026 21:00:46 2026-10-02 01:00:46        INFO        BeamManipulator::set+          Minor          : 10 arcsec
01-Oct-2026 21:00:46 2026-10-02 01:00:46        INFO        BeamManipulator::set+          Position Angle : 5 deg
01-Oct-2026 21:00:46 2026-10-02 01:00:46        INFO        image::_casaQuantityFromVar         Will use values specified in major, minor, pa to set beam
01-Oct-2026 21:00:46 2026-10-02 01:00:46        INFO        BeamManipulator::set        Beam parameters:  Major          : 12 arcsec
01-Oct-2026 21:00:46 2026-10-02 01:00:46        INFO        BeamManipulator::set+          Minor          : 11 arcsec
01-Oct-2026 21:00:46 2026-10-02 01:00:46        INFO        BeamManipulator::set+          Position Angle : 5 deg
01-Oct-2026 21:00:46 2026-10-02 01:00:46        INFO        image::_casaQuantityFromVar         Will use values specified in major, minor, pa to set beam
01-Oct-2026 21:00:46 2026-10-02 01:00:46        INFO        BeamManipulator::set        Beam parameters:  Major          : 10 arcsec
01-Oct-2026 21:00:46 2026-10-02 01:00:46        INFO        BeamManipulator::set+          Minor          : 9 arcsec
01-Oct-2026 21:00:46 2026-10-02 01:00:46        INFO        BeamManipulator::set+          Position Angle : 5 deg
01-Oct-2026 21:00:46 2026-10-02 01:00:46        INFO        image::_casaQuantityFromVar         Will use values specified in major, minor, pa to set beam
01-Oct-2026 21:00:46 2026-10-02 01:00:46        INFO        BeamManipulator::set        Beam parameters:  Major          : 11 arcsec
01-Oct-2026 21:00:46 2026-10-02 01:00:46        INFO        BeamManipulator::set+          Minor          : 10 arcsec
01-Oct-2026 21:00:46 2026-10-02 01:00:46        INFO        BeamManipulator::set+          Position Angle : 5 deg
01-Oct-2026 21:00:46 2026-10-02 01:00:46        INFO        image::_casaQuantityFromVar         Will use values specified in major, minor, pa to set beam
01-Oct-2026 21:00:46 2026-10-02 01:00:46        INFO        BeamManipulator::set        Beam parameters:  Major          : 12 arcsec
01-Oct-2026 21:00:46 2026-10-02 01:00:46        INFO        BeamManipulator::set+          Minor          : 11 arcsec
01-Oct-2026 21:00:46 2026-10-02 01:00:46        INFO        BeamManipulator::set+          Position Angle : 5 deg
01-Oct-2026 21:00:46 2026-10-02 01:00:46        INFO        image::_casaQuantityFromVar         Will use values specified in major, minor, pa to set beam
01-Oct-2026 21:00:46 2026-10-02 01:00:46        INFO        BeamManipulator::set        Beam parameters:  Major          : 13 arcsec
01-Oct-2026 21:00:46 2026-10-02 01:00:46        INFO        BeamManipulator::set+          Minor          : 12 arcsec
01-Oct-2026 21:00:46 2026-10-02 01:00:46        INFO        BeamManipulator::set+          Position Angle : 5 deg
01-Oct-2026 21:00:46 2026-10-02 01:00:46        INFO        image::_casaQuantityFromVar         Will use values specified in major, minor, pa to set beam
01-Oct-2026 21:00:46 2026-10-02 01:00:46        INFO        BeamManipulator::set        Beam parameters:  Major          : 11 arcsec
01-Oct-2026 21:00:46 2026-10-02 01:00:46        INFO        BeamManipulator::set+          Minor          : 10 arcsec
01-Oct-2026 21:00:46 2026-10-02 01:00:46        INFO        BeamManipulator::set+          Position Angle : 5 deg
01-Oct-2026 21:00:46 2026-10-02 01:00:46        INFO        image::_casaQuantityFromVar         Will use values specified in major, minor, pa to set beam
01-Oct-2026 21:00:46 2026-10-02 01:00:46        INFO        BeamManipulator::set        Beam parameters:  Major          : 12 arcsec
01-Oct-2026 21:00:46 2026-10-02 01:00:46        INFO        BeamManipulator::set+          Minor          : 11 arcsec
01-Oct-2026 21:00:46 2026-10-02 01:00:46        INFO        BeamManipulator::set+          Position Angle : 5 deg
01-Oct-2026 21:00:46 2026-10-02 01:00:46        INFO        image::_casaQuantityFromVar         Will use values specified in major, minor, pa to set beam
01-Oct-2026 21:00:46 2026-10-02 01:00:46        INFO        BeamManipulator::set        Beam parameters:  Major          : 13 arcsec
01-Oct-2026 21:00:46 2026-10-02 01:00:46        INFO        BeamManipulator::set+          Minor          : 12 arcsec
01-Oct-2026 21:00:46 2026-10-02 01:00:46        INFO        BeamManipulator::set+          Position Angle : 5 deg
01-Oct-2026 21:00:46 2026-10-02 01:00:46        INFO        image::_casaQuantityFromVar         Will use values specified in major, minor, pa to set beam
01-Oct-2026 21:00:46 2026-10-02 01:00:46        INFO        BeamManipulator::set        Beam parameters:  Major          : 14 arcsec
01-Oct-2026 21:00:46 2026-10-02 01:00:46        INFO        BeamManipulator::set+          Minor          : 13 arcsec
01-Oct-2026 21:00:46 2026-10-02 01:00:46        INFO        BeamManipulator::set+          Position Angle : 5 deg
01-Oct-2026 21:00:46 2026-10-02 01:00:46        INFO        ImageRegion::fromRecord        Selected bounding box :
01-Oct-2026 21:00:46 2026-10-02 01:00:46        INFO        ImageRegion::fromRecord+            [2, 2, 2, 2] to [5, 5, 5, 3]  (00:00:12.000, -00.03.00.000, 1.415e+09Hz, U to 00:00:00.000, +00.00.00.000, 1.415e+09Hz, V)
01-Oct-2026 21:00:46 2026-10-02 01:00:46        INFO        ImageRegion::fromRecord        Selected bounding box :
01-Oct-2026 21:00:46 2026-10-02 01:00:46        INFO        ImageRegion::fromRecord+            [2, 2, 2, 2] to [5, 5, 5, 2]  (00:00:12.000, -00.03.00.000, 1.415e+09Hz, U to 00:00:00.000, +00.00.00.000, 1.415e+09Hz, U)
01-Oct-2026 21:00:46 2026-10-02 01:00:46        INFO        ImageRegion::fromRecord        Selected bounding box :
01-Oct-2026 21:00:46 2026-10-02 01:00:46        INFO        ImageRegion::fromRecord+            [2, 2, 6, 1] to [5, 5, 6, 3]  (00:00:12.000, -00.03.00.000, 1.415e+09Hz, Q to 00:00:00.000, +00.00.00.000, 1.415e+09Hz, V)
01-Oct-2026 21:00:46 2026-10-02 01:00:46        INFO        name::        No table opened.
01-Oct-2026 21:00:46 2026-10-02 01:00:46        INFO        showcache::        The Table Cache is empty.
01-Oct-2026 21:00:46 test_tool_image_subimage.py::ia_subimage_test::test_beams
01-Oct-2026 21:00:46 Test per plane beams 
01-Oct-2026 21:00:46 PASSED
01-Oct-2026 21:00:46
01-Oct-2026 21:00:46 2026-10-02 01:00:46        INFO        ImageFactory::createImage        Created Paged image 'zz.im' of shape [20, 20] with float valued pixels.
01-Oct-2026 21:00:46 2026-10-02 01:00:46        INFO        ::::ImageFactory::createImage        Created Paged image 'zz.im' of shape [20, 20] with float valued pixels.
01-Oct-2026 21:00:46 2026-10-02 01:00:46        INFO        ::::image::fromshape        Ran ia.fromshape
01-Oct-2026 21:00:46 2026-10-02 01:00:46        INFO        ::::image::fromshape        ia.fromshape(outfile="zz.im", shape=[20,20], csys={...}, linear=false, overwrite=false, log=true, type="f")
01-Oct-2026 21:00:46 2026-10-02 01:00:46        INFO        ::::image::subimage        Ran ia.subimage
01-Oct-2026 21:00:46 2026-10-02 01:00:46        INFO        ::::image::subimage        ia.subimage(outfile="", region="", mask="", dropdeg=false, overwrite=false, list=true, stretch=false, wantreturn=true, keepaxes=[])
01-Oct-2026 21:00:46 2026-10-02 01:00:46        INFO        ImageFactory::createImage        Created Paged image 'gg' of shape [20, 20] with float valued pixels.
01-Oct-2026 21:00:46 2026-10-02 01:00:46        INFO        ::::ImageFactory::createImage        Created Paged image 'gg' of shape [20, 20] with float valued pixels.
01-Oct-2026 21:00:46 2026-10-02 01:00:46        INFO        name::        No table opened.
01-Oct-2026 21:00:46 2026-10-02 01:00:46        INFO        showcache::        The Table Cache is empty.
01-Oct-2026 21:00:46 test_tool_image_subimage.py::ia_subimage_test::test_history
01-Oct-2026 21:00:46 verify history writing
01-Oct-2026 21:00:46 PASSED
01-Oct-2026 21:00:46
01-Oct-2026 21:00:46 2026-10-02 01:00:46        INFO        ImageFactory::createImage        Created Temp image  of shape [10, 20, 30] with float valued pixels.
01-Oct-2026 21:00:46 2026-10-02 01:00:46        INFO        ImageRegion::fromRecord        Selected bounding box :
01-Oct-2026 21:00:46 2026-10-02 01:00:46        INFO        ImageRegion::fromRecord+            [0, 0, 0] to [9, 19, 29]  (00:00:20.000, -00.10.00.001, 1.41498e+09Hz to 23:59:44.000, +00.09.00.001, 1.41501e+09Hz)
01-Oct-2026 21:00:46 2026-10-02 01:00:46        INFO        ImageRegion::fromRecord        Selected bounding box :
01-Oct-2026 21:00:46 2026-10-02 01:00:46        INFO        ImageRegion::fromRecord+            [0, 0, 0] to [9, 19, 29]  (00:00:20.000, -00.10.00.001, 1.41498e+09Hz to 23:59:44.000, +00.09.00.001, 1.41501e+09Hz)
01-Oct-2026 21:00:46 2026-10-02 01:00:46        INFO        ImageFactory::createImage        Created Paged image 'keep.im' of shape [10, 20, 1, 1] with float valued pixels.
01-Oct-2026 21:00:46 2026-10-02 01:00:46        INFO        ImageRegion::fromRecord        Selected bounding box :
01-Oct-2026 21:00:46 2026-10-02 01:00:46        INFO        ImageRegion::fromRecord+            [0, 0, 0, 0] to [9, 19, 0, 0]  (00:00:20.000, -00.10.00.001, I, 1.415e+09Hz to 23:59:44.000, +00.09.00.001, I, 1.415e+09Hz)
01-Oct-2026 21:00:46 2026-10-02 01:00:46        INFO        ImageRegion::fromRecord        Selected bounding box :
01-Oct-2026 21:00:46 2026-10-02 01:00:46        INFO        ImageRegion::fromRecord+            [0, 0, 0, 0] to [9, 19, 0, 0]  (00:00:20.000, -00.10.00.001, I, 1.415e+09Hz to 23:59:44.000, +00.09.00.001, I, 1.415e+09Hz)
01-Oct-2026 21:00:46 2026-10-02 01:00:46        INFO        ImageRegion::fromRecord        Selected bounding box :
01-Oct-2026 21:00:46 2026-10-02 01:00:46        INFO        ImageRegion::fromRecord+            [0, 0, 0, 0] to [9, 19, 0, 0]  (00:00:20.000, -00.10.00.001, I, 1.415e+09Hz to 23:59:44.000, +00.09.00.001, I, 1.415e+09Hz)
01-Oct-2026 21:00:46 2026-10-02 01:00:46        INFO        name::        No table opened.
01-Oct-2026 21:00:46 2026-10-02 01:00:46        INFO        showcache::        The Table Cache is empty.
01-Oct-2026 21:00:46 test_tool_image_subimage.py::ia_subimage_test::test_keepaxes
01-Oct-2026 21:00:46 Test the keepaxes parameter
01-Oct-2026 21:00:46 PASSED
01-Oct-2026 21:00:46
01-Oct-2026 21:00:46 2026-10-02 01:00:46        INFO        ImageFactory::createImage        Created Temp image  of shape [2, 2] with float valued pixels.
01-Oct-2026 21:00:46 2026-10-02 01:00:46        INFO        ImageFactory::createImage        Created Temp image  of shape [2, 2] with Complex valued pixels.
01-Oct-2026 21:00:46 2026-10-02 01:00:46        INFO        ImageFactory::createImage        Created Temp image  of shape [2, 2] with double valued pixels.
01-Oct-2026 21:00:46 2026-10-02 01:00:46        INFO        ImageFactory::createImage        Created Temp image  of shape [2, 2] with DComplex valued pixels.
01-Oct-2026 21:00:46 2026-10-02 01:00:46        INFO        name::        No table opened.
01-Oct-2026 21:00:46 2026-10-02 01:00:46        INFO        showcache::        The Table Cache is empty.
01-Oct-2026 21:00:46 test_tool_image_subimage.py::ia_subimage_test::test_precision
01-Oct-2026 21:00:46 Test various precision valued image support
01-Oct-2026 21:00:46 PASSED
01-Oct-2026 21:00:46
01-Oct-2026 21:00:46 2026-10-02 01:00:46        INFO        ImageFactory::createImage        Created Paged image 'mask1.im' of shape [20, 30, 4, 10] with float valued pixels.
01-Oct-2026 21:00:46 2026-10-02 01:00:46        INFO        ImageFactory::createImage        Created Paged image 'mask2.im' of shape [20, 30, 4, 1] with float valued pixels.
01-Oct-2026 21:00:46 2026-10-02 01:00:46        INFO        ImageFactory::createImage        Created Paged image 'mask3.im' of shape [20, 30, 4, 2] with float valued pixels.
01-Oct-2026 21:00:46 2026-10-02 01:00:46        INFO        ImageFactory::createImage        Created Paged image 'xx.im' of shape [20, 30, 4, 10] with float valued pixels.
01-Oct-2026 21:00:46 2026-10-02 01:00:46        INFO        ImageMaskAttacher::makeMask        Created mask `mask0'
01-Oct-2026 21:00:46 2026-10-02 01:00:46        INFO        name::        No table opened.
01-Oct-2026 21:00:46 2026-10-02 01:00:46        INFO        showcache::        The Table Cache is empty.
01-Oct-2026 21:00:46 2026-10-02 01:00:46        SEVERE        image::_detached (file src/tools/image/image_cmpt.cc, line 1734)        Image is detached - cannot perform operation.
01-Oct-2026 21:00:46 2026-10-02 01:00:46        SEVERE        image::_detached (file src/tools/image/image_cmpt.cc, line 1734)+        Call image.open('filename') to reattach.
01-Oct-2026 21:00:46 2026-10-02 01:00:46        SEVERE        image::_detached (file src/tools/image/image_cmpt.cc, line 1734)        Exception Reported: Exception: Unable to create image.
01-Oct-2026 21:00:46 2026-10-02 01:00:46        SEVERE        image::_detached (file src/tools/image/image_cmpt.cc, line 1734)+        ... thrown by casac::image* casac::image::subimage(const string&, const casac::variant&, const casac::variant&, bool, bool, bool, bool, bool, const std::vector<long int>&) at File: src/tools/image/image_cmpt.cc, line: 6244
01-Oct-2026 21:00:46 2026-10-02 01:00:46        INFO        ImageMaskAttacher::makeMask        Created mask `mask0'
01-Oct-2026 21:00:46 2026-10-02 01:00:46        INFO        name::        No table opened.
01-Oct-2026 21:00:46 2026-10-02 01:00:46        INFO        showcache::        The Table Cache is empty.
01-Oct-2026 21:00:46 2026-10-02 01:00:46        SEVERE        image::subimage (file src/tools/image/image_cmpt.cc, line 6243)        Exception Reported: Unable to extend mask: ExtendSpecifier - new nor stretch axes given at File: /source/casainstall/include/casacpp/imageanalysis/ImageAnalysis/SubImageFactory.tcc, line: 313
01-Oct-2026 21:00:46 2026-10-02 01:00:46        INFO        name::        No table opened.
01-Oct-2026 21:00:46 2026-10-02 01:00:46        INFO        showcache::        The Table Cache is empty.
01-Oct-2026 21:00:46 test_tool_image_subimage.py::ia_subimage_test::test_stretch
01-Oct-2026 21:00:46 Test the stretch parameter
01-Oct-2026 21:00:46 PASSED
01-Oct-2026 21:00:46
01-Oct-2026 21:00:46 - generated xml file: /home/casatest/casa6/casatestutils/nosedir/xml/test_tool_image_subimage/nose.xml -
01-Oct-2026 21:00:46 ========================= 5 passed, 1 warning in 0.47s =========================
01-Oct-2026 21:00:46
01-Oct-2026 21:00:46 Test Directory: /home/casatest/casa6/casatestutils/nosedir/test_tool_msuvbinner
01-Oct-2026 21:00:46
01-Oct-2026 21:00:46 Running Command: pytest --junitxml=/home/casatest/casa6/casatestutils/nosedir/xml/test_tool_msuvbinner/nose.xml -s --disable-pytest-warnings --verbose -ra --tb=short /home/casatest/casa6/casatestutils/nosedir/test_tool_msuvbinner/
01-Oct-2026 21:00:46
01-Oct-2026 21:00:46 Setting Working Directory: /home/casatest/casa6/casatestutils/nosedir/test_tool_quanta/
01-Oct-2026 21:00:46 Test Directory: /home/casatest/casa6/casatestutils/nosedir/test_tool_quanta
01-Oct-2026 21:00:46
01-Oct-2026 21:00:46 Running Command: pytest --junitxml=/home/casatest/casa6/casatestutils/nosedir/xml/test_tool_quanta/nose.xml -s --disable-pytest-warnings --verbose -ra --tb=short /home/casatest/casa6/casatestutils/nosedir/test_tool_quanta/
01-Oct-2026 21:00:46
01-Oct-2026 21:00:46 Setting Working Directory: /home/casatest/casa6/casatestutils/nosedir/test_tool_ms/
01-Oct-2026 21:00:46 Test Directory: /home/casatest/casa6/casatestutils/nosedir/test_tool_ms
01-Oct-2026 21:00:46
01-Oct-2026 21:00:46 Running Command: pytest --junitxml=/home/casatest/casa6/casatestutils/nosedir/xml/test_tool_ms/nose.xml -s --disable-pytest-warnings --verbose -ra --tb=short /home/casatest/casa6/casatestutils/nosedir/test_tool_ms/
01-Oct-2026 21:00:46
01-Oct-2026 21:00:46 Setting Working Directory: /home/casatest/casa6/casatestutils/nosedir/test_tool_image_deviation/
01-Oct-2026 21:00:46 Test Directory: /home/casatest/casa6/casatestutils/nosedir/test_tool_image_deviation
01-Oct-2026 21:00:46
01-Oct-2026 21:00:46 Running Command: pytest --junitxml=/home/casatest/casa6/casatestutils/nosedir/xml/test_tool_image_deviation/nose.xml -s --disable-pytest-warnings --verbose -ra --tb=short /home/casatest/casa6/casatestutils/nosedir/test_tool_image_deviation/
01-Oct-2026 21:00:46
01-Oct-2026 21:00:46 Setting Working Directory: /home/casatest/casa6/casatestutils/nosedir/test_tool_calanalysis/
01-Oct-2026 21:00:46 Test Directory: /home/casatest/casa6/casatestutils/nosedir/test_tool_calanalysis
01-Oct-2026 21:00:46
01-Oct-2026 21:00:46 Running Command: pytest --junitxml=/home/casatest/casa6/casatestutils/nosedir/xml/test_tool_calanalysis/nose.xml -s --disable-pytest-warnings --verbose -ra --tb=short /home/casatest/casa6/casatestutils/nosedir/test_tool_calanalysis/
01-Oct-2026 21:00:46
01-Oct-2026 21:00:46 Setting Working Directory: /home/casatest/casa6/casatestutils/nosedir/test_tool_image_statistics/
01-Oct-2026 21:00:46 Test Directory: /home/casatest/casa6/casatestutils/nosedir/test_tool_image_statistics
01-Oct-2026 21:00:46
01-Oct-2026 21:00:46 Running Command: pytest --junitxml=/home/casatest/casa6/casatestutils/nosedir/xml/test_tool_image_statistics/nose.xml -s --disable-pytest-warnings --verbose -ra --tb=short /home/casatest/casa6/casatestutils/nosedir/test_tool_image_statistics/
01-Oct-2026 21:00:46
01-Oct-2026 21:00:46 Setting Working Directory: /home/casatest/casa6/casatestutils/nosedir/test_tool_vpmanager/
01-Oct-2026 21:00:46 Test Directory: /home/casatest/casa6/casatestutils/nosedir/test_tool_vpmanager
01-Oct-2026 21:00:46
01-Oct-2026 21:00:46 Running Command: pytest --junitxml=/home/casatest/casa6/casatestutils/nosedir/xml/test_tool_vpmanager/nose.xml -s --disable-pytest-warnings --verbose -ra --tb=short /home/casatest/casa6/casatestutils/nosedir/test_tool_vpmanager/
01-Oct-2026 21:00:46
01-Oct-2026 21:00:46 Setting Working Directory: /home/casatest/casa6/casatestutils/nosedir/test_tool_ms_statwt/
01-Oct-2026 21:00:46 Test Directory: /home/casatest/casa6/casatestutils/nosedir/test_tool_ms_statwt
01-Oct-2026 21:00:46
01-Oct-2026 21:00:46 Running Command: pytest --junitxml=/home/casatest/casa6/casatestutils/nosedir/xml/test_tool_ms_statwt/nose.xml -s --disable-pytest-warnings --verbose -ra --tb=short /home/casatest/casa6/casatestutils/nosedir/test_tool_ms_statwt/
01-Oct-2026 21:00:46
01-Oct-2026 21:00:46 Setting Working Directory: /home/casatest/casa6/casatestutils/nosedir/test_tool_image_fitprofile/
01-Oct-2026 21:00:46 Test Directory: /home/casatest/casa6/casatestutils/nosedir/test_tool_image_fitprofile
01-Oct-2026 21:00:46
01-Oct-2026 21:00:46 Running Command: pytest --junitxml=/home/casatest/casa6/casatestutils/nosedir/xml/test_tool_image_fitprofile/nose.xml -s --disable-pytest-warnings --verbose -ra --tb=short /home/casatest/casa6/casatestutils/nosedir/test_tool_image_fitprofile/
01-Oct-2026 21:00:46
01-Oct-2026 21:00:46 Setting Working Directory: /home/casatest/casa6/casatestutils/nosedir/test_tool_measures/
01-Oct-2026 21:00:46 Test Directory: /home/casatest/casa6/casatestutils/nosedir/test_tool_measures
01-Oct-2026 21:00:46
01-Oct-2026 21:00:46 Running Command: pytest --junitxml=/home/casatest/casa6/casatestutils/nosedir/xml/test_tool_measures/nose.xml -s --disable-pytest-warnings --verbose -ra --tb=short /home/casatest/casa6/casatestutils/nosedir/test_tool_measures/
01-Oct-2026 21:00:46
01-Oct-2026 21:00:46 Setting Working Directory: /home/casatest/casa6/casatestutils/nosedir/test_tool_image_collapse/
01-Oct-2026 21:00:46 Test Directory: /home/casatest/casa6/casatestutils/nosedir/test_tool_image_collapse
01-Oct-2026 21:00:46
01-Oct-2026 21:00:46 Running Command: pytest --junitxml=/home/casatest/casa6/casatestutils/nosedir/xml/test_tool_image_collapse/nose.xml -s --disable-pytest-warnings --verbose -ra --tb=short /home/casatest/casa6/casatestutils/nosedir/test_tool_image_collapse/
01-Oct-2026 21:00:46
01-Oct-2026 21:00:46 Setting Working Directory: /home/casatest/casa6/casatestutils/nosedir/test_tool_regionmanager/
01-Oct-2026 21:00:46 Test Directory: /home/casatest/casa6/casatestutils/nosedir/test_tool_regionmanager
01-Oct-2026 21:00:46
01-Oct-2026 21:00:46 Running Command: pytest --junitxml=/home/casatest/casa6/casatestutils/nosedir/xml/test_tool_regionmanager/nose.xml -s --disable-pytest-warnings --verbose -ra --tb=short /home/casatest/casa6/casatestutils/nosedir/test_tool_regionmanager/
01-Oct-2026 21:00:46
01-Oct-2026 21:00:46 Setting Working Directory: /home/casatest/casa6/casatestutils/nosedir/test_tool_linearmosaic/
01-Oct-2026 21:00:46 Test Directory: /home/casatest/casa6/casatestutils/nosedir/test_tool_linearmosaic
01-Oct-2026 21:00:46
01-Oct-2026 21:00:46 Running Command: pytest --junitxml=/home/casatest/casa6/casatestutils/nosedir/xml/test_tool_linearmosaic/nose.xml -s --disable-pytest-warnings --verbose -ra --tb=short /home/casatest/casa6/casatestutils/nosedir/test_tool_linearmosaic/
01-Oct-2026 21:00:46
01-Oct-2026 21:00:46 Setting Working Directory: /home/casatest/casa6/casatestutils/nosedir/test_tool_ms_createmultims/
01-Oct-2026 21:00:46 Test Directory: /home/casatest/casa6/casatestutils/nosedir/test_tool_ms_createmultims
01-Oct-2026 21:00:46
01-Oct-2026 21:00:46 Running Command: pytest --junitxml=/home/casatest/casa6/casatestutils/nosedir/xml/test_tool_ms_createmultims/nose.xml -s --disable-pytest-warnings --verbose -ra --tb=short /home/casatest/casa6/casatestutils/nosedir/test_tool_ms_createmultims/
01-Oct-2026 21:00:46
01-Oct-2026 21:00:46 Setting Working Directory: /home/casatest/casa6/casatestutils/nosedir/test_tool_componentlist/
01-Oct-2026 21:00:46 Test Directory: /home/casatest/casa6/casatestutils/nosedir/test_tool_componentlist
01-Oct-2026 21:00:46
01-Oct-2026 21:00:46 Running Command: pytest --junitxml=/home/casatest/casa6/casatestutils/nosedir/xml/test_tool_componentlist/nose.xml -s --disable-pytest-warnings --verbose -ra --tb=short /home/casatest/casa6/casatestutils/nosedir/test_tool_componentlist/
01-Oct-2026 21:00:46
01-Oct-2026 21:00:46 Setting Working Directory: /home/casatest/casa6/casatestutils/nosedir/test_tool_image_rebin/
01-Oct-2026 21:00:46 Test Directory: /home/casatest/casa6/casatestutils/nosedir/test_tool_image_rebin
01-Oct-2026 21:00:46
01-Oct-2026 21:00:46 Running Command: pytest --junitxml=/home/casatest/casa6/casatestutils/nosedir/xml/test_tool_image_rebin/nose.xml -s --disable-pytest-warnings --verbose -ra --tb=short /home/casatest/casa6/casatestutils/nosedir/test_tool_image_rebin/
01-Oct-2026 21:00:46
01-Oct-2026 21:00:46 Setting Working Directory: /home/casatest/casa6/casatestutils/nosedir/test_tool_table/
01-Oct-2026 21:00:46 Test Directory: /home/casatest/casa6/casatestutils/nosedir/test_tool_table
01-Oct-2026 21:00:46
01-Oct-2026 21:00:46 Running Command: pytest --junitxml=/home/casatest/casa6/casatestutils/nosedir/xml/test_tool_table/nose.xml -s --disable-pytest-warnings --verbose -ra --tb=short /home/casatest/casa6/casatestutils/nosedir/test_tool_table/
01-Oct-2026 21:00:46
01-Oct-2026 21:00:46 Setting Working Directory: /home/casatest/casa6/casatestutils/nosedir/test_tool_image_subimage/
01-Oct-2026 21:00:46 Test Directory: /home/casatest/casa6/casatestutils/nosedir/test_tool_image_subimage
01-Oct-2026 21:00:46
01-Oct-2026 21:00:46 Running Command: pytest --junitxml=/home/casatest/casa6/casatestutils/nosedir/xml/test_tool_image_subimage/nose.xml -s --disable-pytest-warnings --verbose -ra --tb=short /home/casatest/casa6/casatestutils/nosedir/test_tool_image_subimage/
01-Oct-2026 21:00:46 total 77840
01-Oct-2026 21:00:46 -rw-r--r-- 1 casaci 15001   161131 Oct  2 00:47 casatestutils-6.7.7.8a14803.dev2-py3-none-any.whl
01-Oct-2026 21:00:46 -rw-r--r-- 1 casaci 15001 79373132 Oct  2 00:47 casatools-6.7.7.8a14803.dev2-cp312-cp312-manylinux_2_28_x86_64.whl
01-Oct-2026 21:00:46 -rw-r--r-- 1 casaci root      4340 Oct  2 01:00 test_tool_agentflagger.xml
01-Oct-2026 21:00:46 -rw-r--r-- 1 casaci root      1006 Oct  2 01:00 test_tool_calanalysis.xml
01-Oct-2026 21:00:46 -rw-r--r-- 1 casaci root      2667 Oct  2 01:00 test_tool_calibrater.xml
01-Oct-2026 21:00:46 -rw-r--r-- 1 casaci root       687 Oct  2 01:00 test_tool_componentlist.xml
01-Oct-2026 21:00:46 -rw-r--r-- 1 casaci root      7467 Oct  2 01:00 test_tool_coordsys.xml
01-Oct-2026 21:00:46 -rw-r--r-- 1 casaci root     12935 Oct  2 01:00 test_tool_image.xml
01-Oct-2026 21:00:46 -rw-r--r-- 1 casaci root      2220 Oct  2 01:00 test_tool_image_collapse.xml
01-Oct-2026 21:00:46 -rw-r--r-- 1 casaci root      1048 Oct  2 01:00 test_tool_image_deviation.xml
01-Oct-2026 21:00:46 -rw-r--r-- 1 casaci root      2574 Oct  2 01:00 test_tool_image_fitprofile.xml
01-Oct-2026 21:00:46 -rw-r--r-- 1 casaci root      1178 Oct  2 01:00 test_tool_image_pbcor.xml
01-Oct-2026 21:00:46 -rw-r--r-- 1 casaci root       883 Oct  2 01:00 test_tool_image_pv.xml
01-Oct-2026 21:00:46 -rw-r--r-- 1 casaci root      1006 Oct  2 01:00 test_tool_image_rebin.xml
01-Oct-2026 21:00:46 -rw-r--r-- 1 casaci root      1336 Oct  2 01:00 test_tool_image_regrid.xml
01-Oct-2026 21:00:46 -rw-r--r-- 1 casaci root      1639 Oct  2 01:00 test_tool_image_statistics.xml
01-Oct-2026 21:00:46 -rw-r--r-- 1 casaci root       765 Oct  2 01:00 test_tool_image_subimage.xml
01-Oct-2026 21:00:46 -rw-r--r-- 1 casaci root       890 Oct  2 01:00 test_tool_image_transpose.xml
01-Oct-2026 21:00:46 -rw-r--r-- 1 casaci root      1966 Oct  2 01:00 test_tool_imagepol.xml
01-Oct-2026 21:00:46 -rw-r--r-- 1 casaci root       838 Oct  2 01:00 test_tool_linearmosaic.xml
01-Oct-2026 21:00:46 -rw-r--r-- 1 casaci root       669 Oct  2 01:00 test_tool_logsink.xml
01-Oct-2026 21:00:46 -rw-r--r-- 1 casaci root       549 Oct  2 01:00 test_tool_measures.xml
01-Oct-2026 21:00:46 -rw-r--r-- 1 casaci root      5224 Oct  2 01:00 test_tool_ms.xml
01-Oct-2026 21:00:46 -rw-r--r-- 1 casaci root       367 Oct  2 01:00 test_tool_ms_createmultims.xml
01-Oct-2026 21:00:46 -rw-r--r-- 1 casaci root      2099 Oct  2 01:00 test_tool_ms_statwt.xml
01-Oct-2026 21:00:46 -rw-r--r-- 1 casaci root      8633 Oct  2 01:00 test_tool_msmetadata.xml
01-Oct-2026 21:00:46 -rw-r--r-- 1 casaci root       359 Oct  2 01:00 test_tool_msuvbinner.xml
01-Oct-2026 21:00:46 -rw-r--r-- 1 casaci root      1171 Oct  2 01:00 test_tool_quanta.xml
01-Oct-2026 21:00:46 -rw-r--r-- 1 casaci root      3975 Oct  2 01:00 test_tool_regionmanager.xml
01-Oct-2026 21:00:46 -rw-r--r-- 1 casaci root      2071 Oct  2 01:00 test_tool_sdm.xml
01-Oct-2026 21:00:46 -rw-r--r-- 1 casaci root      2190 Oct  2 01:00 test_tool_sdm_toms.xml
01-Oct-2026 21:00:46 -rw-r--r-- 1 casaci root       670 Oct  2 01:00 test_tool_simulator.xml
01-Oct-2026 21:00:46 -rw-r--r-- 1 casaci root      1716 Oct  2 01:00 test_tool_synthesisutils.xml
01-Oct-2026 21:00:46 -rw-r--r-- 1 casaci root      1462 Oct  2 01:00 test_tool_table.xml
01-Oct-2026 21:00:46 -rw-r--r-- 1 casaci root      1717 Oct  2 01:00 test_tool_vpmanager.xml
01-Oct-2026 21:00:46 Finished task 'Test wheel' with result: Success
01-Oct-2026 21:00:46
Substituting variable: ${bamboo.agentId} with 153550855
01-Oct-2026 21:00:46
Substituting variable: ${bamboo.agentId} with 153550855
01-Oct-2026 21:00:46
Substituting variable: ${bamboo.agentId} with 153550855
01-Oct-2026 21:00:46
Substituting variable: ${bamboo.agentId} with 153550855
01-Oct-2026 21:00:46 Starting task 'Tar work directory' of type 'com.atlassian.bamboo.plugins.scripttask:task.builder.script'
01-Oct-2026 21:00:46
Beginning to execute external process for build 'CASASPECS - Dev Test 3.12 - CAS-14803 - Test Tools Many Linux 2.28 Py3.12 #2 (CASASPECS-DEVTESTPY312158-TTOMLPY312-2)'
... running command line:
/opt/ci_workspace/casa/bamboo/agent7/temp/CASASPECS-DEVTESTPY312158-TTOMLPY312-2-ScriptBuildTask-3588676639017625183.sh
... in: /opt/ci_workspace/casa/bamboo/agent7/xml-data/build-dir/CASASPECS-DEVTESTPY312158-TTOMLPY312
01-Oct-2026 21:00:46 Package working directory
01-Oct-2026 21:00:46 nosedir/
01-Oct-2026 21:00:46 nosedir/test_tool_sdm_toms/
01-Oct-2026 21:00:46 nosedir/test_tool_sdm_toms/test_tool_sdm_toms.py
01-Oct-2026 21:00:46 nosedir/test_tool_sdm_toms/conftest.py
01-Oct-2026 21:00:46 nosedir/test_tool_sdm_toms/casa-20261002-004926.log
01-Oct-2026 21:00:46 nosedir/test_tool_sdm_toms/short_summary.log
01-Oct-2026 21:00:46 nosedir/xml/
01-Oct-2026 21:00:46 nosedir/xml/test_tool_sdm_toms/
01-Oct-2026 21:00:46 nosedir/xml/test_tool_sdm_toms/nose.xml
01-Oct-2026 21:00:46 nosedir/xml/test_tool_image_pv/
01-Oct-2026 21:00:46 nosedir/xml/test_tool_image_pv/nose.xml
01-Oct-2026 21:00:46 nosedir/xml/test_tool_synthesisutils/
01-Oct-2026 21:00:46 nosedir/xml/test_tool_synthesisutils/nose.xml
01-Oct-2026 21:00:46 nosedir/xml/test_tool_image_regrid/
01-Oct-2026 21:00:46 nosedir/xml/test_tool_image_regrid/nose.xml
01-Oct-2026 21:00:46 nosedir/xml/test_tool_image_pbcor/
01-Oct-2026 21:00:46 nosedir/xml/test_tool_image_pbcor/nose.xml
01-Oct-2026 21:00:46 nosedir/xml/test_tool_logsink/
01-Oct-2026 21:00:46 nosedir/xml/test_tool_logsink/nose.xml
01-Oct-2026 21:00:46 nosedir/xml/test_tool_coordsys/
01-Oct-2026 21:00:46 nosedir/xml/test_tool_coordsys/nose.xml
01-Oct-2026 21:00:46 nosedir/xml/test_tool_image_transpose/
01-Oct-2026 21:00:46 nosedir/xml/test_tool_image_transpose/nose.xml
01-Oct-2026 21:00:46 nosedir/xml/test_tool_agentflagger/
01-Oct-2026 21:00:46 nosedir/xml/test_tool_agentflagger/nose.xml
01-Oct-2026 21:00:46 nosedir/xml/test_tool_simulator/
01-Oct-2026 21:00:46 nosedir/xml/test_tool_simulator/nose.xml
01-Oct-2026 21:00:46 nosedir/xml/test_tool_msmetadata/
01-Oct-2026 21:00:46 nosedir/xml/test_tool_msmetadata/nose.xml
01-Oct-2026 21:00:46 nosedir/xml/test_tool_sdm/
01-Oct-2026 21:00:46 nosedir/xml/test_tool_sdm/nose.xml
01-Oct-2026 21:00:46 nosedir/xml/test_tool_calibrater/
01-Oct-2026 21:00:46 nosedir/xml/test_tool_calibrater/nose.xml
01-Oct-2026 21:00:46 nosedir/xml/test_tool_imagepol/
01-Oct-2026 21:00:46 nosedir/xml/test_tool_imagepol/nose.xml
01-Oct-2026 21:00:46 nosedir/xml/test_tool_image/
01-Oct-2026 21:00:46 nosedir/xml/test_tool_image/nose.xml
01-Oct-2026 21:00:46 nosedir/xml/test_tool_msuvbinner/
01-Oct-2026 21:00:46 nosedir/xml/test_tool_msuvbinner/nose.xml
01-Oct-2026 21:00:46 nosedir/xml/test_tool_quanta/
01-Oct-2026 21:00:46 nosedir/xml/test_tool_quanta/nose.xml
01-Oct-2026 21:00:46 nosedir/xml/test_tool_ms/
01-Oct-2026 21:00:46 nosedir/xml/test_tool_ms/nose.xml
01-Oct-2026 21:00:46 nosedir/xml/test_tool_image_deviation/
01-Oct-2026 21:00:46 nosedir/xml/test_tool_image_deviation/nose.xml
01-Oct-2026 21:00:46 nosedir/xml/test_tool_calanalysis/
01-Oct-2026 21:00:46 nosedir/xml/test_tool_calanalysis/nose.xml
01-Oct-2026 21:00:46 nosedir/xml/test_tool_image_statistics/
01-Oct-2026 21:00:46 nosedir/xml/test_tool_image_statistics/nose.xml
01-Oct-2026 21:00:46 nosedir/xml/test_tool_vpmanager/
01-Oct-2026 21:00:46 nosedir/xml/test_tool_vpmanager/nose.xml
01-Oct-2026 21:00:46 nosedir/xml/test_tool_ms_statwt/
01-Oct-2026 21:00:46 nosedir/xml/test_tool_ms_statwt/nose.xml
01-Oct-2026 21:00:46 nosedir/xml/test_tool_image_fitprofile/
01-Oct-2026 21:00:46 nosedir/xml/test_tool_image_fitprofile/nose.xml
01-Oct-2026 21:00:46 nosedir/xml/test_tool_measures/
01-Oct-2026 21:00:46 nosedir/xml/test_tool_measures/nose.xml
01-Oct-2026 21:00:46 nosedir/xml/test_tool_image_collapse/
01-Oct-2026 21:00:46 nosedir/xml/test_tool_image_collapse/nose.xml
01-Oct-2026 21:00:46 nosedir/xml/test_tool_regionmanager/
01-Oct-2026 21:00:46 nosedir/xml/test_tool_regionmanager/nose.xml
01-Oct-2026 21:00:46 nosedir/xml/test_tool_linearmosaic/
01-Oct-2026 21:00:46 nosedir/xml/test_tool_linearmosaic/nose.xml
01-Oct-2026 21:00:46 nosedir/xml/test_tool_ms_createmultims/
01-Oct-2026 21:00:46 nosedir/xml/test_tool_ms_createmultims/nose.xml
01-Oct-2026 21:00:46 nosedir/xml/test_tool_componentlist/
01-Oct-2026 21:00:46 nosedir/xml/test_tool_componentlist/nose.xml
01-Oct-2026 21:00:46 nosedir/xml/test_tool_image_rebin/
01-Oct-2026 21:00:46 nosedir/xml/test_tool_image_rebin/nose.xml
01-Oct-2026 21:00:46 nosedir/xml/test_tool_table/
01-Oct-2026 21:00:46 nosedir/xml/test_tool_table/nose.xml
01-Oct-2026 21:00:46 nosedir/xml/test_tool_image_subimage/
01-Oct-2026 21:00:46 nosedir/xml/test_tool_image_subimage/nose.xml
01-Oct-2026 21:00:46 nosedir/summary_of_failed.log
01-Oct-2026 21:00:46 nosedir/test_tool_image_pv/
01-Oct-2026 21:00:46 nosedir/test_tool_image_pv/test_tool_image_pv.py
01-Oct-2026 21:00:46 nosedir/test_tool_image_pv/conftest.py
01-Oct-2026 21:00:46 nosedir/test_tool_image_pv/casa-20261002-005140.log
01-Oct-2026 21:00:46 nosedir/test_tool_image_pv/short_summary.log
01-Oct-2026 21:00:46 nosedir/test_tool_synthesisutils/
01-Oct-2026 21:00:46 nosedir/test_tool_synthesisutils/test_tool_synthesisutils.py
01-Oct-2026 21:00:46 nosedir/test_tool_synthesisutils/conftest.py
01-Oct-2026 21:00:46 nosedir/test_tool_synthesisutils/casa-20261002-005141.log
01-Oct-2026 21:00:46 nosedir/test_tool_synthesisutils/short_summary.log
01-Oct-2026 21:00:46 nosedir/test_tool_image_regrid/
01-Oct-2026 21:00:46 nosedir/test_tool_image_regrid/test_tool_image_regrid.py
01-Oct-2026 21:00:46 nosedir/test_tool_image_regrid/conftest.py
01-Oct-2026 21:00:46 nosedir/test_tool_image_regrid/casa-20261002-005147.log
01-Oct-2026 21:00:46 nosedir/test_tool_image_regrid/short_summary.log
01-Oct-2026 21:00:46 nosedir/test_tool_image_pbcor/
01-Oct-2026 21:00:46 nosedir/test_tool_image_pbcor/test_tool_image_pbcor.py
01-Oct-2026 21:00:46 nosedir/test_tool_image_pbcor/conftest.py
01-Oct-2026 21:00:46 nosedir/test_tool_image_pbcor/casa-20261002-005149.log
01-Oct-2026 21:00:46 nosedir/test_tool_image_pbcor/short_summary.log
01-Oct-2026 21:00:46 nosedir/test_tool_logsink/
01-Oct-2026 21:00:46 nosedir/test_tool_logsink/test_tool_logsink.py
01-Oct-2026 21:00:46 nosedir/test_tool_logsink/conftest.py
01-Oct-2026 21:00:46 nosedir/test_tool_logsink/casa-20261002-005150.log
01-Oct-2026 21:00:46 nosedir/test_tool_logsink/short_summary.log
01-Oct-2026 21:00:46 nosedir/test_tool_coordsys/
01-Oct-2026 21:00:46 nosedir/test_tool_coordsys/test_tool_coordsys.py
01-Oct-2026 21:00:46 nosedir/test_tool_coordsys/conftest.py
01-Oct-2026 21:00:46 nosedir/test_tool_coordsys/casa-20261002-005151.log
01-Oct-2026 21:00:46 nosedir/test_tool_coordsys/short_summary.log
01-Oct-2026 21:00:46 nosedir/test_tool_image_transpose/
01-Oct-2026 21:00:46 nosedir/test_tool_image_transpose/test_tool_image_transpose.py
01-Oct-2026 21:00:46 nosedir/test_tool_image_transpose/conftest.py
01-Oct-2026 21:00:46 nosedir/test_tool_image_transpose/casa-20261002-005151.log
01-Oct-2026 21:00:46 nosedir/test_tool_image_transpose/short_summary.log
01-Oct-2026 21:00:46 nosedir/test_tool_agentflagger/
01-Oct-2026 21:00:46 nosedir/test_tool_agentflagger/test_tool_agentflagger.py
01-Oct-2026 21:00:46 nosedir/test_tool_agentflagger/conftest.py
01-Oct-2026 21:00:46 nosedir/test_tool_agentflagger/casa-20261002-005152.log
01-Oct-2026 21:00:46 nosedir/test_tool_agentflagger/short_summary.log
01-Oct-2026 21:00:46 nosedir/test_tool_simulator/
01-Oct-2026 21:00:46 nosedir/test_tool_simulator/test_tool_simulator.py
01-Oct-2026 21:00:46 nosedir/test_tool_simulator/conftest.py
01-Oct-2026 21:00:46 nosedir/test_tool_simulator/casa-20261002-005236.log
01-Oct-2026 21:00:46 nosedir/test_tool_simulator/short_summary.log
01-Oct-2026 21:00:46 nosedir/test_tool_msmetadata/
01-Oct-2026 21:00:46 nosedir/test_tool_msmetadata/test_tool_msmetadata.py
01-Oct-2026 21:00:46 nosedir/test_tool_msmetadata/conftest.py
01-Oct-2026 21:00:46 nosedir/test_tool_msmetadata/casa-20261002-005242.log
01-Oct-2026 21:00:46 nosedir/test_tool_msmetadata/short_summary.log
01-Oct-2026 21:00:46 nosedir/test_tool_sdm/
01-Oct-2026 21:00:46 nosedir/test_tool_sdm/test_tool_sdm.py
01-Oct-2026 21:00:46 nosedir/test_tool_sdm/conftest.py
01-Oct-2026 21:00:46 nosedir/test_tool_sdm/casa-20261002-005245.log
01-Oct-2026 21:00:46 nosedir/test_tool_sdm/short_summary.log
01-Oct-2026 21:00:46 nosedir/test_tool_calibrater/
01-Oct-2026 21:00:46 nosedir/test_tool_calibrater/test_tool_calibrater.py
01-Oct-2026 21:00:46 nosedir/test_tool_calibrater/conftest.py
01-Oct-2026 21:00:46 nosedir/test_tool_calibrater/casa-20261002-005253.log
01-Oct-2026 21:00:46 nosedir/test_tool_calibrater/short_summary.log
01-Oct-2026 21:00:46 nosedir/test_tool_imagepol/
01-Oct-2026 21:00:46 nosedir/test_tool_imagepol/test_tool_imagepol.py
01-Oct-2026 21:00:46 nosedir/test_tool_imagepol/conftest.py
01-Oct-2026 21:00:46 nosedir/test_tool_imagepol/casa-20261002-005513.log
01-Oct-2026 21:00:46 nosedir/test_tool_imagepol/short_summary.log
01-Oct-2026 21:00:46 nosedir/test_tool_image/
01-Oct-2026 21:00:46 nosedir/test_tool_image/test_tool_image.py
01-Oct-2026 21:00:46 nosedir/test_tool_image/conftest.py
01-Oct-2026 21:00:46 nosedir/test_tool_image/casa-20261002-005514.log
01-Oct-2026 21:00:46 nosedir/test_tool_image/short_summary.log
01-Oct-2026 21:00:46 nosedir/test_tool_msuvbinner/
01-Oct-2026 21:00:46 nosedir/test_tool_msuvbinner/test_tool_msuvbinner.py
01-Oct-2026 21:00:46 nosedir/test_tool_msuvbinner/conftest.py
01-Oct-2026 21:00:46 nosedir/test_tool_msuvbinner/casa-20261002-005547.log
01-Oct-2026 21:00:46 nosedir/test_tool_msuvbinner/short_summary.log
01-Oct-2026 21:00:46 nosedir/test_tool_quanta/
01-Oct-2026 21:00:46 nosedir/test_tool_quanta/test_tool_quanta.py
01-Oct-2026 21:00:46 nosedir/test_tool_quanta/conftest.py
01-Oct-2026 21:00:46 nosedir/test_tool_quanta/casa-20261002-005548.log
01-Oct-2026 21:00:46 nosedir/test_tool_quanta/short_summary.log
01-Oct-2026 21:00:46 nosedir/test_tool_ms/
01-Oct-2026 21:00:46 nosedir/test_tool_ms/test_tool_ms.py
01-Oct-2026 21:00:46 nosedir/test_tool_ms/conftest.py
01-Oct-2026 21:00:46 nosedir/test_tool_ms/casa-20261002-005549.log
01-Oct-2026 21:00:46 nosedir/test_tool_ms/short_summary.log
01-Oct-2026 21:00:46 nosedir/test_tool_image_deviation/
01-Oct-2026 21:00:46 nosedir/test_tool_image_deviation/test_tool_image_deviation.py
01-Oct-2026 21:00:46 nosedir/test_tool_image_deviation/conftest.py
01-Oct-2026 21:00:46 nosedir/test_tool_image_deviation/casa-20261002-005616.log
01-Oct-2026 21:00:46 nosedir/test_tool_image_deviation/short_summary.log
01-Oct-2026 21:00:46 nosedir/test_tool_calanalysis/
01-Oct-2026 21:00:46 nosedir/test_tool_calanalysis/test_tool_calanalysis.py
01-Oct-2026 21:00:46 nosedir/test_tool_calanalysis/conftest.py
01-Oct-2026 21:00:46 nosedir/test_tool_calanalysis/casa-20261002-005620.log
01-Oct-2026 21:00:46 nosedir/test_tool_calanalysis/short_summary.log
01-Oct-2026 21:00:46 nosedir/test_tool_image_statistics/
01-Oct-2026 21:00:46 nosedir/test_tool_image_statistics/test_tool_image_statistics.py
01-Oct-2026 21:00:46 nosedir/test_tool_image_statistics/conftest.py
01-Oct-2026 21:00:46 nosedir/test_tool_image_statistics/casa-20261002-005621.log
01-Oct-2026 21:00:46 nosedir/test_tool_image_statistics/short_summary.log
01-Oct-2026 21:00:46 nosedir/test_tool_vpmanager/
01-Oct-2026 21:00:46 nosedir/test_tool_vpmanager/test_tool_vpmanager.py
01-Oct-2026 21:00:46 nosedir/test_tool_vpmanager/conftest.py
01-Oct-2026 21:00:46 nosedir/test_tool_vpmanager/casa-20261002-005759.log
01-Oct-2026 21:00:46 nosedir/test_tool_vpmanager/short_summary.log
01-Oct-2026 21:00:46 nosedir/test_tool_ms_statwt/
01-Oct-2026 21:00:46 nosedir/test_tool_ms_statwt/test_tool_ms_statwt.py
01-Oct-2026 21:00:46 nosedir/test_tool_ms_statwt/conftest.py
01-Oct-2026 21:00:46 nosedir/test_tool_ms_statwt/casa-20261002-005803.log
01-Oct-2026 21:00:46 nosedir/test_tool_ms_statwt/short_summary.log
01-Oct-2026 21:00:46 nosedir/test_tool_image_fitprofile/
01-Oct-2026 21:00:46 nosedir/test_tool_image_fitprofile/test_tool_image_fitprofile.py
01-Oct-2026 21:00:46 nosedir/test_tool_image_fitprofile/conftest.py
01-Oct-2026 21:00:46 nosedir/test_tool_image_fitprofile/casa-20261002-010017.log
01-Oct-2026 21:00:46 nosedir/test_tool_image_fitprofile/short_summary.log
01-Oct-2026 21:00:46 nosedir/test_tool_measures/
01-Oct-2026 21:00:46 nosedir/test_tool_measures/test_tool_measures.py
01-Oct-2026 21:00:46 nosedir/test_tool_measures/conftest.py
01-Oct-2026 21:00:46 nosedir/test_tool_measures/casa-20261002-010023.log
01-Oct-2026 21:00:46 nosedir/test_tool_measures/short_summary.log
01-Oct-2026 21:00:46 nosedir/test_tool_image_collapse/
01-Oct-2026 21:00:46 nosedir/test_tool_image_collapse/test_tool_image_collapse.py
01-Oct-2026 21:00:46 nosedir/test_tool_image_collapse/conftest.py
01-Oct-2026 21:00:46 nosedir/test_tool_image_collapse/casa-20261002-010024.log
01-Oct-2026 21:00:46 nosedir/test_tool_image_collapse/short_summary.log
01-Oct-2026 21:00:46 nosedir/test_tool_regionmanager/
01-Oct-2026 21:00:46 nosedir/test_tool_regionmanager/test_tool_regionmanager.py
01-Oct-2026 21:00:46 nosedir/test_tool_regionmanager/conftest.py
01-Oct-2026 21:00:46 nosedir/test_tool_regionmanager/casa-20261002-010024.log
01-Oct-2026 21:00:46 nosedir/test_tool_regionmanager/short_summary.log
01-Oct-2026 21:00:46 nosedir/test_tool_linearmosaic/
01-Oct-2026 21:00:46 nosedir/test_tool_linearmosaic/test_tool_linearmosaic.py
01-Oct-2026 21:00:46 nosedir/test_tool_linearmosaic/conftest.py
01-Oct-2026 21:00:46 nosedir/test_tool_linearmosaic/casa-20261002-010034.log
01-Oct-2026 21:00:46 nosedir/test_tool_linearmosaic/short_summary.log
01-Oct-2026 21:00:46 nosedir/test_tool_ms_createmultims/
01-Oct-2026 21:00:46 nosedir/test_tool_ms_createmultims/test_tool_ms_createmultims.py
01-Oct-2026 21:00:46 nosedir/test_tool_ms_createmultims/conftest.py
01-Oct-2026 21:00:46 nosedir/test_tool_ms_createmultims/casa-20261002-010040.log
01-Oct-2026 21:00:46 nosedir/test_tool_ms_createmultims/short_summary.log
01-Oct-2026 21:00:46 nosedir/test_tool_componentlist/
01-Oct-2026 21:00:46 nosedir/test_tool_componentlist/test_tool_componentlist.py
01-Oct-2026 21:00:46 nosedir/test_tool_componentlist/conftest.py
01-Oct-2026 21:00:46 nosedir/test_tool_componentlist/casa-20261002-010044.log
01-Oct-2026 21:00:46 nosedir/test_tool_componentlist/short_summary.log
01-Oct-2026 21:00:46 nosedir/test_tool_image_rebin/
01-Oct-2026 21:00:46 nosedir/test_tool_image_rebin/test_tool_image_rebin.py
01-Oct-2026 21:00:46 nosedir/test_tool_image_rebin/conftest.py
01-Oct-2026 21:00:46 nosedir/test_tool_image_rebin/casa-20261002-010044.log
01-Oct-2026 21:00:46 nosedir/test_tool_image_rebin/short_summary.log
01-Oct-2026 21:00:46 nosedir/test_tool_table/
01-Oct-2026 21:00:46 nosedir/test_tool_table/test_tool_table.py
01-Oct-2026 21:00:46 nosedir/test_tool_table/conftest.py
01-Oct-2026 21:00:46 nosedir/test_tool_table/casa-20261002-010045.log
01-Oct-2026 21:00:46 nosedir/test_tool_table/short_summary.log
01-Oct-2026 21:00:46 nosedir/test_tool_image_subimage/
01-Oct-2026 21:00:46 nosedir/test_tool_image_subimage/test_tool_image_subimage.py
01-Oct-2026 21:00:46 nosedir/test_tool_image_subimage/conftest.py
01-Oct-2026 21:00:46 nosedir/test_tool_image_subimage/casa-20261002-010046.log
01-Oct-2026 21:00:46 nosedir/test_tool_image_subimage/short_summary.log
01-Oct-2026 21:00:46 total 78024
01-Oct-2026 21:00:46 -rw-r--r-- 1 casaci 15001   161131 Oct  2 00:47 casatestutils-6.7.7.8a14803.dev2-py3-none-any.whl
01-Oct-2026 21:00:46 -rw-r--r-- 1 casaci 15001 79373132 Oct  2 00:47 casatools-6.7.7.8a14803.dev2-cp312-cp312-manylinux_2_28_x86_64.whl
01-Oct-2026 21:00:46 -rw-r--r-- 1 casaci root      4340 Oct  2 01:00 test_tool_agentflagger.xml
01-Oct-2026 21:00:46 -rw-r--r-- 1 casaci root      1006 Oct  2 01:00 test_tool_calanalysis.xml
01-Oct-2026 21:00:46 -rw-r--r-- 1 casaci root      2667 Oct  2 01:00 test_tool_calibrater.xml
01-Oct-2026 21:00:46 -rw-r--r-- 1 casaci root       687 Oct  2 01:00 test_tool_componentlist.xml
01-Oct-2026 21:00:46 -rw-r--r-- 1 casaci root      7467 Oct  2 01:00 test_tool_coordsys.xml
01-Oct-2026 21:00:46 -rw-r--r-- 1 casaci root     12935 Oct  2 01:00 test_tool_image.xml
01-Oct-2026 21:00:46 -rw-r--r-- 1 casaci root      2220 Oct  2 01:00 test_tool_image_collapse.xml
01-Oct-2026 21:00:46 -rw-r--r-- 1 casaci root      1048 Oct  2 01:00 test_tool_image_deviation.xml
01-Oct-2026 21:00:46 -rw-r--r-- 1 casaci root      2574 Oct  2 01:00 test_tool_image_fitprofile.xml
01-Oct-2026 21:00:46 -rw-r--r-- 1 casaci root      1178 Oct  2 01:00 test_tool_image_pbcor.xml
01-Oct-2026 21:00:46 -rw-r--r-- 1 casaci root       883 Oct  2 01:00 test_tool_image_pv.xml
01-Oct-2026 21:00:46 -rw-r--r-- 1 casaci root      1006 Oct  2 01:00 test_tool_image_rebin.xml
01-Oct-2026 21:00:46 -rw-r--r-- 1 casaci root      1336 Oct  2 01:00 test_tool_image_regrid.xml
01-Oct-2026 21:00:46 -rw-r--r-- 1 casaci root      1639 Oct  2 01:00 test_tool_image_statistics.xml
01-Oct-2026 21:00:46 -rw-r--r-- 1 casaci root       765 Oct  2 01:00 test_tool_image_subimage.xml
01-Oct-2026 21:00:46 -rw-r--r-- 1 casaci root       890 Oct  2 01:00 test_tool_image_transpose.xml
01-Oct-2026 21:00:46 -rw-r--r-- 1 casaci root      1966 Oct  2 01:00 test_tool_imagepol.xml
01-Oct-2026 21:00:46 -rw-r--r-- 1 casaci root       838 Oct  2 01:00 test_tool_linearmosaic.xml
01-Oct-2026 21:00:46 -rw-r--r-- 1 casaci root       669 Oct  2 01:00 test_tool_logsink.xml
01-Oct-2026 21:00:46 -rw-r--r-- 1 casaci root       549 Oct  2 01:00 test_tool_measures.xml
01-Oct-2026 21:00:46 -rw-r--r-- 1 casaci root      5224 Oct  2 01:00 test_tool_ms.xml
01-Oct-2026 21:00:46 -rw-r--r-- 1 casaci root       367 Oct  2 01:00 test_tool_ms_createmultims.xml
01-Oct-2026 21:00:46 -rw-r--r-- 1 casaci root      2099 Oct  2 01:00 test_tool_ms_statwt.xml
01-Oct-2026 21:00:46 -rw-r--r-- 1 casaci root      8633 Oct  2 01:00 test_tool_msmetadata.xml
01-Oct-2026 21:00:46 -rw-r--r-- 1 casaci root       359 Oct  2 01:00 test_tool_msuvbinner.xml
01-Oct-2026 21:00:46 -rw-r--r-- 1 casaci root      1171 Oct  2 01:00 test_tool_quanta.xml
01-Oct-2026 21:00:46 -rw-r--r-- 1 casaci root      3975 Oct  2 01:00 test_tool_regionmanager.xml
01-Oct-2026 21:00:46 -rw-r--r-- 1 casaci root      2071 Oct  2 01:00 test_tool_sdm.xml
01-Oct-2026 21:00:46 -rw-r--r-- 1 casaci root      2190 Oct  2 01:00 test_tool_sdm_toms.xml
01-Oct-2026 21:00:46 -rw-r--r-- 1 casaci root       670 Oct  2 01:00 test_tool_simulator.xml
01-Oct-2026 21:00:46 -rw-r--r-- 1 casaci root      1716 Oct  2 01:00 test_tool_synthesisutils.xml
01-Oct-2026 21:00:46 -rw-r--r-- 1 casaci root      1462 Oct  2 01:00 test_tool_table.xml
01-Oct-2026 21:00:46 -rw-r--r-- 1 casaci root      1717 Oct  2 01:00 test_tool_vpmanager.xml
01-Oct-2026 21:00:46 -rw-r--r-- 1 casaci root    187232 Oct  2 01:00 work-manylinux_228_casatools-3.12.tar.gz
01-Oct-2026 21:00:46 Done packaging working directory
01-Oct-2026 21:00:46 Finished task 'Tar work directory' with result: Success
01-Oct-2026 21:00:46 Starting task 'Parse tests' of type 'com.atlassian.bamboo.plugins.testresultparser:task.testresultparser.junit'
01-Oct-2026 21:00:46 Parsing test results under /opt/ci_workspace/casa/bamboo/agent7/xml-data/build-dir/CASASPECS-DEVTESTPY312158-TTOMLPY312...
01-Oct-2026 21:00:46 Finished task 'Parse tests' with result: Success
01-Oct-2026 21:00:46
Substituting variable: ${bamboo.agentId} with 153550855
01-Oct-2026 21:00:46
Substituting variable: ${bamboo.repository.branch.name} with CAS-14803
01-Oct-2026 21:00:46
Substituting variable: ${bamboo.agentId} with 153550855
01-Oct-2026 21:00:46
Substituting variable: ${bamboo.agentId} with 153550855
01-Oct-2026 21:00:46
Substituting variable: ${bamboo.agentId} with 153550855
01-Oct-2026 21:00:46
Substituting variable: ${bamboo.agentId} with 153550855
01-Oct-2026 21:00:46
Substituting variable: ${bamboo.agentId} with 153550855
01-Oct-2026 21:00:46 Starting task 'Upload wheel' of type 'com.atlassian.bamboo.plugins.scripttask:task.builder.script'
01-Oct-2026 21:00:46
Beginning to execute external process for build 'CASASPECS - Dev Test 3.12 - CAS-14803 - Test Tools Many Linux 2.28 Py3.12 #2 (CASASPECS-DEVTESTPY312158-TTOMLPY312-2)'
... running command line:
/opt/ci_workspace/casa/bamboo/agent7/temp/CASASPECS-DEVTESTPY312158-TTOMLPY312-2-ScriptBuildTask-11624059016409157502.sh
... in: /opt/ci_workspace/casa/bamboo/agent7/xml-data/build-dir/CASASPECS-DEVTESTPY312158-TTOMLPY312
01-Oct-2026 21:00:47 Collecting twine
01-Oct-2026 21:00:47   Downloading twine-7.0.0-py3-none-any.whl (43 kB)
01-Oct-2026 21:00:47      ━━━━━━━━━━━━━━━━━━━━━━━━━━━━━━━━━━━━━━━━ 43.2/43.2 kB 8.6 MB/s eta 0:00:00
01-Oct-2026 21:00:47 Collecting rfc3986>=1.4.0
01-Oct-2026 21:00:47   Downloading rfc3986-2.0.0-py2.py3-none-any.whl (31 kB)
01-Oct-2026 21:00:47 Collecting urllib3>=1.26.0
01-Oct-2026 21:00:47   Downloading urllib3-2.8.0-py3-none-any.whl (135 kB)
01-Oct-2026 21:00:47      ━━━━━━━━━━━━━━━━━━━━━━━━━━━━━━━━━━━━━━ 135.7/135.7 kB 27.8 MB/s eta 0:00:00
01-Oct-2026 21:00:47 Collecting requests-toolbelt!=0.9.0,>=0.8.0
01-Oct-2026 21:00:47   Downloading requests_toolbelt-1.0.0-py2.py3-none-any.whl (54 kB)
01-Oct-2026 21:00:47      ━━━━━━━━━━━━━━━━━━━━━━━━━━━━━━━━━━━━━━━━ 54.5/54.5 kB 19.8 MB/s eta 0:00:00
01-Oct-2026 21:00:47 Collecting readme-renderer>=35.0
01-Oct-2026 21:00:47   Downloading readme_renderer-46.0-py3-none-any.whl (14 kB)
01-Oct-2026 21:00:47 Collecting requests>=2.20
01-Oct-2026 21:00:47   Downloading requests-2.34.2-py3-none-any.whl (73 kB)
01-Oct-2026 21:00:47      ━━━━━━━━━━━━━━━━━━━━━━━━━━━━━━━━━━━━━━━━ 73.1/73.1 kB 34.2 MB/s eta 0:00:00
01-Oct-2026 21:00:47 Collecting packaging>=26.1
01-Oct-2026 21:00:47   Downloading packaging-26.3-py3-none-any.whl (129 kB)
01-Oct-2026 21:00:47      ━━━━━━━━━━━━━━━━━━━━━━━━━━━━━━━━━━━━━━ 130.0/130.0 kB 46.8 MB/s eta 0:00:00
01-Oct-2026 21:00:47 Collecting keyring>=21.2.0
01-Oct-2026 21:00:47   Downloading keyring-25.7.0-py3-none-any.whl (39 kB)
01-Oct-2026 21:00:47 Collecting rich>=14.3.3
01-Oct-2026 21:00:47   Downloading rich-15.0.0-py3-none-any.whl (310 kB)
01-Oct-2026 21:00:47      ━━━━━━━━━━━━━━━━━━━━━━━━━━━━━━━━━━━━━━ 310.7/310.7 kB 66.0 MB/s eta 0:00:00
01-Oct-2026 21:00:47 Collecting id
01-Oct-2026 21:00:47   Downloading id-1.6.1-py3-none-any.whl (14 kB)
01-Oct-2026 21:00:47 Collecting SecretStorage>=3.2
01-Oct-2026 21:00:47   Downloading secretstorage-3.5.0-py3-none-any.whl (15 kB)
01-Oct-2026 21:00:47 Collecting jaraco.context
01-Oct-2026 21:00:47   Downloading jaraco_context-6.1.2-py3-none-any.whl (7.9 kB)
01-Oct-2026 21:00:47 Collecting jaraco.functools
01-Oct-2026 21:00:47   Downloading jaraco_functools-4.6.0-py3-none-any.whl (11 kB)
01-Oct-2026 21:00:47 Collecting jeepney>=0.4.2
01-Oct-2026 21:00:47   Downloading jeepney-0.9.0-py3-none-any.whl (49 kB)
01-Oct-2026 21:00:47      ━━━━━━━━━━━━━━━━━━━━━━━━━━━━━━━━━━━━━━━━ 49.0/49.0 kB 18.7 MB/s eta 0:00:00
01-Oct-2026 21:00:47 Collecting importlib_metadata>=4.11.4
01-Oct-2026 21:00:47   Downloading importlib_metadata-9.0.1-py3-none-any.whl (27 kB)
01-Oct-2026 21:00:47 Collecting jaraco.classes
01-Oct-2026 21:00:47   Downloading jaraco.classes-3.4.0-py3-none-any.whl (6.8 kB)
01-Oct-2026 21:00:47 Collecting docutils>=0.21.2
01-Oct-2026 21:00:47   Downloading docutils-0.23-py3-none-any.whl (634 kB)
01-Oct-2026 21:00:47      ━━━━━━━━━━━━━━━━━━━━━━━━━━━━━━━━━━━━━━ 634.7/634.7 kB 91.4 MB/s eta 0:00:00
01-Oct-2026 21:00:47 Collecting nh3>=0.2.14
01-Oct-2026 21:00:47   Downloading nh3-0.3.7-cp38-abi3-manylinux_2_17_x86_64.manylinux2014_x86_64.whl (832 kB)
01-Oct-2026 21:00:47      ━━━━━━━━━━━━━━━━━━━━━━━━━━━━━━━━━━━━━━ 832.2/832.2 kB 59.5 MB/s eta 0:00:00
01-Oct-2026 21:00:47 Collecting Pygments>=2.5.1
01-Oct-2026 21:00:48   Downloading pygments-2.21.0-py3-none-any.whl (1.3 MB)
01-Oct-2026 21:00:48      ━━━━━━━━━━━━━━━━━━━━━━━━━━━━━━━━━━━━━━━━ 1.3/1.3 MB 70.6 MB/s eta 0:00:00
01-Oct-2026 21:00:48 Collecting certifi>=2023.5.7
01-Oct-2026 21:00:48   Downloading certifi-2026.7.22-py3-none-any.whl (136 kB)
01-Oct-2026 21:00:48      ━━━━━━━━━━━━━━━━━━━━━━━━━━━━━━━━━━━━━━ 137.0/137.0 kB 42.6 MB/s eta 0:00:00
01-Oct-2026 21:00:48 Collecting charset_normalizer<4,>=2
01-Oct-2026 21:00:48   Downloading charset_normalizer-3.5.2-cp310-cp310-manylinux2014_x86_64.manylinux_2_17_x86_64.manylinux_2_28_x86_64.whl (271 kB)
01-Oct-2026 21:00:48      ━━━━━━━━━━━━━━━━━━━━━━━━━━━━━━━━━━━━━━ 271.1/271.1 kB 52.7 MB/s eta 0:00:00
01-Oct-2026 21:00:48 Collecting idna<4,>=2.5
01-Oct-2026 21:00:48   Downloading idna-3.20-py3-none-any.whl (69 kB)
01-Oct-2026 21:00:48      ━━━━━━━━━━━━━━━━━━━━━━━━━━━━━━━━━━━━━━━━ 69.6/69.6 kB 34.5 MB/s eta 0:00:00
01-Oct-2026 21:00:48 Collecting markdown-it-py>=2.2.0
01-Oct-2026 21:00:48   Downloading markdown_it_py-4.2.0-py3-none-any.whl (91 kB)
01-Oct-2026 21:00:48      ━━━━━━━━━━━━━━━━━━━━━━━━━━━━━━━━━━━━━━━━ 91.7/91.7 kB 37.6 MB/s eta 0:00:00
01-Oct-2026 21:00:48 Collecting zipp>=3.20
01-Oct-2026 21:00:48   Downloading zipp-4.1.0-py3-none-any.whl (10 kB)
01-Oct-2026 21:00:48 Collecting mdurl~=0.1
01-Oct-2026 21:00:48   Downloading mdurl-0.1.2-py3-none-any.whl (10.0 kB)
01-Oct-2026 21:00:48 Collecting cryptography>=2.0
01-Oct-2026 21:00:48   Downloading cryptography-50.0.2-cp39-abi3-manylinux_2_28_x86_64.whl (4.8 MB)
01-Oct-2026 21:00:48      ━━━━━━━━━━━━━━━━━━━━━━━━━━━━━━━━━━━━━━━━ 4.8/4.8 MB 67.3 MB/s eta 0:00:00
01-Oct-2026 21:00:48 Collecting more-itertools
01-Oct-2026 21:00:48   Downloading more_itertools-11.1.0-py3-none-any.whl (72 kB)
01-Oct-2026 21:00:48      ━━━━━━━━━━━━━━━━━━━━━━━━━━━━━━━━━━━━━━━━ 72.2/72.2 kB 30.6 MB/s eta 0:00:00
01-Oct-2026 21:00:48 Collecting backports.tarfile
01-Oct-2026 21:00:48   Downloading backports.tarfile-1.2.0-py3-none-any.whl (30 kB)
01-Oct-2026 21:00:49 Collecting typing-extensions>=4.13.2
01-Oct-2026 21:00:49   Downloading typing_extensions-4.16.0-py3-none-any.whl (45 kB)
01-Oct-2026 21:00:49      ━━━━━━━━━━━━━━━━━━━━━━━━━━━━━━━━━━━━━━━━ 45.6/45.6 kB 21.3 MB/s eta 0:00:00
01-Oct-2026 21:00:49 Collecting cffi>=2.0.0
01-Oct-2026 21:00:49   Downloading cffi-2.1.1-cp310-cp310-manylinux2014_x86_64.manylinux_2_17_x86_64.whl (218 kB)
01-Oct-2026 21:00:49      ━━━━━━━━━━━━━━━━━━━━━━━━━━━━━━━━━━━━━━━ 218.7/218.7 kB 6.3 MB/s eta 0:00:00
01-Oct-2026 21:00:49 Collecting pycparser
01-Oct-2026 21:00:49   Downloading pycparser-3.0-py3-none-any.whl (48 kB)
01-Oct-2026 21:00:49      ━━━━━━━━━━━━━━━━━━━━━━━━━━━━━━━━━━━━━━━━ 48.2/48.2 kB 12.5 MB/s eta 0:00:00
01-Oct-2026 21:00:49 Installing collected packages: zipp, urllib3, typing-extensions, rfc3986, Pygments, pycparser, packaging, nh3, more-itertools, mdurl, jeepney, idna, docutils, charset_normalizer, certifi, backports.tarfile, requests, readme-renderer, markdown-it-py, jaraco.functools, jaraco.context, jaraco.classes, importlib_metadata, id, cffi, rich, requests-toolbelt, cryptography, SecretStorage, keyring, twine
01-Oct-2026 21:00:51 Successfully installed Pygments-2.21.0 SecretStorage-3.5.0 backports.tarfile-1.2.0 certifi-2026.7.22 cffi-2.1.1 charset_normalizer-3.5.2 cryptography-50.0.2 docutils-0.23 id-1.6.1 idna-3.20 importlib_metadata-9.0.1 jaraco.classes-3.4.0 jaraco.context-6.1.2 jaraco.functools-4.6.0 jeepney-0.9.0 keyring-25.7.0 markdown-it-py-4.2.0 mdurl-0.1.2 more-itertools-11.1.0 nh3-0.3.7 packaging-26.3 pycparser-3.0 readme-renderer-46.0 requests-2.34.2 requests-toolbelt-1.0.0 rfc3986-2.0.0 rich-15.0.0 twine-7.0.0 typing-extensions-4.16.0 urllib3-2.8.0 zipp-4.1.0
01-Oct-2026 21:00:51 WARNING: Running pip as the 'root' user can result in broken permissions and conflicting behaviour with the system package manager. It is recommended to use a virtual environment instead: https://pip.pypa.io/warnings/venv
01-Oct-2026 21:00:51
01-Oct-2026 21:00:51 [notice] A new release of pip is available: 23.0.1 -> 26.2.1
01-Oct-2026 21:00:51 [notice] To update, run: pip3 install --upgrade pip
01-Oct-2026 21:00:51 Cloning into 'casa-build-utils'...
01-Oct-2026 21:00:52 Uploading distributions to
01-Oct-2026 21:00:52 https://casa-pip.nrao.edu:443/repository/casa-dev-wheel/
01-Oct-2026 21:00:52 Uploading casatools-6.7.7.8a14803.dev2-cp312-cp312-manylinux_2_28_x86_64.whl
01-Oct-2026 21:00:52
01-Oct-2026 21:00:52   0% ━━━━━━━━━━━━━━━━━━━━━━━━━━━━━━━━━━━━━━━━ 0.0/79.4 MB • --:-- • ?
01-Oct-2026 21:00:52 21% ━━━━━━━━╺━━━━━━━━━━━━━━━━━━━━━━━━━━━━━━━ 16.7/79.4 MB • 00:01 • 241.4 MB/s
01-Oct-2026 21:00:52 21% ━━━━━━━━╺━━━━━━━━━━━━━━━━━━━━━━━━━━━━━━━ 16.7/79.4 MB • 00:01 • 241.4 MB/s
01-Oct-2026 21:00:52 26% ━━━━━━━━━━╺━━━━━━━━━━━━━━━━━━━━━━━━━━━━━ 20.6/79.4 MB • 00:01 • 77.6 MB/s
01-Oct-2026 21:00:52 31% ━━━━━━━━━━━━╺━━━━━━━━━━━━━━━━━━━━━━━━━━━ 24.4/79.4 MB • 00:02 • 47.4 MB/s
01-Oct-2026 21:00:52 32% ━━━━━━━━━━━━╸━━━━━━━━━━━━━━━━━━━━━━━━━━━ 25.7/79.4 MB • 00:02 • 43.3 MB/s
01-Oct-2026 21:00:52 38% ━━━━━━━━━━━━━━━╺━━━━━━━━━━━━━━━━━━━━━━━━ 29.9/79.4 MB • 00:02 • 32.8 MB/s
01-Oct-2026 21:00:53 39% ━━━━━━━━━━━━━━━╸━━━━━━━━━━━━━━━━━━━━━━━━ 31.0/79.4 MB • 00:02 • 26.3 MB/s
01-Oct-2026 21:00:53 42% ━━━━━━━━━━━━━━━━╸━━━━━━━━━━━━━━━━━━━━━━━ 33.2/79.4 MB • 00:02 • 33.8 MB/s
01-Oct-2026 21:00:53 49% ━━━━━━━━━━━━━━━━━━━╺━━━━━━━━━━━━━━━━━━━━ 38.6/79.4 MB • 00:02 • 34.0 MB/s
01-Oct-2026 21:00:53 51% ━━━━━━━━━━━━━━━━━━━━╺━━━━━━━━━━━━━━━━━━━ 40.4/79.4 MB • 00:02 • 26.9 MB/s
01-Oct-2026 21:00:53 55% ━━━━━━━━━━━━━━━━━━━━━━╺━━━━━━━━━━━━━━━━━ 43.7/79.4 MB • 00:02 • 34.0 MB/s
01-Oct-2026 21:00:53 61% ━━━━━━━━━━━━━━━━━━━━━━━━╸━━━━━━━━━━━━━━━ 48.8/79.4 MB • 00:01 • 33.6 MB/s
01-Oct-2026 21:00:53 61% ━━━━━━━━━━━━━━━━━━━━━━━━╸━━━━━━━━━━━━━━━ 48.8/79.4 MB • 00:01 • 33.6 MB/s
01-Oct-2026 21:00:53 66% ━━━━━━━━━━━━━━━━━━━━━━━━━━╺━━━━━━━━━━━━━ 52.2/79.4 MB • 00:01 • 33.5 MB/s
01-Oct-2026 21:00:53 70% ━━━━━━━━━━━━━━━━━━━━━━━━━━━━╺━━━━━━━━━━━ 55.9/79.4 MB • 00:01 • 31.7 MB/s
01-Oct-2026 21:00:53 73% ━━━━━━━━━━━━━━━━━━━━━━━━━━━━━╺━━━━━━━━━━ 57.9/79.4 MB • 00:01 • 30.0 MB/s
01-Oct-2026 21:00:54 78% ━━━━━━━━━━━━━━━━━━━━━━━━━━━━━━━╺━━━━━━━━ 62.2/79.4 MB • 00:01 • 33.2 MB/s
01-Oct-2026 21:00:54 84% ━━━━━━━━━━━━━━━━━━━━━━━━━━━━━━━━━╺━━━━━━ 66.4/79.4 MB • 00:01 • 33.3 MB/s
01-Oct-2026 21:00:54 84% ━━━━━━━━━━━━━━━━━━━━━━━━━━━━━━━━━╺━━━━━━ 66.4/79.4 MB • 00:01 • 33.3 MB/s
01-Oct-2026 21:00:54 89% ━━━━━━━━━━━━━━━━━━━━━━━━━━━━━━━━━━━╸━━━━ 70.6/79.4 MB • 00:01 • 34.3 MB/s
01-Oct-2026 21:00:54 94% ━━━━━━━━━━━━━━━━━━━━━━━━━━━━━━━━━━━━━╸━━ 74.8/79.4 MB • 00:01 • 35.8 MB/s
01-Oct-2026 21:00:54 94% ━━━━━━━━━━━━━━━━━━━━━━━━━━━━━━━━━━━━━╸━━ 74.8/79.4 MB • 00:01 • 35.8 MB/s
01-Oct-2026 21:00:54 100% ━━━━━━━━━━━━━━━━━━━━━━━━━━━━━━━━━━━━━━━━ 79.4/79.4 MB • 00:02 • 35.2 MB/s
01-Oct-2026 21:00:54 100% ━━━━━━━━━━━━━━━━━━━━━━━━━━━━━━━━━━━━━━━━ 79.4/79.4 MB • 00:02 • 35.2 MB/s
01-Oct-2026 21:00:54 100% ━━━━━━━━━━━━━━━━━━━━━━━━━━━━━━━━━━━━━━━━ 79.4/79.4 MB • 00:02 • 35.2 MB/s
01-Oct-2026 21:00:54 100% ━━━━━━━━━━━━━━━━━━━━━━━━━━━━━━━━━━━━━━━━ 79.4/79.4 MB • 00:02 • 35.2 MB/s
01-Oct-2026 21:00:55 100% ━━━━━━━━━━━━━━━━━━━━━━━━━━━━━━━━━━━━━━━━ 79.4/79.4 MB • 00:02 • 35.2 MB/s
01-Oct-2026 21:00:55 100% ━━━━━━━━━━━━━━━━━━━━━━━━━━━━━━━━━━━━━━━━ 79.4/79.4 MB • 00:02 • 35.2 MB/s
01-Oct-2026 21:00:55 100% ━━━━━━━━━━━━━━━━━━━━━━━━━━━━━━━━━━━━━━━━ 79.4/79.4 MB • 00:02 • 35.2 MB/s
01-Oct-2026 21:00:55 100% ━━━━━━━━━━━━━━━━━━━━━━━━━━━━━━━━━━━━━━━━ 79.4/79.4 MB • 00:02 • 35.2 MB/s
01-Oct-2026 21:00:55 100% ━━━━━━━━━━━━━━━━━━━━━━━━━━━━━━━━━━━━━━━━ 79.4/79.4 MB • 00:02 • 35.2 MB/s
01-Oct-2026 21:00:55 100% ━━━━━━━━━━━━━━━━━━━━━━━━━━━━━━━━━━━━━━━━ 79.4/79.4 MB • 00:02 • 35.2 MB/s
01-Oct-2026 21:00:55 100% ━━━━━━━━━━━━━━━━━━━━━━━━━━━━━━━━━━━━━━━━ 79.4/79.4 MB • 00:02 • 35.2 MB/s
01-Oct-2026 21:00:55 100% ━━━━━━━━━━━━━━━━━━━━━━━━━━━━━━━━━━━━━━━━ 79.4/79.4 MB • 00:02 • 35.2 MB/s
01-Oct-2026 21:00:55 100% ━━━━━━━━━━━━━━━━━━━━━━━━━━━━━━━━━━━━━━━━ 79.4/79.4 MB • 00:02 • 35.2 MB/s
01-Oct-2026 21:00:55 100% ━━━━━━━━━━━━━━━━━━━━━━━━━━━━━━━━━━━━━━━━ 79.4/79.4 MB • 00:02 • 35.2 MB/s
01-Oct-2026 21:00:56 100% ━━━━━━━━━━━━━━━━━━━━━━━━━━━━━━━━━━━━━━━━ 79.4/79.4 MB • 00:02 • 35.2 MB/s
01-Oct-2026 21:00:56 100% ━━━━━━━━━━━━━━━━━━━━━━━━━━━━━━━━━━━━━━━━ 79.4/79.4 MB • 00:02 • 35.2 MB/s
01-Oct-2026 21:00:56 100% ━━━━━━━━━━━━━━━━━━━━━━━━━━━━━━━━━━━━━━━━ 79.4/79.4 MB • 00:02 • 35.2 MB/s
01-Oct-2026 21:00:56 100% ━━━━━━━━━━━━━━━━━━━━━━━━━━━━━━━━━━━━━━━━ 79.4/79.4 MB • 00:02 • 35.2 MB/s
01-Oct-2026 21:00:56 Uploading distributions to
01-Oct-2026 21:00:56 https://casa-pip.nrao.edu:443/repository/casa-dev-wheel/
01-Oct-2026 21:00:56 Uploading casatestutils-6.7.7.8a14803.dev2-py3-none-any.whl
01-Oct-2026 21:00:56
01-Oct-2026 21:00:56   0% ━━━━━━━━━━━━━━━━━━━━━━━━━━━━━━━━━━━━━━━━ 0.0/174.5 kB • --:-- • ?
01-Oct-2026 21:00:56 100% ━━━━━━━━━━━━━━━━━━━━━━━━━━━━━━━━━━━━━━━ 174.5/174.5 kB • 00:00 • 215.9 MB/s
01-Oct-2026 21:00:56 100% ━━━━━━━━━━━━━━━━━━━━━━━━━━━━━━━━━━━━━━━ 174.5/174.5 kB • 00:00 • 215.9 MB/s
01-Oct-2026 21:00:56 100% ━━━━━━━━━━━━━━━━━━━━━━━━━━━━━━━━━━━━━━━ 174.5/174.5 kB • 00:00 • 215.9 MB/s
01-Oct-2026 21:00:56
01-Oct-2026 21:00:56 Finished task 'Upload wheel' with result: Success
01-Oct-2026 21:00:56
Substituting variable: ${bamboo.agentId} with 153550855
01-Oct-2026 21:00:56
Substituting variable: ${bamboo.agentId} with 153550855
01-Oct-2026 21:00:56 Starting task 'Cleanup' of type 'com.atlassian.bamboo.plugins.scripttask:task.builder.script'
01-Oct-2026 21:00:56
Beginning to execute external process for build 'CASASPECS - Dev Test 3.12 - CAS-14803 - Test Tools Many Linux 2.28 Py3.12 #2 (CASASPECS-DEVTESTPY312158-TTOMLPY312-2)'
... running command line:
/opt/ci_workspace/casa/bamboo/agent7/temp/CASASPECS-DEVTESTPY312158-TTOMLPY312-2-ScriptBuildTask-8104734051858194850.sh
... in: /opt/ci_workspace/casa/bamboo/agent7/xml-data/build-dir/CASASPECS-DEVTESTPY312158-TTOMLPY312
01-Oct-2026 21:00:56 Starting cleanup
01-Oct-2026 21:01:07 wheel-container-test_153550855
01-Oct-2026 21:01:09 wheel-container-test_153550855
01-Oct-2026 21:01:09 Cleanup complete
01-Oct-2026 21:01:09 Finished task 'Cleanup' with result: Success
01-Oct-2026 21:01:09 Running post build plugin 'Docker Container Cleanup'
01-Oct-2026 21:01:09
Beginning to execute external process for build 'CASASPECS - Dev Test 3.12 - CAS-14803 - Test Tools Many Linux 2.28 Py3.12 #2 (CASASPECS-DEVTESTPY312158-TTOMLPY312-2)'
... running command line:
/usr/bin/docker rm -f wheel-container-test_153550855
... in: /opt/ci_workspace/casa/bamboo/agent7/xml-data/build-dir/CASASPECS-DEVTESTPY312158-TTOMLPY312
01-Oct-2026 21:01:09 Running post build plugin 'NCover Results Collector'
01-Oct-2026 21:01:09 Running post build plugin 'Build Results Label Collector'
01-Oct-2026 21:01:09 Running post build plugin 'Clover Results Collector'
01-Oct-2026 21:01:09 Running post build plugin 'npm Cache Cleanup'
01-Oct-2026 21:01:09 Running post build plugin 'Artifact Copier'
01-Oct-2026 21:01:09 Publishing an artifact: Workdir
01-Oct-2026 21:01:09 Finished publishing of artifact Non required job artifact Http Compression On : [Workdir], patterns: [work*.tar.gz] anchored at: [wheeldirectory/] in 49.16 ms
01-Oct-2026 21:01:09 Publishing an artifact: XML Directories
01-Oct-2026 21:01:09 Finished publishing of artifact Non required job artifact Http Compression On : [XML Directories], patterns: [**/*.xml] anchored at: [wheeldirectory/] in 115.4 ms
01-Oct-2026 21:01:09 Finalising the build...
01-Oct-2026 21:01:09 Stopping timer.
01-Oct-2026 21:01:09 Build CASASPECS-DEVTESTPY312158-TTOMLPY312-2 completed.
01-Oct-2026 21:01:09 Running on server: post build plugin 'Build Hanging Detection Configuration'
01-Oct-2026 21:01:09 Running on server: post build plugin 'NCover Results Collector'
01-Oct-2026 21:01:09 Running on server: post build plugin 'Build Labeller'
01-Oct-2026 21:01:09 Running on server: post build plugin 'Clover Delta Calculator'
01-Oct-2026 21:01:09 Running on server: post build plugin 'Maven Dependencies Postprocessor'
01-Oct-2026 21:01:09 All post build plugins have finished
01-Oct-2026 21:01:09 Generating build results summary...
01-Oct-2026 21:01:09 Saving build results to disk...
01-Oct-2026 21:01:09 Store variable context...
01-Oct-2026 21:01:09 Finished building CASASPECS-DEVTESTPY312158-TTOMLPY312-2.