Build: #2 failed

Job: Test Tasks macOS 15 Py3.12 failed

Build log

The build generated 707 lines of output. Download or view full build log.

01-Oct-2026 22:32:21 Build CASASPECS - Dev Test 3.12 - CAS-14803 - Test Tasks macOS 15 Py3.12 #2 (CASASPECS-DEVTESTPY312158-TTARM15PY312-2) is being prepared for building on agent cbt-macos15-test-m4-1, bamboo version: 9.6.26
01-Oct-2026 22:32:21 Remote agent on host cbt-macos15-test-m4-1
01-Oct-2026 22:32:21 Build working directory is /Users/casaci/bamboohome/xml-data/build-dir/CASASPECS-DEVTESTPY312158-TTARM15PY312
01-Oct-2026 22:32:22 Executing build CASASPECS - Dev Test 3.12 - CAS-14803 - Test Tasks macOS 15 Py3.12 #2 (CASASPECS-DEVTESTPY312158-TTARM15PY312-2)
01-Oct-2026 22:32:22 Starting task 'Source Code Checkout' of type 'com.atlassian.bamboo.plugins.vcs:task.vcs.checkout'
01-Oct-2026 22:32:22 Build always requires a clean checkout
01-Oct-2026 22:32:22 Cleaning build directory '/Users/casaci/bamboohome/xml-data/build-dir/CASASPECS-DEVTESTPY312158-TTARM15PY312'
01-Oct-2026 22:32:27 Checking out into /Users/casaci/bamboohome/xml-data/build-dir/CASASPECS-DEVTESTPY312158-TTARM15PY312
01-Oct-2026 22:32:27 Updating source code to revision: fca4920fd5894af7a8bc45e3d5a8675122e76335
01-Oct-2026 22:32:27 Fetching 'refs/heads/CAS-14803' from 'ssh://git@open-bitbucket.nrao.edu:7999/casa/casa6.git'.
01-Oct-2026 22:32:27 Warning: Permanently added '[127.0.0.1]:49161' (RSA) to the list of known hosts.
01-Oct-2026 22:32:29 Checking out revision fca4920fd5894af7a8bc45e3d5a8675122e76335.
01-Oct-2026 22:32:29 Creating local git repository in '/Users/casaci/bamboohome/xml-data/build-dir/CASASPECS-DEVTESTPY312158-TTARM15PY312/.git'.
01-Oct-2026 22:32:29 Cloning into '/Users/casaci/bamboohome/xml-data/build-dir/CASASPECS-DEVTESTPY312158-TTARM15PY312'...
01-Oct-2026 22:32:29 done.
01-Oct-2026 22:32:31 Switched to a new branch 'CAS-14803'
01-Oct-2026 22:32:31 branch 'CAS-14803' set up to track 'origin/CAS-14803'.
01-Oct-2026 22:32:31 Submodule 'casatools/casacore' (https://github.com/casacore/casacore.git) registered for path 'casatools/casacore'
01-Oct-2026 22:32:31 Submodule 'casatools/grpc-source' (https://github.com/grpc/grpc) registered for path 'casatools/grpc-source'
01-Oct-2026 22:32:31 Cloning into '/Users/casaci/bamboohome/xml-data/build-dir/CASASPECS-DEVTESTPY312158-TTARM15PY312/casatools/casacore'...
01-Oct-2026 22:32:46 Cloning into '/Users/casaci/bamboohome/xml-data/build-dir/CASASPECS-DEVTESTPY312158-TTARM15PY312/casatools/grpc-source'...
01-Oct-2026 22:33:35 Submodule path 'casatools/casacore': checked out 'aaf72eb7edd5a5fecefa78ca04713233b7b6ffd6'
01-Oct-2026 22:33:35 Submodule path 'casatools/grpc-source': checked out 'cca868ac8f3641df4003a82b7fc54c921e14f765'
01-Oct-2026 22:33:35 Submodule 'third_party/abseil-cpp' (https://github.com/abseil/abseil-cpp) registered for path 'casatools/grpc-source/third_party/abseil-cpp'
01-Oct-2026 22:33:35 Submodule 'third_party/benchmark' (https://github.com/google/benchmark) registered for path 'casatools/grpc-source/third_party/benchmark'
01-Oct-2026 22:33:35 Submodule 'third_party/bloaty' (https://github.com/google/bloaty.git) registered for path 'casatools/grpc-source/third_party/bloaty'
01-Oct-2026 22:33:35 Submodule 'third_party/boringssl' (https://github.com/google/boringssl.git) registered for path 'casatools/grpc-source/third_party/boringssl'
01-Oct-2026 22:33:35 Submodule 'third_party/boringssl-with-bazel' (https://github.com/google/boringssl.git) registered for path 'casatools/grpc-source/third_party/boringssl-with-bazel'
01-Oct-2026 22:33:35 Submodule 'third_party/cares/cares' (https://github.com/c-ares/c-ares.git) registered for path 'casatools/grpc-source/third_party/cares/cares'
01-Oct-2026 22:33:35 Submodule 'third_party/gflags' (https://github.com/gflags/gflags.git) registered for path 'casatools/grpc-source/third_party/gflags'
01-Oct-2026 22:33:35 Submodule 'third_party/googletest' (https://github.com/google/googletest.git) registered for path 'casatools/grpc-source/third_party/googletest'
01-Oct-2026 22:33:35 Submodule 'third_party/protobuf' (https://github.com/google/protobuf.git) registered for path 'casatools/grpc-source/third_party/protobuf'
01-Oct-2026 22:33:35 Submodule 'third_party/zlib' (https://github.com/madler/zlib) registered for path 'casatools/grpc-source/third_party/zlib'
01-Oct-2026 22:33:35 Cloning into '/Users/casaci/bamboohome/xml-data/build-dir/CASASPECS-DEVTESTPY312158-TTARM15PY312/casatools/grpc-source/third_party/abseil-cpp'...
01-Oct-2026 22:33:37 Cloning into '/Users/casaci/bamboohome/xml-data/build-dir/CASASPECS-DEVTESTPY312158-TTARM15PY312/casatools/grpc-source/third_party/benchmark'...
01-Oct-2026 22:33:38 Cloning into '/Users/casaci/bamboohome/xml-data/build-dir/CASASPECS-DEVTESTPY312158-TTARM15PY312/casatools/grpc-source/third_party/bloaty'...
01-Oct-2026 22:33:39 Cloning into '/Users/casaci/bamboohome/xml-data/build-dir/CASASPECS-DEVTESTPY312158-TTARM15PY312/casatools/grpc-source/third_party/boringssl'...
01-Oct-2026 22:34:05 Cloning into '/Users/casaci/bamboohome/xml-data/build-dir/CASASPECS-DEVTESTPY312158-TTARM15PY312/casatools/grpc-source/third_party/boringssl-with-bazel'...
01-Oct-2026 22:34:33 Cloning into '/Users/casaci/bamboohome/xml-data/build-dir/CASASPECS-DEVTESTPY312158-TTARM15PY312/casatools/grpc-source/third_party/cares/cares'...
01-Oct-2026 22:34:34 Cloning into '/Users/casaci/bamboohome/xml-data/build-dir/CASASPECS-DEVTESTPY312158-TTARM15PY312/casatools/grpc-source/third_party/gflags'...
01-Oct-2026 22:34:35 Cloning into '/Users/casaci/bamboohome/xml-data/build-dir/CASASPECS-DEVTESTPY312158-TTARM15PY312/casatools/grpc-source/third_party/googletest'...
01-Oct-2026 22:34:37 Cloning into '/Users/casaci/bamboohome/xml-data/build-dir/CASASPECS-DEVTESTPY312158-TTARM15PY312/casatools/grpc-source/third_party/protobuf'...
01-Oct-2026 22:34:57 Cloning into '/Users/casaci/bamboohome/xml-data/build-dir/CASASPECS-DEVTESTPY312158-TTARM15PY312/casatools/grpc-source/third_party/zlib'...
01-Oct-2026 22:34:58 Submodule path 'casatools/grpc-source/third_party/abseil-cpp': checked out 'cc4bed2d74f7c8717e31f9579214ab52a9c9c610'
01-Oct-2026 22:34:58 Submodule path 'casatools/grpc-source/third_party/benchmark': checked out '5b7683f49e1e9223cf9927b24f6fd3d6bd82e3f8'
01-Oct-2026 22:34:58 Submodule path 'casatools/grpc-source/third_party/bloaty': checked out '73594cde8c9a52a102c4341c244c833aa61b9c06'
01-Oct-2026 22:34:58 Submodule 'third_party/googletest' (https://github.com/google/googletest.git) registered for path 'casatools/grpc-source/third_party/bloaty/third_party/googletest'
01-Oct-2026 22:34:58 Submodule 'third_party/libFuzzer' (https://chromium.googlesource.com/chromium/llvm-project/llvm/lib/Fuzzer) registered for path 'casatools/grpc-source/third_party/bloaty/third_party/libFuzzer'
01-Oct-2026 22:34:58 Submodule 'third_party/re2' (https://github.com/google/re2) registered for path 'casatools/grpc-source/third_party/bloaty/third_party/re2'
01-Oct-2026 22:34:58 Cloning into '/Users/casaci/bamboohome/xml-data/build-dir/CASASPECS-DEVTESTPY312158-TTARM15PY312/casatools/grpc-source/third_party/bloaty/third_party/googletest'...
01-Oct-2026 22:35:00 Cloning into '/Users/casaci/bamboohome/xml-data/build-dir/CASASPECS-DEVTESTPY312158-TTARM15PY312/casatools/grpc-source/third_party/bloaty/third_party/libFuzzer'...
01-Oct-2026 22:35:05 error: RPC failed; HTTP 503 curl 22 The requested URL returned error: 503
01-Oct-2026 22:35:05 fatal: expected flush after ref listing
01-Oct-2026 22:35:05 fatal: clone of 'https://chromium.googlesource.com/chromium/llvm-project/llvm/lib/Fuzzer' into submodule path '/Users/casaci/bamboohome/xml-data/build-dir/CASASPECS-DEVTESTPY312158-TTARM15PY312/casatools/grpc-source/third_party/bloaty/third_party/libFuzzer' failed
01-Oct-2026 22:35:05 Failed to clone 'third_party/libFuzzer'. Retry scheduled
01-Oct-2026 22:35:05 Cloning into '/Users/casaci/bamboohome/xml-data/build-dir/CASASPECS-DEVTESTPY312158-TTARM15PY312/casatools/grpc-source/third_party/bloaty/third_party/re2'...
01-Oct-2026 22:35:05 Cloning into '/Users/casaci/bamboohome/xml-data/build-dir/CASASPECS-DEVTESTPY312158-TTARM15PY312/casatools/grpc-source/third_party/bloaty/third_party/libFuzzer'...
01-Oct-2026 22:35:09 fatal: unable to access 'https://chromium.googlesource.com/chromium/llvm-project/llvm/lib/Fuzzer/': The requested URL returned error: 503
01-Oct-2026 22:35:09 fatal: clone of 'https://chromium.googlesource.com/chromium/llvm-project/llvm/lib/Fuzzer' into submodule path '/Users/casaci/bamboohome/xml-data/build-dir/CASASPECS-DEVTESTPY312158-TTARM15PY312/casatools/grpc-source/third_party/bloaty/third_party/libFuzzer' failed
01-Oct-2026 22:35:09 Failed to clone 'third_party/libFuzzer' a second time, aborting
01-Oct-2026 22:35:09 fatal: Failed to recurse into submodule path 'casatools/grpc-source/third_party/bloaty'
01-Oct-2026 22:35:10 Submodule path 'casatools/grpc-source/third_party/boringssl': checked out 'be2ee342d3781ddb954f91f8a7e660c6f59e87e5'
01-Oct-2026 22:35:10 Submodule path 'casatools/grpc-source/third_party/boringssl-with-bazel': checked out '886e7d75368e3f4fab3f4d0d3584e4abfc557755'
01-Oct-2026 22:35:10 Submodule path 'casatools/grpc-source/third_party/cares/cares': checked out '3be1924221e1326df520f8498d704a5c4c8d0cce'
01-Oct-2026 22:35:10 Submodule path 'casatools/grpc-source/third_party/gflags': checked out '30dbc81fb5ffdc98ea9b14b1918bfe4e8779b26e'
01-Oct-2026 22:35:10 Submodule 'doc' (https://github.com/gflags/gflags.git) registered for path 'casatools/grpc-source/third_party/gflags/doc'
01-Oct-2026 22:35:10 Cloning into '/Users/casaci/bamboohome/xml-data/build-dir/CASASPECS-DEVTESTPY312158-TTARM15PY312/casatools/grpc-source/third_party/gflags/doc'...
01-Oct-2026 22:35:11 Submodule path 'casatools/grpc-source/third_party/gflags/doc': checked out '971dd2a4fadac9cdab174c523c22df79efd63aa5'
01-Oct-2026 22:35:11 Submodule path 'casatools/grpc-source/third_party/googletest': checked out 'ec44c6c1675c25b9827aacd08c02433cccde7780'
01-Oct-2026 22:35:11 Submodule path 'casatools/grpc-source/third_party/protobuf': checked out '2761122b810fe8861004ae785cc3ab39f384d342'
01-Oct-2026 22:35:11 Submodule 'third_party/benchmark' (https://github.com/google/benchmark.git) registered for path 'casatools/grpc-source/third_party/protobuf/third_party/benchmark'
01-Oct-2026 22:35:11 Cloning into '/Users/casaci/bamboohome/xml-data/build-dir/CASASPECS-DEVTESTPY312158-TTARM15PY312/casatools/grpc-source/third_party/protobuf/third_party/benchmark'...
01-Oct-2026 22:35:12 Submodule path 'casatools/grpc-source/third_party/protobuf/third_party/benchmark': checked out '360e66c1c4777c99402cf8cd535aa510fee16573'
01-Oct-2026 22:35:12 Submodule path 'casatools/grpc-source/third_party/zlib': checked out 'cacf7f1d4e3d44d871b605da3b647f07d718623f'
01-Oct-2026 22:35:12 fatal: Failed to recurse into submodule path 'casatools/grpc-source'
01-Oct-2026 22:35:12 Checkout to revision fca4920fd5894af7a8bc45e3d5a8675122e76335 has failed.
01-Oct-2026 22:35:12 Failed to execute git operations on any configured Bitbucket instances. Proceeding with final failing...
01-Oct-2026 22:35:12 Updating source code to revision: fca4920fd5894af7a8bc45e3d5a8675122e76335
01-Oct-2026 22:35:12 Fetching 'refs/heads/CAS-14803' from 'ssh://git@open-bitbucket.nrao.edu:7999/casa/casa6.git'.
01-Oct-2026 22:35:12 Warning: Permanently added '[127.0.0.1]:49161' (RSA) to the list of known hosts.
01-Oct-2026 22:35:13 Checking out revision fca4920fd5894af7a8bc45e3d5a8675122e76335.
01-Oct-2026 22:35:14 Already on 'CAS-14803'
01-Oct-2026 22:35:14 Your branch is up to date with 'origin/CAS-14803'.
01-Oct-2026 22:35:14 Cloning into '/Users/casaci/bamboohome/xml-data/build-dir/CASASPECS-DEVTESTPY312158-TTARM15PY312/casatools/grpc-source/third_party/bloaty/third_party/libFuzzer'...
01-Oct-2026 22:35:17 Submodule path 'casatools/grpc-source/third_party/bloaty/third_party/googletest': checked out 'a2b8a8e07628e5fd60644b6dd99c1b5e7d7f1f47'
01-Oct-2026 22:35:17 Submodule path 'casatools/grpc-source/third_party/bloaty/third_party/libFuzzer': checked out '1b543d6e5073b56be214394890c9193979a3d7e1'
01-Oct-2026 22:35:17 Submodule path 'casatools/grpc-source/third_party/bloaty/third_party/re2': checked out 'c964d9b07816f9b52ca692e23b8b3dba33beec54'
01-Oct-2026 22:35:17 Updated source code to revision: fca4920fd5894af7a8bc45e3d5a8675122e76335
01-Oct-2026 22:35:17 Finished task 'Source Code Checkout' with result: Success
01-Oct-2026 22:35:17 Running pre-build action: Build Log Labeller Pre Build Action
01-Oct-2026 22:35:17 Running pre-build action: VCS Version Collector
01-Oct-2026 22:35:17 Build CASASPECS - Dev Test 3.12 - CAS-14803 - Test Tasks macOS 15 Py3.12 #2 (CASASPECS-DEVTESTPY312158-TTARM15PY312-2) started building on agent 'cbt-macos15-test-m4-1' (Remote agent on host cbt-macos15-test-m4-1)
01-Oct-2026 22:35:17 Starting task 'Update data' of type 'com.atlassian.bamboo.plugins.scripttask:task.builder.script'
01-Oct-2026 22:35:17
Beginning to execute external process for build 'CASASPECS - Dev Test 3.12 - CAS-14803 - Test Tasks macOS 15 Py3.12 #2 (CASASPECS-DEVTESTPY312158-TTARM15PY312-2)'
... running command line:
/Users/casaci/bamboohome/temp/CASASPECS-DEVTESTPY312158-TTARM15PY312-2-ScriptBuildTask-17859318483525992013.sh
... in: /Users/casaci/bamboohome/xml-data/build-dir/CASASPECS-DEVTESTPY312158-TTARM15PY312
01-Oct-2026 22:35:17 Already up to date.
01-Oct-2026 22:35:18 Updating 59249675..e194b37f
01-Oct-2026 22:35:18 error: Your local changes to the following files would be overwritten by merge:
01-Oct-2026 22:35:18         nrao/VLA/CalModels/3C138_K.im/table.dat
01-Oct-2026 22:35:18         nrao/VLA/CalModels/3C138_K.im/table.lock
01-Oct-2026 22:35:18 Please commit your changes or stash them before you merge.
01-Oct-2026 22:35:18 Aborting
01-Oct-2026 22:35:18 Done
01-Oct-2026 22:35:18 Finished task 'Update data' with result: Success
01-Oct-2026 22:35:18 Starting task 'Create wheel directory' of type 'com.atlassian.bamboo.plugins.scripttask:task.builder.script'
01-Oct-2026 22:35:18
Beginning to execute external process for build 'CASASPECS - Dev Test 3.12 - CAS-14803 - Test Tasks macOS 15 Py3.12 #2 (CASASPECS-DEVTESTPY312158-TTARM15PY312-2)'
... running command line:
/Users/casaci/bamboohome/temp/CASASPECS-DEVTESTPY312158-TTARM15PY312-2-ScriptBuildTask-1104388175673496345.sh
... in: /Users/casaci/bamboohome/xml-data/build-dir/CASASPECS-DEVTESTPY312158-TTARM15PY312
01-Oct-2026 22:35:18 Finished task 'Create wheel directory' with result: Success
01-Oct-2026 22:35:18 Starting task 'Get macOS 15 wheels' of type 'com.atlassian.bamboo.plugins.bamboo-artifact-downloader-plugin:artifactdownloadertask'
01-Oct-2026 22:35:18 Preparing to download plan result CASASPECS-DBC268-2 artifact: Non required shared artifact Http Compression On : [macOS 15 py3.12 tasks wheel], patterns: [casatasks*.whl] anchored at: [wheels]
01-Oct-2026 22:35:18 Retrieving artifact macOS 15 py3.12 tasks wheel for CASASPECS-DBC268-2 using Bamboo server artifact handler
01-Oct-2026 22:35:18 Artifact [macOS 15 py3.12 tasks wheel] downloaded successfully in 199.8 ms to wheeldirectory/
01-Oct-2026 22:35:18 Preparing to download plan result CASASPECS-DBC268-2 artifact: Non required shared artifact Http Compression On : [macOS 15 casatestutils 3.12], patterns: [casatestutils*.whl] anchored at: [wheels]
01-Oct-2026 22:35:18 Retrieving artifact macOS 15 casatestutils 3.12 for CASASPECS-DBC268-2 using Bamboo server artifact handler
01-Oct-2026 22:35:18 Artifact [macOS 15 casatestutils 3.12] downloaded successfully in 14.68 ms to wheeldirectory/
01-Oct-2026 22:35:18 Preparing to download plan result CASASPECS-DBC268-2 artifact: Non required shared artifact Http Compression On : [macOS 15 py3.12 tools wheel], patterns: [casatools*.whl] anchored at: [wheels]
01-Oct-2026 22:35:18 Retrieving artifact macOS 15 py3.12 tools wheel for CASASPECS-DBC268-2 using Bamboo server artifact handler
01-Oct-2026 22:35:21 Artifact [macOS 15 py3.12 tools wheel] downloaded successfully in 3.472 s to wheeldirectory/
01-Oct-2026 22:35:21 Finished task 'Get macOS 15 wheels' with result: Success
01-Oct-2026 22:35:21
Substituting variable: ${bamboo.repository.branch.name} with CAS-14803
01-Oct-2026 22:35:21
Substituting variable: ${bamboo.planRepository.branchName} with CAS-14803
01-Oct-2026 22:35:21 Starting task 'Test wheel' of type 'com.atlassian.bamboo.plugins.scripttask:task.builder.script'
01-Oct-2026 22:35:21
Beginning to execute external process for build 'CASASPECS - Dev Test 3.12 - CAS-14803 - Test Tasks macOS 15 Py3.12 #2 (CASASPECS-DEVTESTPY312158-TTARM15PY312-2)'
... running command line:
/Users/casaci/bamboohome/temp/CASASPECS-DEVTESTPY312158-TTARM15PY312-2-ScriptBuildTask-12337029197505291828.sh
... in: /Users/casaci/bamboohome/xml-data/build-dir/CASASPECS-DEVTESTPY312158-TTARM15PY312
01-Oct-2026 22:35:22 branch: CAS-14803
01-Oct-2026 22:35:22 branch: CAS-14803
01-Oct-2026 22:35:22 Testing wheel
01-Oct-2026 22:35:22   % Total    % Received % Xferd  Average Speed   Time    Time     Time  Current
01-Oct-2026 22:35:22                                  Dload  Upload   Total   Spent    Left  Speed
01-Oct-2026 22:35:22
01-Oct-2026 22:35:22   0     0    0     0    0     0      0      0 --:--:-- --:--:-- --:--:--     0
01-Oct-2026 22:35:22 100 9419k  100 9419k    0     0  64.5M      0 --:--:-- --:--:-- --:--:-- 64.7M
01-Oct-2026 22:35:25 Ticket fix version: CASA 6.ACTIVE
01-Oct-2026 22:35:25 No matching version found
01-Oct-2026 22:35:25   % Total    % Received % Xferd  Average Speed   Time    Time     Time  Current
01-Oct-2026 22:35:25                                  Dload  Upload   Total   Spent    Left  Speed
01-Oct-2026 22:35:25
01-Oct-2026 22:35:25   0     0    0     0    0     0      0      0 --:--:-- --:--:-- --:--:--     0
01-Oct-2026 22:35:25 100   201  100   201    0     0   6374      0 --:--:-- --:--:-- --:--:--  6483
01-Oct-2026 22:35:25   % Total    % Received % Xferd  Average Speed   Time    Time     Time  Current
01-Oct-2026 22:35:25                                  Dload  Upload   Total   Spent    Left  Speed
01-Oct-2026 22:35:25
01-Oct-2026 22:35:25   0     0    0     0    0     0      0      0 --:--:-- --:--:-- --:--:--     0
01-Oct-2026 22:35:25 100   511  100   511    0     0  23300      0 --:--:-- --:--:-- --:--:-- 24333
01-Oct-2026 22:35:25 bamboo_jira_components:''
01-Oct-2026 22:35:25 bamboo_testlist:''
01-Oct-2026 22:35:30 atlutil components: imsmooth
01-Oct-2026 22:35:30 Ticket components: imsmooth
01-Oct-2026 22:38:27 Switched to a new branch 'CAS-14803'
01-Oct-2026 22:38:27 branch 'CAS-14803' set up to track 'origin/CAS-14803'.
01-Oct-2026 22:38:27 Updated 0 paths from f67e31d4f3
01-Oct-2026 22:38:27 Updated 0 paths from 3aa39f022e
01-Oct-2026 22:38:28 Requirement already satisfied: pip in /Users/casaci/bamboohome/xml-data/build-dir/CASASPECS-DEVTESTPY312158-TTARM15PY312/casa6testenv/lib/python3.12/site-packages (24.3.1)
01-Oct-2026 22:38:28 Collecting pip
01-Oct-2026 22:38:28   Downloading pip-26.2.1-py3-none-any.whl.metadata (4.6 kB)
01-Oct-2026 22:38:28 Collecting setuptools
01-Oct-2026 22:38:28   Downloading setuptools-84.0.0-py3-none-any.whl.metadata (6.6 kB)
01-Oct-2026 22:38:28 Collecting wheel
01-Oct-2026 22:38:28   Downloading wheel-0.48.0-py3-none-any.whl.metadata (2.3 kB)
01-Oct-2026 22:38:28 Collecting packaging>=24.0 (from wheel)
01-Oct-2026 22:38:28   Downloading packaging-26.3-py3-none-any.whl.metadata (3.5 kB)
01-Oct-2026 22:38:28 Downloading pip-26.2.1-py3-none-any.whl (1.8 MB)
01-Oct-2026 22:38:28    ━━━━━━━━━━━━━━━━━━━━━━━━━━━━━━━━━━━━━━━━ 1.8/1.8 MB 79.0 MB/s eta 0:00:00
01-Oct-2026 22:38:28 Downloading setuptools-84.0.0-py3-none-any.whl (818 kB)
01-Oct-2026 22:38:28    ━━━━━━━━━━━━━━━━━━━━━━━━━━━━━━━━━━━━━━━━ 818.2/818.2 kB 77.9 MB/s eta 0:00:00
01-Oct-2026 22:38:28 Downloading wheel-0.48.0-py3-none-any.whl (33 kB)
01-Oct-2026 22:38:28 Downloading packaging-26.3-py3-none-any.whl (129 kB)
01-Oct-2026 22:38:28 Installing collected packages: setuptools, pip, packaging, wheel
01-Oct-2026 22:38:28   Attempting uninstall: pip
01-Oct-2026 22:38:28     Found existing installation: pip 24.3.1
01-Oct-2026 22:38:28     Uninstalling pip-24.3.1:
01-Oct-2026 22:38:28       Successfully uninstalled pip-24.3.1
01-Oct-2026 22:38:29 Successfully installed packaging-26.3 pip-26.2.1 setuptools-84.0.0 wheel-0.48.0
01-Oct-2026 22:38:29 Looking in indexes: https://pypi.org/simple, https://test.pypi.org/simple
01-Oct-2026 22:38:29 Collecting casaconfig==1.5.0
01-Oct-2026 22:38:29   Using cached casaconfig-1.5.0-py3-none-any.whl.metadata (4.0 kB)
01-Oct-2026 22:38:29 Collecting certifi>=2023.5.7 (from casaconfig==1.5.0)
01-Oct-2026 22:38:29   Using cached certifi-2026.7.22-py3-none-any.whl.metadata (2.5 kB)
01-Oct-2026 22:38:29 Using cached casaconfig-1.5.0-py3-none-any.whl (77 kB)
01-Oct-2026 22:38:29 Using cached certifi-2026.7.22-py3-none-any.whl (136 kB)
01-Oct-2026 22:38:29 Installing collected packages: certifi, casaconfig
01-Oct-2026 22:38:29
01-Oct-2026 22:38:29 Successfully installed casaconfig-1.5.0 certifi-2026.7.22
01-Oct-2026 22:38:30 Collecting scipy
01-Oct-2026 22:38:30   Downloading scipy-1.18.1-cp312-cp312-macosx_14_0_arm64.whl.metadata (62 kB)
01-Oct-2026 22:38:30 Collecting numpy
01-Oct-2026 22:38:30   Downloading numpy-2.5.3-cp312-cp312-macosx_14_0_arm64.whl.metadata (6.6 kB)
01-Oct-2026 22:38:30 Downloading scipy-1.18.1-cp312-cp312-macosx_14_0_arm64.whl (20.5 MB)
01-Oct-2026 22:38:30    ━━━━━━━━━━━━━━━━━━━━━━━━━━━━━━━━━━━━━━━━ 20.5/20.5 MB 92.7 MB/s  0:00:00
01-Oct-2026 22:38:30 Downloading numpy-2.5.3-cp312-cp312-macosx_14_0_arm64.whl (5.4 MB)
01-Oct-2026 22:38:30    ━━━━━━━━━━━━━━━━━━━━━━━━━━━━━━━━━━━━━━━━ 5.4/5.4 MB 95.7 MB/s  0:00:00
01-Oct-2026 22:38:30 Installing collected packages: numpy, scipy
01-Oct-2026 22:38:33
01-Oct-2026 22:38:33 Successfully installed numpy-2.5.3 scipy-1.18.1
01-Oct-2026 22:38:33 Processing ./casatools-6.7.7.8a14803.dev2-cp312-cp312-macosx_15_0_arm64.whl
01-Oct-2026 22:38:33 Requirement already satisfied: numpy in /Users/casaci/bamboohome/xml-data/build-dir/CASASPECS-DEVTESTPY312158-TTARM15PY312/casa6testenv/lib/python3.12/site-packages (from casatools==6.7.7.8a14803.dev2) (2.5.3)
01-Oct-2026 22:38:33 Requirement already satisfied: casaconfig in /Users/casaci/bamboohome/xml-data/build-dir/CASASPECS-DEVTESTPY312158-TTARM15PY312/casa6testenv/lib/python3.12/site-packages (from casatools==6.7.7.8a14803.dev2) (1.5.0)
01-Oct-2026 22:38:33 Requirement already satisfied: certifi>=2023.5.7 in /Users/casaci/bamboohome/xml-data/build-dir/CASASPECS-DEVTESTPY312158-TTARM15PY312/casa6testenv/lib/python3.12/site-packages (from casaconfig->casatools==6.7.7.8a14803.dev2) (2026.7.22)
01-Oct-2026 22:38:33 Installing collected packages: casatools
01-Oct-2026 22:38:34 Successfully installed casatools-6.7.7.8a14803.dev2
01-Oct-2026 22:38:34 Processing ./casatasks-6.7.7.8a14803.dev2-py3-none-any.whl
01-Oct-2026 22:38:34 Requirement already satisfied: casatools==6.7.7.8a14803.dev2 in /Users/casaci/bamboohome/xml-data/build-dir/CASASPECS-DEVTESTPY312158-TTARM15PY312/casa6testenv/lib/python3.12/site-packages (from casatasks==6.7.7.8a14803.dev2) (6.7.7.8a14803.dev2)
01-Oct-2026 22:38:34 Collecting matplotlib (from casatasks==6.7.7.8a14803.dev2)
01-Oct-2026 22:38:34   Using cached matplotlib-3.11.2-cp312-cp312-macosx_11_0_arm64.whl.metadata (80 kB)
01-Oct-2026 22:38:34 Requirement already satisfied: scipy in /Users/casaci/bamboohome/xml-data/build-dir/CASASPECS-DEVTESTPY312158-TTARM15PY312/casa6testenv/lib/python3.12/site-packages (from casatasks==6.7.7.8a14803.dev2) (1.18.1)
01-Oct-2026 22:38:34 Requirement already satisfied: certifi in /Users/casaci/bamboohome/xml-data/build-dir/CASASPECS-DEVTESTPY312158-TTARM15PY312/casa6testenv/lib/python3.12/site-packages (from casatasks==6.7.7.8a14803.dev2) (2026.7.22)
01-Oct-2026 22:38:34 Collecting pyerfa (from casatasks==6.7.7.8a14803.dev2)
01-Oct-2026 22:38:34   Using cached pyerfa-2.0.1.5-cp39-abi3-macosx_11_0_arm64.whl.metadata (5.7 kB)
01-Oct-2026 22:38:34 Requirement already satisfied: numpy in /Users/casaci/bamboohome/xml-data/build-dir/CASASPECS-DEVTESTPY312158-TTARM15PY312/casa6testenv/lib/python3.12/site-packages (from casatools==6.7.7.8a14803.dev2->casatasks==6.7.7.8a14803.dev2) (2.5.3)
01-Oct-2026 22:38:34 Requirement already satisfied: casaconfig in /Users/casaci/bamboohome/xml-data/build-dir/CASASPECS-DEVTESTPY312158-TTARM15PY312/casa6testenv/lib/python3.12/site-packages (from casatools==6.7.7.8a14803.dev2->casatasks==6.7.7.8a14803.dev2) (1.5.0)
01-Oct-2026 22:38:34 Collecting contourpy>=1.0.1 (from matplotlib->casatasks==6.7.7.8a14803.dev2)
01-Oct-2026 22:38:34   Using cached contourpy-1.4.0-cp312-cp312-macosx_11_0_arm64.whl.metadata (3.8 kB)
01-Oct-2026 22:38:34 Collecting cycler>=0.10 (from matplotlib->casatasks==6.7.7.8a14803.dev2)
01-Oct-2026 22:38:34   Using cached cycler-0.12.1-py3-none-any.whl.metadata (3.8 kB)
01-Oct-2026 22:38:34 Collecting fonttools>=4.28.2 (from matplotlib->casatasks==6.7.7.8a14803.dev2)
01-Oct-2026 22:38:34   Using cached fonttools-4.66.1-cp312-cp312-macosx_10_13_universal2.whl.metadata (130 kB)
01-Oct-2026 22:38:34 Collecting kiwisolver>=1.3.1 (from matplotlib->casatasks==6.7.7.8a14803.dev2)
01-Oct-2026 22:38:34   Using cached kiwisolver-1.5.1-cp312-cp312-macosx_11_0_arm64.whl.metadata (5.2 kB)
01-Oct-2026 22:38:34 Requirement already satisfied: packaging>=20.0 in /Users/casaci/bamboohome/xml-data/build-dir/CASASPECS-DEVTESTPY312158-TTARM15PY312/casa6testenv/lib/python3.12/site-packages (from matplotlib->casatasks==6.7.7.8a14803.dev2) (26.3)
01-Oct-2026 22:38:34 Collecting pillow>=9 (from matplotlib->casatasks==6.7.7.8a14803.dev2)
01-Oct-2026 22:38:34   Using cached pillow-12.3.0-cp312-cp312-macosx_11_0_arm64.whl.metadata (9.1 kB)
01-Oct-2026 22:38:34 Collecting pyparsing>=3 (from matplotlib->casatasks==6.7.7.8a14803.dev2)
01-Oct-2026 22:38:34   Using cached pyparsing-3.3.3-py3-none-any.whl.metadata (5.9 kB)
01-Oct-2026 22:38:34 Collecting python-dateutil>=2.7 (from matplotlib->casatasks==6.7.7.8a14803.dev2)
01-Oct-2026 22:38:34   Using cached python_dateutil-2.9.0.post0-py2.py3-none-any.whl.metadata (8.4 kB)
01-Oct-2026 22:38:34 Collecting six>=1.5 (from python-dateutil>=2.7->matplotlib->casatasks==6.7.7.8a14803.dev2)
01-Oct-2026 22:38:34   Using cached six-1.17.0-py2.py3-none-any.whl.metadata (1.7 kB)
01-Oct-2026 22:38:34 Using cached matplotlib-3.11.2-cp312-cp312-macosx_11_0_arm64.whl (9.3 MB)
01-Oct-2026 22:38:34 Using cached contourpy-1.4.0-cp312-cp312-macosx_11_0_arm64.whl (284 kB)
01-Oct-2026 22:38:34 Using cached cycler-0.12.1-py3-none-any.whl (8.3 kB)
01-Oct-2026 22:38:34 Using cached fonttools-4.66.1-cp312-cp312-macosx_10_13_universal2.whl (3.1 MB)
01-Oct-2026 22:38:34 Using cached kiwisolver-1.5.1-cp312-cp312-macosx_11_0_arm64.whl (64 kB)
01-Oct-2026 22:38:34 Using cached pillow-12.3.0-cp312-cp312-macosx_11_0_arm64.whl (4.8 MB)
01-Oct-2026 22:38:34 Using cached pyparsing-3.3.3-py3-none-any.whl (126 kB)
01-Oct-2026 22:38:34 Using cached python_dateutil-2.9.0.post0-py2.py3-none-any.whl (229 kB)
01-Oct-2026 22:38:34 Using cached six-1.17.0-py2.py3-none-any.whl (11 kB)
01-Oct-2026 22:38:34 Using cached pyerfa-2.0.1.5-cp39-abi3-macosx_11_0_arm64.whl (329 kB)
01-Oct-2026 22:38:34 Installing collected packages: six, pyparsing, pyerfa, pillow, kiwisolver, fonttools, cycler, contourpy, python-dateutil, matplotlib, casatasks
01-Oct-2026 22:38:36
01-Oct-2026 22:38:36 Successfully installed casatasks-6.7.7.8a14803.dev2 contourpy-1.4.0 cycler-0.12.1 fonttools-4.66.1 kiwisolver-1.5.1 matplotlib-3.11.2 pillow-12.3.0 pyerfa-2.0.1.5 pyparsing-3.3.3 python-dateutil-2.9.0.post0 six-1.17.0
01-Oct-2026 22:38:37 Processing ./casatestutils-6.7.7.8a14803.dev2-py3-none-any.whl
01-Oct-2026 22:38:37 Collecting pytest>=6.0 (from casatestutils==6.7.7.8a14803.dev2)
01-Oct-2026 22:38:37   Using cached pytest-9.1.1-py3-none-any.whl.metadata (7.6 kB)
01-Oct-2026 22:38:37 Collecting astropy (from casatestutils==6.7.7.8a14803.dev2)
01-Oct-2026 22:38:37   Using cached astropy-8.0.1-cp311-abi3-macosx_11_0_arm64.whl.metadata (11 kB)
01-Oct-2026 22:38:37 Collecting iniconfig>=1.0.1 (from pytest>=6.0->casatestutils==6.7.7.8a14803.dev2)
01-Oct-2026 22:38:37   Using cached iniconfig-2.3.0-py3-none-any.whl.metadata (2.5 kB)
01-Oct-2026 22:38:37 Requirement already satisfied: packaging>=22 in /Users/casaci/bamboohome/xml-data/build-dir/CASASPECS-DEVTESTPY312158-TTARM15PY312/casa6testenv/lib/python3.12/site-packages (from pytest>=6.0->casatestutils==6.7.7.8a14803.dev2) (26.3)
01-Oct-2026 22:38:37 Collecting pluggy<2,>=1.5 (from pytest>=6.0->casatestutils==6.7.7.8a14803.dev2)
01-Oct-2026 22:38:37   Using cached pluggy-1.6.0-py3-none-any.whl.metadata (4.8 kB)
01-Oct-2026 22:38:37 Collecting pygments>=2.7.2 (from pytest>=6.0->casatestutils==6.7.7.8a14803.dev2)
01-Oct-2026 22:38:37   Using cached pygments-2.21.0-py3-none-any.whl.metadata (2.5 kB)
01-Oct-2026 22:38:37 Collecting astropy-iers-data>=0.2026.6.22.1.23.34 (from astropy->casatestutils==6.7.7.8a14803.dev2)
01-Oct-2026 22:38:37   Using cached astropy_iers_data-0.2026.9.28.0.59.37-py3-none-any.whl.metadata (3.4 kB)
01-Oct-2026 22:38:37 Requirement already satisfied: numpy>=2.0 in /Users/casaci/bamboohome/xml-data/build-dir/CASASPECS-DEVTESTPY312158-TTARM15PY312/casa6testenv/lib/python3.12/site-packages (from astropy->casatestutils==6.7.7.8a14803.dev2) (2.5.3)
01-Oct-2026 22:38:37 Requirement already satisfied: pyerfa>=2.0.1.3 in /Users/casaci/bamboohome/xml-data/build-dir/CASASPECS-DEVTESTPY312158-TTARM15PY312/casa6testenv/lib/python3.12/site-packages (from astropy->casatestutils==6.7.7.8a14803.dev2) (2.0.1.5)
01-Oct-2026 22:38:37 Collecting PyYAML>=6.0.0 (from astropy->casatestutils==6.7.7.8a14803.dev2)
01-Oct-2026 22:38:37   Using cached pyyaml-6.0.3-cp312-cp312-macosx_11_0_arm64.whl.metadata (2.4 kB)
01-Oct-2026 22:38:37 Using cached pytest-9.1.1-py3-none-any.whl (386 kB)
01-Oct-2026 22:38:37 Using cached pluggy-1.6.0-py3-none-any.whl (20 kB)
01-Oct-2026 22:38:37 Using cached iniconfig-2.3.0-py3-none-any.whl (7.5 kB)
01-Oct-2026 22:38:37 Using cached pygments-2.21.0-py3-none-any.whl (1.3 MB)
01-Oct-2026 22:38:37 Using cached astropy-8.0.1-cp311-abi3-macosx_11_0_arm64.whl (6.6 MB)
01-Oct-2026 22:38:37 Using cached astropy_iers_data-0.2026.9.28.0.59.37-py3-none-any.whl (2.0 MB)
01-Oct-2026 22:38:37 Using cached pyyaml-6.0.3-cp312-cp312-macosx_11_0_arm64.whl (173 kB)
01-Oct-2026 22:38:37 Installing collected packages: PyYAML, pygments, pluggy, iniconfig, astropy-iers-data, pytest, astropy, casatestutils
01-Oct-2026 22:38:39
01-Oct-2026 22:38:39 Successfully installed PyYAML-6.0.3 astropy-8.0.1 astropy-iers-data-0.2026.9.28.0.59.37 casatestutils-6.7.7.8a14803.dev2 iniconfig-2.3.0 pluggy-1.6.0 pygments-2.21.0 pytest-9.1.1
01-Oct-2026 22:38:39 Config:
01-Oct-2026 22:38:39 datapath=["/opt/casa/data/casa-data", "/opt/casa/data/casatestdata"]
01-Oct-2026 22:38:39 rundata="/opt/casa/data/casa-data"
01-Oct-2026 22:38:39 measurespath="/opt/casa/data/casa-data"
01-Oct-2026 22:38:39 data_auto_update=False
01-Oct-2026 22:38:39 measures_auto_update=False
01-Oct-2026 22:38:39 python runtest.py --ignore_list 'test_casampi,test_task_msview,test_task_imview,test_task_plotms' -j imsmooth -b CAS-14803 -e ./casatestutils/component_to_test_map.json
01-Oct-2026 22:38:39   % Total    % Received % Xferd  Average Speed   Time    Time     Time  Current
01-Oct-2026 22:38:39                                  Dload  Upload   Total   Spent    Left  Speed
01-Oct-2026 22:38:39
01-Oct-2026 22:38:39   0     0    0     0    0     0      0      0 --:--:-- --:--:-- --:--:--     0
01-Oct-2026 22:38:39 100   669    0   669    0     0  44398      0 --:--:-- --:--:-- --:--:-- 44600
01-Oct-2026 22:38:48 ============================= test session starts ==============================
01-Oct-2026 22:38:48 platform darwin -- Python 3.12.8, pytest-9.1.1, pluggy-1.6.0 -- /Users/casaci/bamboohome/xml-data/build-dir/CASASPECS-DEVTESTPY312158-TTARM15PY312/casa6testenv/bin/python
01-Oct-2026 22:38:48 cachedir: .pytest_cache
01-Oct-2026 22:38:48 rootdir: /Users/casaci/bamboohome/xml-data/build-dir/CASASPECS-DEVTESTPY312158-TTARM15PY312/casa6/casatestutils/nosedir/test_task_imsmooth
01-Oct-2026 22:38:48 configfile: pytest.ini
01-Oct-2026 22:39:18 collecting ... collected 13 items
01-Oct-2026 22:39:18
01-Oct-2026 22:39:18
01-Oct-2026 22:39:19 2026-10-02 02:39:19        WARN        imsmooth::image::commonbeam (file /private/var/folders/60/83wxljbx2vlfbx_hy0yfv8rc0000gn/T/build-via-sdist-dgklqugq/casatools-6.7.7.8a14803.dev2/src/tools/image/image_cmpt.cc, line 824)        This image only has one beam, so just returning that
01-Oct-2026 22:39:19 2026-10-02 02:39:19        WARN        image::open (file /private/var/folders/60/83wxljbx2vlfbx_hy0yfv8rc0000gn/T/build-via-sdist-dgklqugq/casatools-6.7.7.8a14803.dev2/src/tools/image/image_cmpt.cc, line 4289)        Another image is already open, closing first
01-Oct-2026 22:39:19 2026-10-02 02:39:19        WARN        imsmooth::image::commonbeam (file /private/var/folders/60/83wxljbx2vlfbx_hy0yfv8rc0000gn/T/build-via-sdist-dgklqugq/casatools-6.7.7.8a14803.dev2/src/tools/image/image_cmpt.cc, line 824)        This image only has one beam, so just returning that
01-Oct-2026 22:39:19 2026-10-02 02:39:19        SEVERE        imsmooth::image::deconvolvefrombeam (file /private/var/folders/60/83wxljbx2vlfbx_hy0yfv8rc0000gn/T/build-via-sdist-dgklqugq/casatools-6.7.7.8a14803.dev2/src/tools/image/image_cmpt.cc, line 1663)        Exception Reported: Cannot understand source values
01-Oct-2026 22:39:19 2026-10-02 02:39:19        SEVERE        imsmooth::::casa        Task imsmooth raised an exception of class RuntimeError with the following message: Cannot understand source values
01-Oct-2026 22:39:19 test_task_imsmooth.py::imsmooth_test::test_beam
01-Oct-2026 22:39:19 Test the beam parameter
01-Oct-2026 22:39:19 {'fit': {'major': {'unit': 'arcsec', 'value': 5.291502622129181}, 'minor': {'unit': 'arcsec', 'value': 2.6457513110645907}, 'pa': {'unit': 'deg', 'value': -0.0}, 'success': True}, 'return': False}  val  1.2826964324176052e-05
01-Oct-2026 22:39:19 FAILED
01-Oct-2026 22:39:19 test_task_imsmooth.py::imsmooth_test::test_beam ERROR
01-Oct-2026 22:39:19
01-Oct-2026 22:39:19 2026-10-02 02:39:19        WARN        imsmooth::image::commonbeam (file /private/var/folders/60/83wxljbx2vlfbx_hy0yfv8rc0000gn/T/build-via-sdist-dgklqugq/casatools-6.7.7.8a14803.dev2/src/tools/image/image_cmpt.cc, line 824)        This image only has one beam, so just returning that
01-Oct-2026 22:39:19 2026-10-02 02:39:19        WARN        imsmooth::image::commonbeam (file /private/var/folders/60/83wxljbx2vlfbx_hy0yfv8rc0000gn/T/build-via-sdist-dgklqugq/casatools-6.7.7.8a14803.dev2/src/tools/image/image_cmpt.cc, line 824)        This image only has one beam, so just returning that
01-Oct-2026 22:39:19 2026-10-02 02:39:19        SEVERE        imsmooth::image::deconvolvefrombeam (file /private/var/folders/60/83wxljbx2vlfbx_hy0yfv8rc0000gn/T/build-via-sdist-dgklqugq/casatools-6.7.7.8a14803.dev2/src/tools/image/image_cmpt.cc, line 1663)        Exception Reported: Cannot understand source values
01-Oct-2026 22:39:19 2026-10-02 02:39:19        SEVERE        imsmooth::::casa        Task imsmooth raised an exception of class RuntimeError with the following message: Cannot understand source values
01-Oct-2026 22:39:19 test_task_imsmooth.py::imsmooth_test::test_commonbeam
01-Oct-2026 22:39:19 Test kernel='commonbeam' in imsmooth
01-Oct-2026 22:39:19 FAILED
01-Oct-2026 22:39:19 test_task_imsmooth.py::imsmooth_test::test_commonbeam ERROR
01-Oct-2026 22:39:19
01-Oct-2026 22:39:19 2026-10-02 02:39:19        WARN        componentlist::fromrecord        componentlist is not empty; overwriting it
01-Oct-2026 22:39:19 2026-10-02 02:39:19        WARN        ImageFitter::_finishConstruction        Unrecognized intensity unit cm-2. Will assume Jy/pixel
01-Oct-2026 22:39:19 2026-10-02 02:39:19        WARN        SkyCompRep::convertToJy        Cannot convert units of brightness to Jy - will assume Jy
01-Oct-2026 22:39:19 2026-10-02 02:39:19        WARN        SkyCompRep::peakToIntegralFlux()        The image units 'cm-2' are not consistent
01-Oct-2026 22:39:19 2026-10-02 02:39:19        WARN        SkyCompRep::peakToIntegralFlux()+        with Jy when integrated over the sky.  Assuming Jy/pixel
01-Oct-2026 22:39:19 2026-10-02 02:39:19        WARN        SkyCompRep::integralToPeakFlux()        The image units 'cm-2' are not consistent
01-Oct-2026 22:39:19 2026-10-02 02:39:19        WARN        SkyCompRep::integralToPeakFlux()+        with Jy when integrated over the sky.  Assuming Jy/pixel
01-Oct-2026 22:39:19 2026-10-02 02:39:19        WARN        ImageFitter::_finishConstruction        Unrecognized intensity unit cm-2. Will assume Jy/pixel
01-Oct-2026 22:39:19 2026-10-02 02:39:20        WARN        SkyCompRep::convertToJy        Cannot convert units of brightness to Jy - will assume Jy
01-Oct-2026 22:39:19 2026-10-02 02:39:20        WARN        SkyCompRep::peakToIntegralFlux()        The image units 'cm-2' are not consistent
01-Oct-2026 22:39:19 2026-10-02 02:39:20        WARN        SkyCompRep::peakToIntegralFlux()+        with Jy when integrated over the sky.  Assuming Jy/pixel
01-Oct-2026 22:39:19 2026-10-02 02:39:20        WARN        SkyCompRep::integralToPeakFlux()        The image units 'cm-2' are not consistent
01-Oct-2026 22:39:19 2026-10-02 02:39:20        WARN        SkyCompRep::integralToPeakFlux()+        with Jy when integrated over the sky.  Assuming Jy/pixel
01-Oct-2026 22:39:19 2026-10-02 02:39:20        WARN        componentlist::fromrecord        componentlist is not empty; overwriting it
01-Oct-2026 22:39:19 test_task_imsmooth.py::imsmooth_test::test_conserve_flux
01-Oct-2026 22:39:19 Test flux density is conserved for images with units of K or anything without 'beam'
01-Oct-2026 22:39:19 FAILED
01-Oct-2026 22:39:19
01-Oct-2026 22:39:19 test_task_imsmooth.py::imsmooth_test::test_copying_of_input_mask
01-Oct-2026 22:39:19 CAS-12904: copy input mask to output image
01-Oct-2026 22:39:19 FAILED
01-Oct-2026 22:39:19
01-Oct-2026 22:39:19 test_task_imsmooth.py::imsmooth_test::test_history
01-Oct-2026 22:39:19 Test that history is written
01-Oct-2026 22:39:19 FAILED
01-Oct-2026 22:39:19
01-Oct-2026 22:39:19 2026-10-02 02:39:20        WARN        image::open (file /private/var/folders/60/83wxljbx2vlfbx_hy0yfv8rc0000gn/T/build-via-sdist-dgklqugq/casatools-6.7.7.8a14803.dev2/src/tools/image/image_cmpt.cc, line 4289)        Another image is already open, closing first
01-Oct-2026 22:39:19 test_task_imsmooth.py::imsmooth_test::test_image_kernel
01-Oct-2026 22:39:19 Test image as kernel, CAS-5844
01-Oct-2026 22:39:19 max 9.886433412037432e-05
01-Oct-2026 22:39:19 FAILED
01-Oct-2026 22:39:19
01-Oct-2026 22:39:19 2026-10-02 02:39:20        WARN        imsmooth::::casa        The IMAGENAME parameter tests will cause errors to occur, do not be alarmed
01-Oct-2026 22:39:19 2026-10-02 02:39:20        WARN        imsmooth::image::commonbeam (file /private/var/folders/60/83wxljbx2vlfbx_hy0yfv8rc0000gn/T/build-via-sdist-dgklqugq/casatools-6.7.7.8a14803.dev2/src/tools/image/image_cmpt.cc, line 824)        This image only has one beam, so just returning that
01-Oct-2026 22:39:19 2026-10-02 02:39:20        WARN        imsmooth::image::commonbeam (file /private/var/folders/60/83wxljbx2vlfbx_hy0yfv8rc0000gn/T/build-via-sdist-dgklqugq/casatools-6.7.7.8a14803.dev2/src/tools/image/image_cmpt.cc, line 824)        This image only has one beam, so just returning that
01-Oct-2026 22:39:19 2026-10-02 02:39:20        WARN        imsmooth::::casa        The OUTFILE parameter tests will cause errors to occur, do not be alarmed
01-Oct-2026 22:39:19 2026-10-02 02:39:20        WARN        imsmooth::image::commonbeam (file /private/var/folders/60/83wxljbx2vlfbx_hy0yfv8rc0000gn/T/build-via-sdist-dgklqugq/casatools-6.7.7.8a14803.dev2/src/tools/image/image_cmpt.cc, line 824)        This image only has one beam, so just returning that
01-Oct-2026 22:39:19 2026-10-02 02:39:20        SEVERE        imsmooth::ImageInputProcessor::_process        Replaceable flag is false and there is already a file or directory named input_test1 so the output image will not be written
01-Oct-2026 22:39:19 2026-10-02 02:39:20        SEVERE        imsmooth::image::_convolve2d (file /private/var/folders/60/83wxljbx2vlfbx_hy0yfv8rc0000gn/T/build-via-sdist-dgklqugq/casatools-6.7.7.8a14803.dev2/src/tools/image/image_cmpt.cc, line 1212)        Exception Reported: 2026-10-02 02:39:20        SEVERE        imsmooth::ImageInputProcessor::_process        Replaceable flag is false and there is already a file or directory named input_test1 so the output image will not be written
01-Oct-2026 22:39:19 2026-10-02 02:39:20        SEVERE        imsmooth::::casa        Task imsmooth raised an exception of class RuntimeError with the following message: 2026-10-02 02:39:20        SEVERE        imsmooth::ImageInputProcessor::_process        Replaceable flag is false and there is already a file or directory named input_test1 so the output image will not be written
01-Oct-2026 22:39:19 2026-10-02 02:39:20        WARN        imsmooth::image::commonbeam (file /private/var/folders/60/83wxljbx2vlfbx_hy0yfv8rc0000gn/T/build-via-sdist-dgklqugq/casatools-6.7.7.8a14803.dev2/src/tools/image/image_cmpt.cc, line 824)        This image only has one beam, so just returning that
01-Oct-2026 22:39:19 2026-10-02 02:39:20        WARN        imsmooth::::casa        The KERNEL parameter tests will cause errors to occur, do not be alarmed
01-Oct-2026 22:39:19 2026-10-02 02:39:20        WARN        imsmooth::image::commonbeam (file /private/var/folders/60/83wxljbx2vlfbx_hy0yfv8rc0000gn/T/build-via-sdist-dgklqugq/casatools-6.7.7.8a14803.dev2/src/tools/image/image_cmpt.cc, line 824)        This image only has one beam, so just returning that
01-Oct-2026 22:39:19 2026-10-02 02:39:20        WARN        imsmooth::::casa        The MAJOR parameter tests will cause errors to occur, do not be alarmed
01-Oct-2026 22:39:19 2026-10-02 02:39:20        WARN        imsmooth::image::commonbeam (file /private/var/folders/60/83wxljbx2vlfbx_hy0yfv8rc0000gn/T/build-via-sdist-dgklqugq/casatools-6.7.7.8a14803.dev2/src/tools/image/image_cmpt.cc, line 824)        This image only has one beam, so just returning that
01-Oct-2026 22:39:19 2026-10-02 02:39:20        WARN        imsmooth::image::commonbeam (file /private/var/folders/60/83wxljbx2vlfbx_hy0yfv8rc0000gn/T/build-via-sdist-dgklqugq/casatools-6.7.7.8a14803.dev2/src/tools/image/image_cmpt.cc, line 824)        This image only has one beam, so just returning that
01-Oct-2026 22:39:19 2026-10-02 02:39:20        SEVERE        imsmooth::image::deconvolvefrombeam (file /private/var/folders/60/83wxljbx2vlfbx_hy0yfv8rc0000gn/T/build-via-sdist-dgklqugq/casatools-6.7.7.8a14803.dev2/src/tools/image/image_cmpt.cc, line 1663)        Exception Reported: Exception: Major axis must have angular units (pix is not)..
01-Oct-2026 22:39:19 2026-10-02 02:39:20        SEVERE        imsmooth::image::deconvolvefrombeam (file /private/var/folders/60/83wxljbx2vlfbx_hy0yfv8rc0000gn/T/build-via-sdist-dgklqugq/casatools-6.7.7.8a14803.dev2/src/tools/image/image_cmpt.cc, line 1663)+        ... thrown by void casacore::GaussianBeam::setMajorMinor(const Quantity &, const Quantity &) at File: ../../scimath/Mathematics/GaussianBeam.cc, line: 152
01-Oct-2026 22:39:19 2026-10-02 02:39:20        SEVERE        imsmooth::::casa        Task imsmooth raised an exception of class RuntimeError with the following message: Exception: Major axis must have angular units (pix is not)..
01-Oct-2026 22:39:19 2026-10-02 02:39:20        SEVERE        imsmooth::::casa+        ... thrown by void casacore::GaussianBeam::setMajorMinor(const Quantity &, const Quantity &) at File: ../../scimath/Mathematics/GaussianBeam.cc, line: 152
01-Oct-2026 22:39:20 test_task_imsmooth.py::imsmooth_test::test_input
01-Oct-2026 22:39:20 Imsmooth: Testing INPUT/OUTPUT tests
01-Oct-2026 22:39:20 {'fit': {'major': {'unit': 'arcsec', 'value': 0.0}, 'minor': {'unit': 'arcsec', 'value': 0.0}, 'pa': {'unit': 'deg', 'value': 0.0}, 'success': False}, 'return': False}  val  0.0
01-Oct-2026 22:39:20 {'fit': {'major': {'unit': 'arcsec', 'value': 0.0}, 'minor': {'unit': 'arcsec', 'value': 0.0}, 'pa': {'unit': 'deg', 'value': 0.0}, 'success': False}, 'return': False}  val  0.0
01-Oct-2026 22:39:20 {'fit': {'major': {'unit': 'arcsec', 'value': 0.0}, 'minor': {'unit': 'arcsec', 'value': 0.0}, 'pa': {'unit': 'deg', 'value': 0.0}, 'success': False}, 'return': False}  val  0.0
01-Oct-2026 22:39:20 {'fit': {'major': {'unit': 'arcsec', 'value': 0.0}, 'minor': {'unit': 'arcsec', 'value': 0.0}, 'pa': {'unit': 'deg', 'value': 0.0}, 'success': False}, 'return': False}  val  0.0
01-Oct-2026 22:39:20 {'fit': {'major': {'unit': 'arcsec', 'value': 0.0}, 'minor': {'unit': 'arcsec', 'value': 0.0}, 'pa': {'unit': 'deg', 'value': 0.0}, 'success': False}, 'return': False}  val  0.0
01-Oct-2026 22:39:20 {'fit': {'major': {'unit': 'arcsec', 'value': 0.0}, 'minor': {'unit': 'arcsec', 'value': 0.0}, 'pa': {'unit': 'deg', 'value': 0.0}, 'success': False}, 'return': False}  val  0.0
01-Oct-2026 22:39:20 FAILED
01-Oct-2026 22:39:20 test_task_imsmooth.py::imsmooth_test::test_input ERROR
01-Oct-2026 22:39:20
01-Oct-2026 22:39:20 2026-10-02 02:39:20        WARN        imsmooth::image::commonbeam (file /private/var/folders/60/83wxljbx2vlfbx_hy0yfv8rc0000gn/T/build-via-sdist-dgklqugq/casatools-6.7.7.8a14803.dev2/src/tools/image/image_cmpt.cc, line 824)        This image only has one beam, so just returning that
01-Oct-2026 22:39:20 2026-10-02 02:39:20        WARN        imsmooth::image::commonbeam (file /private/var/folders/60/83wxljbx2vlfbx_hy0yfv8rc0000gn/T/build-via-sdist-dgklqugq/casatools-6.7.7.8a14803.dev2/src/tools/image/image_cmpt.cc, line 824)        This image only has one beam, so just returning that
01-Oct-2026 22:39:20 2026-10-02 02:39:20        WARN        imsmooth::image::commonbeam (file /private/var/folders/60/83wxljbx2vlfbx_hy0yfv8rc0000gn/T/build-via-sdist-dgklqugq/casatools-6.7.7.8a14803.dev2/src/tools/image/image_cmpt.cc, line 824)        This image only has one beam, so just returning that
01-Oct-2026 22:39:20 2026-10-02 02:39:20        WARN        imsmooth::image::commonbeam (file /private/var/folders/60/83wxljbx2vlfbx_hy0yfv8rc0000gn/T/build-via-sdist-dgklqugq/casatools-6.7.7.8a14803.dev2/src/tools/image/image_cmpt.cc, line 824)        This image only has one beam, so just returning that
01-Oct-2026 22:39:20 2026-10-02 02:39:20        WARN        imsmooth::image::commonbeam (file /private/var/folders/60/83wxljbx2vlfbx_hy0yfv8rc0000gn/T/build-via-sdist-dgklqugq/casatools-6.7.7.8a14803.dev2/src/tools/image/image_cmpt.cc, line 824)        This image only has one beam, so just returning that
01-Oct-2026 22:39:20 test_task_imsmooth.py::imsmooth_test::test_multibeam
01-Oct-2026 22:39:20 Test per plane beams
01-Oct-2026 22:39:20 {'fit': {'major': {'unit': 'arcsec', 'value': 321.87959251178336}, 'minor': {'unit': 'arcsec', 'value': 137.08948874530165}, 'pa': {'unit': 'deg', 'value': -69.59027536693638}, 'success': True}, 'return': False}  val  0.00066462859680034
01-Oct-2026 22:39:20 {'fit': {'major': {'unit': 'arcsec', 'value': 547.8906364742298}, 'minor': {'unit': 'arcsec', 'value': 409.65332961403243}, 'pa': {'unit': 'deg', 'value': -87.3125738965605}, 'success': True}, 'return': False}  val  0.0019860553870895714
01-Oct-2026 22:39:20 {'fit': {'major': {'unit': 'arcsec', 'value': 513.8525682319146}, 'minor': {'unit': 'arcsec', 'value': 373.0355721931427}, 'pa': {'unit': 'deg', 'value': -83.598768316534}, 'success': True}, 'return': False}  val  0.0018085274893975957
01-Oct-2026 22:39:20 {'fit': {'major': {'unit': 'arcsec', 'value': 468.1327037486219}, 'minor': {'unit': 'arcsec', 'value': 323.8082328802109}, 'pa': {'unit': 'deg', 'value': -79.55330267543454}, 'success': True}, 'return': False}  val  0.0015698666135622891
01-Oct-2026 22:39:20 {'fit': {'major': {'unit': 'arcsec', 'value': 406.94533484003284}, 'minor': {'unit': 'arcsec', 'value': 254.5495913411243}, 'pa': {'unit': 'deg', 'value': -75.00305161548785}, 'success': True}, 'return': False}  val  0.0012340912440301855
01-Oct-2026 22:39:20 {'fit': {'major': {'unit': 'arcsec', 'value': 321.87959251178336}, 'minor': {'unit': 'arcsec', 'value': 137.08948874530165}, 'pa': {'unit': 'deg', 'value': -69.59027536693638}, 'success': True}, 'return': False}  val  0.00066462859680034
01-Oct-2026 22:39:20 FAILED
01-Oct-2026 22:39:20
01-Oct-2026 22:39:20 2026-10-02 02:39:20        SEVERE        imsmooth::ImageInputProcessor::_process        Replaceable flag is false and there is already a file or directory named imsmooth_test_overwrite.im so the output image will not be written
01-Oct-2026 22:39:20 2026-10-02 02:39:20        SEVERE        imsmooth::image::_convolve2d (file /private/var/folders/60/83wxljbx2vlfbx_hy0yfv8rc0000gn/T/build-via-sdist-dgklqugq/casatools-6.7.7.8a14803.dev2/src/tools/image/image_cmpt.cc, line 1212)        Exception Reported: 2026-10-02 02:39:20        SEVERE        imsmooth::ImageInputProcessor::_process        Replaceable flag is false and there is already a file or directory named imsmooth_test_overwrite.im so the output image will not be written
01-Oct-2026 22:39:20 2026-10-02 02:39:20        SEVERE        imsmooth::::casa        Task imsmooth raised an exception of class RuntimeError with the following message: 2026-10-02 02:39:20        SEVERE        imsmooth::ImageInputProcessor::_process        Replaceable flag is false and there is already a file or directory named imsmooth_test_overwrite.im so the output image will not be written
01-Oct-2026 22:39:20 test_task_imsmooth.py::imsmooth_test::test_overwrite
01-Oct-2026 22:39:20 test overwrite parameter 
01-Oct-2026 22:39:20 FAILED
01-Oct-2026 22:39:20
01-Oct-2026 22:39:20 test_task_imsmooth.py::imsmooth_test::test_region
01-Oct-2026 22:39:20 Imsmooth: Region selection correction test
01-Oct-2026 22:39:20 FAILED
01-Oct-2026 22:39:20
01-Oct-2026 22:39:21 test_task_imsmooth.py::imsmooth_test::test_smooth
01-Oct-2026 22:39:21 Imsmooth: Testing correctness
01-Oct-2026 22:39:21 FAILED
01-Oct-2026 22:39:21
01-Oct-2026 22:39:21 2026-10-02 02:39:22        WARN        imsmooth::::casa        The outfile paramter is empty, consequently the smoothed image will be
01-Oct-2026 22:39:21 2026-10-02 02:39:22        WARN        imsmooth::::casa+        saved on disk in file, imsmooth_results.im
01-Oct-2026 22:39:21 2026-10-02 02:39:22        SEVERE        image::_convolve2d (file /private/var/folders/60/83wxljbx2vlfbx_hy0yfv8rc0000gn/T/build-via-sdist-dgklqugq/casatools-6.7.7.8a14803.dev2/src/tools/image/image_cmpt.cc, line 1212)        Exception Reported: The input image shape ([200, 200, 1, 20]) and mask shape ([200, 200, 1, 1]) are different, and it was specified that the mask should not be extended, so the mask cannot be applied to the (sub)image. Specifying that the mask should be extended may resolve the issue at File: /Users/casaci/bamboohome/xml-data/build-dir/CASASPECS-DBC268-BPO15AP312/casainstall/include/casacpp/imageanalysis/ImageAnalysis/SubImageFactory.tcc, line: 306
01-Oct-2026 22:39:21 2026-10-02 02:39:22        SEVERE        imsmooth::::casa        Task imsmooth raised an exception of class RuntimeError with the following message: The input image shape ([200, 200, 1, 20]) and mask shape ([200, 200, 1, 1]) are different, and it was specified that the mask should not be extended, so the mask cannot be applied to the (sub)image. Specifying that the mask should be extended may resolve the issue at File: /Users/casaci/bamboohome/xml-data/build-dir/CASASPECS-DBC268-BPO15AP312/casainstall/include/casacpp/imageanalysis/ImageAnalysis/SubImageFactory.tcc, line: 306
01-Oct-2026 22:39:22 2026-10-02 02:39:22        WARN        imsmooth::::casa        The outfile paramter is empty, consequently the smoothed image will be
01-Oct-2026 22:39:22 2026-10-02 02:39:22        WARN        imsmooth::::casa+        saved on disk in file, imsmooth_results.im
01-Oct-2026 22:39:22 2026-10-02 02:39:22        WARN        Image2DConvolver::_dealWithRestoringBeam        Convolving kernel has minor axis 2 arcsec which is less than the pixel diagonal length of 84.8528 arcsec. Thus, the kernel is poorly sampled, and so the output of this application may not be what you expect. You should consider increasing the kernel size or regridding the image to a smaller pixel size
01-Oct-2026 22:39:22 test_task_imsmooth.py::imsmooth_test::test_stretch
01-Oct-2026 22:39:22 imsmooth(): Test stretch parameter
01-Oct-2026 22:39:22 FAILED
01-Oct-2026 22:39:22
01-Oct-2026 22:39:22 2026-10-02 02:39:23        WARN        imsmooth::image::commonbeam (file /private/var/folders/60/83wxljbx2vlfbx_hy0yfv8rc0000gn/T/build-via-sdist-dgklqugq/casatools-6.7.7.8a14803.dev2/src/tools/image/image_cmpt.cc, line 824)        This image only has one beam, so just returning that
01-Oct-2026 22:39:22 2026-10-02 02:39:23        WARN        imsmooth::image::commonbeam (file /private/var/folders/60/83wxljbx2vlfbx_hy0yfv8rc0000gn/T/build-via-sdist-dgklqugq/casatools-6.7.7.8a14803.dev2/src/tools/image/image_cmpt.cc, line 824)        This image only has one beam, so just returning that
01-Oct-2026 22:39:22 2026-10-02 02:39:23        WARN        imsmooth::::casa        difference Gaussian beam is subpixel doing regridding before convolution
01-Oct-2026 22:39:22 2026-10-02 02:39:23        SEVERE        AppInfo::workDirectory(uInt) (file ../../casa/System/AppInfo.cc, line 106)        No work directory with at least 101438731MB free can be found.
01-Oct-2026 22:39:22 2026-10-02 02:39:23        SEVERE        AppInfo::workDirectory(uInt) (file ../../casa/System/AppInfo.cc, line 106)+        Check aipsrc variable user.directories.work.
01-Oct-2026 22:39:22 2026-10-02 02:39:23        SEVERE        image::regrid        Exception Reported: 2026-10-02 02:39:23        SEVERE        AppInfo::workDirectory(uInt) (file ../../casa/System/AppInfo.cc, line 106)        No work directory with at least 101438731MB free can be found.
01-Oct-2026 22:39:22 2026-10-02 02:39:23        SEVERE        image::regrid+        2026-10-02 02:39:23        SEVERE        AppInfo::workDirectory(uInt) (file ../../casa/System/AppInfo.cc, line 106)+        Check aipsrc variable user.directories.work.
01-Oct-2026 22:39:22 2026-10-02 02:39:23        SEVERE        imsmooth::::casa        Task imsmooth raised an exception of class AttributeError with the following message: 'bool' object has no attribute 'shape'
01-Oct-2026 22:39:22 test_task_imsmooth.py::imsmooth_test::test_targetres
01-Oct-2026 22:39:22 Test targetres parameter
01-Oct-2026 22:39:22 {'fit': {'major': {'unit': 'arcsec', 'value': 5.291502622129181}, 'minor': {'unit': 'arcsec', 'value': 2.6457513110645907}, 'pa': {'unit': 'deg', 'value': -0.0}, 'success': True}, 'return': False}  val  1.2826964324176052e-05
01-Oct-2026 22:39:22 {'fit': {'major': {'unit': 'arcsec', 'value': 8.0}, 'minor': {'unit': 'arcsec', 'value': 4.0}, 'pa': {'unit': 'deg', 'value': -0.0}, 'success': True}, 'return': False}  val  1.939254724438144e-05
01-Oct-2026 22:39:22 FAILED
01-Oct-2026 22:39:22 test_task_imsmooth.py::imsmooth_test::test_targetres ERROR
01-Oct-2026 22:39:22
01-Oct-2026 22:39:22 ==================================== ERRORS ====================================
01-Oct-2026 22:39:22 _________________ ERROR at teardown of imsmooth_test.test_beam _________________
01-Oct-2026 22:39:22 test_task_imsmooth.py:98: in tearDown
01-Oct-2026 22:39:22     self.assertTrue(len(_tb.showcache()) == 0)
01-Oct-2026 22:39:22 E   AssertionError: False is not true
01-Oct-2026 22:39:22 ______________ ERROR at teardown of imsmooth_test.test_commonbeam ______________
01-Oct-2026 22:39:22 test_task_imsmooth.py:98: in tearDown
01-Oct-2026 22:39:22     self.assertTrue(len(_tb.showcache()) == 0)
01-Oct-2026 22:39:22 E   AssertionError: False is not true
01-Oct-2026 22:39:22 ________________ ERROR at teardown of imsmooth_test.test_input _________________
01-Oct-2026 22:39:22 test_task_imsmooth.py:98: in tearDown
01-Oct-2026 22:39:22     self.assertTrue(len(_tb.showcache()) == 0)
01-Oct-2026 22:39:22 E   AssertionError: False is not true
01-Oct-2026 22:39:22 ______________ ERROR at teardown of imsmooth_test.test_targetres _______________
01-Oct-2026 22:39:22 test_task_imsmooth.py:98: in tearDown
01-Oct-2026 22:39:22     self.assertTrue(len(_tb.showcache()) == 0)
01-Oct-2026 22:39:22 E   AssertionError: False is not true
01-Oct-2026 22:39:22 =================================== FAILURES ===================================
01-Oct-2026 22:39:22 ___________________________ imsmooth_test.test_beam ____________________________
01-Oct-2026 22:39:22 test_task_imsmooth.py:1238: in test_beam
01-Oct-2026 22:39:22     x = run_imsmooth(
01-Oct-2026 22:39:22 test_task_imsmooth.py:57: in run_imsmooth
01-Oct-2026 22:39:22     return imsmooth(
01-Oct-2026 22:39:22 ../../../../casa6testenv/lib/python3.12/site-packages/casatasks/imsmooth.py:201: in __call__
01-Oct-2026 22:39:22     task_result = _imsmooth_t( _pc.document['imagename'], _pc.document['kernel'], _pc.document['major'], _pc.document['minor'], _pc.document['pa'], _pc.document['targetres'], _pc.document['kimage'], _pc.document['scale'], _pc.document['region'], _pc.document['box'], _pc.document['chans'], _pc.document['stokes'], _pc.document['mask'], _pc.document['outfile'], _pc.document['stretch'], _pc.document['overwrite'], _pc.document['beam'] )
01-Oct-2026 22:39:22                   ^^^^^^^^^^^^^^^^^^^^^^^^^^^^^^^^^^^^^^^^^^^^^^^^^^^^^^^^^^^^^^^^^^^^^^^^^^^^^^^^^^^^^^^^^^^^^^^^^^^^^^^^^^^^^^^^^^^^^^^^^^^^^^^^^^^^^^^^^^^^^^^^^^^^^^^^^^^^^^^^^^^^^^^^^^^^^^^^^^^^^^^^^^^^^^^^^^^^^^^^^^^^^^^^^^^^^^^^^^^^^^^^^^^^^^^^^^^^^^^^^^^^^^^^^^^^^^^^^^^^^^^^^^^^^^^^^^^^^^^^^^^^^^^^^^^^^^^^^^^^^^^^^^^^^^^^^^^^^^^^^^^^^^^^^^^^^^^^^^^^^^^^^^^^^^^^^^^^^^^^^^^^^^^^^^^^^^^^^^^^^^^^^^^^^^^^^^^^^^^^^^^^^^^^^^^^^^^^^
01-Oct-2026 22:39:22 ../../../../casa6testenv/lib/python3.12/site-packages/casatasks/private/callabletask.py:31: in wrapper
01-Oct-2026 22:39:22     retval = func(*args, **kwargs)
01-Oct-2026 22:39:22              ^^^^^^^^^^^^^^^^^^^^^
01-Oct-2026 22:39:22 ../../../../casa6testenv/lib/python3.12/site-packages/casatasks/private/task_imsmooth.py:163: in imsmooth
01-Oct-2026 22:39:22     pixfac=test_conv_kernel_size(imagename, beamval)
01-Oct-2026 22:39:22            ^^^^^^^^^^^^^^^^^^^^^^^^^^^^^^^^^^^^^^^^^
01-Oct-2026 22:39:22 ../../../../casa6testenv/lib/python3.12/site-packages/casatasks/private/ialib.py:232: in test_conv_kernel_size
01-Oct-2026 22:39:22     res=ia.deconvolvefrombeam(source=beam, beam=source)
01-Oct-2026 22:39:22         ^^^^^^^^^^^^^^^^^^^^^^^^^^^^^^^^^^^^^^^^^^^^^^^
01-Oct-2026 22:39:22 ../../../../casa6testenv/lib/python3.12/site-packages/casatools/image.py:1250: in deconvolvefrombeam
01-Oct-2026 22:39:22     return self._swigobj.deconvolvefrombeam(source, beam)
01-Oct-2026 22:39:22            ^^^^^^^^^^^^^^^^^^^^^^^^^^^^^^^^^^^^^^^^^^^^^^
01-Oct-2026 22:39:22 ../../../../casa6testenv/lib/python3.12/site-packages/casatools/__casac__/image.py:2794: in deconvolvefrombeam
01-Oct-2026 22:39:22     return _image.image_deconvolvefrombeam(self, *args, **kwargs)
01-Oct-2026 22:39:22            ^^^^^^^^^^^^^^^^^^^^^^^^^^^^^^^^^^^^^^^^^^^^^^^^^^^^^^
01-Oct-2026 22:39:22 E   RuntimeError: Cannot understand source values
01-Oct-2026 22:39:22 ________________________ imsmooth_test.test_commonbeam _________________________
01-Oct-2026 22:39:22 test_task_imsmooth.py:1316: in test_commonbeam
01-Oct-2026 22:39:22     imsmooth(
01-Oct-2026 22:39:22 ../../../../casa6testenv/lib/python3.12/site-packages/casatasks/imsmooth.py:201: in __call__
01-Oct-2026 22:39:22     task_result = _imsmooth_t( _pc.document['imagename'], _pc.document['kernel'], _pc.document['major'], _pc.document['minor'], _pc.document['pa'], _pc.document['targetres'], _pc.document['kimage'], _pc.document['scale'], _pc.document['region'], _pc.document['box'], _pc.document['chans'], _pc.document['stokes'], _pc.document['mask'], _pc.document['outfile'], _pc.document['stretch'], _pc.document['overwrite'], _pc.document['beam'] )
01-Oct-2026 22:39:22                   ^^^^^^^^^^^^^^^^^^^^^^^^^^^^^^^^^^^^^^^^^^^^^^^^^^^^^^^^^^^^^^^^^^^^^^^^^^^^^^^^^^^^^^^^^^^^^^^^^^^^^^^^^^^^^^^^^^^^^^^^^^^^^^^^^^^^^^^^^^^^^^^^^^^^^^^^^^^^^^^^^^^^^^^^^^^^^^^^^^^^^^^^^^^^^^^^^^^^^^^^^^^^^^^^^^^^^^^^^^^^^^^^^^^^^^^^^^^^^^^^^^^^^^^^^^^^^^^^^^^^^^^^^^^^^^^^^^^^^^^^^^^^^^^^^^^^^^^^^^^^^^^^^^^^^^^^^^^^^^^^^^^^^^^^^^^^^^^^^^^^^^^^^^^^^^^^^^^^^^^^^^^^^^^^^^^^^^^^^^^^^^^^^^^^^^^^^^^^^^^^^^^^^^^^^^^^^^^^^
01-Oct-2026 22:39:22 ../../../../casa6testenv/lib/python3.12/site-packages/casatasks/private/callabletask.py:31: in wrapper
01-Oct-2026 22:39:22     retval = func(*args, **kwargs)
01-Oct-2026 22:39:22              ^^^^^^^^^^^^^^^^^^^^^
01-Oct-2026 22:39:22 ../../../../casa6testenv/lib/python3.12/site-packages/casatasks/private/task_imsmooth.py:163: in imsmooth
01-Oct-2026 22:39:22     pixfac=test_conv_kernel_size(imagename, beamval)
01-Oct-2026 22:39:22            ^^^^^^^^^^^^^^^^^^^^^^^^^^^^^^^^^^^^^^^^^
01-Oct-2026 22:39:22 ../../../../casa6testenv/lib/python3.12/site-packages/casatasks/private/ialib.py:232: in test_conv_kernel_size
01-Oct-2026 22:39:22     res=ia.deconvolvefrombeam(source=beam, beam=source)
01-Oct-2026 22:39:22         ^^^^^^^^^^^^^^^^^^^^^^^^^^^^^^^^^^^^^^^^^^^^^^^
01-Oct-2026 22:39:22 ../../../../casa6testenv/lib/python3.12/site-packages/casatools/image.py:1250: in deconvolvefrombeam
01-Oct-2026 22:39:22     return self._swigobj.deconvolvefrombeam(source, beam)
01-Oct-2026 22:39:22            ^^^^^^^^^^^^^^^^^^^^^^^^^^^^^^^^^^^^^^^^^^^^^^
01-Oct-2026 22:39:22 ../../../../casa6testenv/lib/python3.12/site-packages/casatools/__casac__/image.py:2794: in deconvolvefrombeam
01-Oct-2026 22:39:22     return _image.image_deconvolvefrombeam(self, *args, **kwargs)
01-Oct-2026 22:39:22            ^^^^^^^^^^^^^^^^^^^^^^^^^^^^^^^^^^^^^^^^^^^^^^^^^^^^^^
01-Oct-2026 22:39:22 E   RuntimeError: Cannot understand source values
01-Oct-2026 22:39:22 _______________________ imsmooth_test.test_conserve_flux _______________________
01-Oct-2026 22:39:22 test_task_imsmooth.py:98: in tearDown
01-Oct-2026 22:39:22     self.assertTrue(len(_tb.showcache()) == 0)
01-Oct-2026 22:39:22 E   AssertionError: False is not true
01-Oct-2026 22:39:22 ___________________ imsmooth_test.test_copying_of_input_mask ___________________
01-Oct-2026 22:39:22 test_task_imsmooth.py:98: in tearDown
01-Oct-2026 22:39:22     self.assertTrue(len(_tb.showcache()) == 0)
01-Oct-2026 22:39:22 E   AssertionError: False is not true
01-Oct-2026 22:39:22 __________________________ imsmooth_test.test_history __________________________
01-Oct-2026 22:39:22 test_task_imsmooth.py:98: in tearDown
01-Oct-2026 22:39:22     self.assertTrue(len(_tb.showcache()) == 0)
01-Oct-2026 22:39:22 E   AssertionError: False is not true
01-Oct-2026 22:39:22 _______________________ imsmooth_test.test_image_kernel ________________________
01-Oct-2026 22:39:22 test_task_imsmooth.py:98: in tearDown
01-Oct-2026 22:39:22     self.assertTrue(len(_tb.showcache()) == 0)
01-Oct-2026 22:39:22 E   AssertionError: False is not true
01-Oct-2026 22:39:22 ___________________________ imsmooth_test.test_input ___________________________
01-Oct-2026 22:39:22 test_task_imsmooth.py:344: in test_input
01-Oct-2026 22:39:22     results = imsmooth( tiny, major='2pix', minor='1pix', pa="deg", outfile=outfile)
01-Oct-2026 22:39:22               ^^^^^^^^^^^^^^^^^^^^^^^^^^^^^^^^^^^^^^^^^^^^^^^^^^^^^^^^^^^^^^^^^^^^^^
01-Oct-2026 22:39:22 ../../../../casa6testenv/lib/python3.12/site-packages/casatasks/imsmooth.py:201: in __call__
01-Oct-2026 22:39:22     task_result = _imsmooth_t( _pc.document['imagename'], _pc.document['kernel'], _pc.document['major'], _pc.document['minor'], _pc.document['pa'], _pc.document['targetres'], _pc.document['kimage'], _pc.document['scale'], _pc.document['region'], _pc.document['box'], _pc.document['chans'], _pc.document['stokes'], _pc.document['mask'], _pc.document['outfile'], _pc.document['stretch'], _pc.document['overwrite'], _pc.document['beam'] )
01-Oct-2026 22:39:22                   ^^^^^^^^^^^^^^^^^^^^^^^^^^^^^^^^^^^^^^^^^^^^^^^^^^^^^^^^^^^^^^^^^^^^^^^^^^^^^^^^^^^^^^^^^^^^^^^^^^^^^^^^^^^^^^^^^^^^^^^^^^^^^^^^^^^^^^^^^^^^^^^^^^^^^^^^^^^^^^^^^^^^^^^^^^^^^^^^^^^^^^^^^^^^^^^^^^^^^^^^^^^^^^^^^^^^^^^^^^^^^^^^^^^^^^^^^^^^^^^^^^^^^^^^^^^^^^^^^^^^^^^^^^^^^^^^^^^^^^^^^^^^^^^^^^^^^^^^^^^^^^^^^^^^^^^^^^^^^^^^^^^^^^^^^^^^^^^^^^^^^^^^^^^^^^^^^^^^^^^^^^^^^^^^^^^^^^^^^^^^^^^^^^^^^^^^^^^^^^^^^^^^^^^^^^^^^^^^^
01-Oct-2026 22:39:22 ../../../../casa6testenv/lib/python3.12/site-packages/casatasks/private/callabletask.py:31: in wrapper
01-Oct-2026 22:39:22     retval = func(*args, **kwargs)
01-Oct-2026 22:39:22              ^^^^^^^^^^^^^^^^^^^^^
01-Oct-2026 22:39:22 ../../../../casa6testenv/lib/python3.12/site-packages/casatasks/private/task_imsmooth.py:163: in imsmooth
01-Oct-2026 22:39:22     pixfac=test_conv_kernel_size(imagename, beamval)
01-Oct-2026 22:39:22            ^^^^^^^^^^^^^^^^^^^^^^^^^^^^^^^^^^^^^^^^^
01-Oct-2026 22:39:22 ../../../../casa6testenv/lib/python3.12/site-packages/casatasks/private/ialib.py:232: in test_conv_kernel_size
01-Oct-2026 22:39:22     res=ia.deconvolvefrombeam(source=beam, beam=source)
01-Oct-2026 22:39:22         ^^^^^^^^^^^^^^^^^^^^^^^^^^^^^^^^^^^^^^^^^^^^^^^
01-Oct-2026 22:39:22 ../../../../casa6testenv/lib/python3.12/site-packages/casatools/image.py:1250: in deconvolvefrombeam
01-Oct-2026 22:39:22     return self._swigobj.deconvolvefrombeam(source, beam)
01-Oct-2026 22:39:22            ^^^^^^^^^^^^^^^^^^^^^^^^^^^^^^^^^^^^^^^^^^^^^^
01-Oct-2026 22:39:22 ../../../../casa6testenv/lib/python3.12/site-packages/casatools/__casac__/image.py:2794: in deconvolvefrombeam
01-Oct-2026 22:39:22     return _image.image_deconvolvefrombeam(self, *args, **kwargs)
01-Oct-2026 22:39:22            ^^^^^^^^^^^^^^^^^^^^^^^^^^^^^^^^^^^^^^^^^^^^^^^^^^^^^^
01-Oct-2026 22:39:22 E   RuntimeError: Exception: Major axis must have angular units (pix is not)..
01-Oct-2026 22:39:22 E   ... thrown by void casacore::GaussianBeam::setMajorMinor(const Quantity &, const Quantity &) at File: ../../scimath/Mathematics/GaussianBeam.cc, line: 152
01-Oct-2026 22:39:22 _________________________ imsmooth_test.test_multibeam _________________________
01-Oct-2026 22:39:22 test_task_imsmooth.py:98: in tearDown
01-Oct-2026 22:39:22     self.assertTrue(len(_tb.showcache()) == 0)
01-Oct-2026 22:39:22 E   AssertionError: False is not true
01-Oct-2026 22:39:22 _________________________ imsmooth_test.test_overwrite _________________________
01-Oct-2026 22:39:22 test_task_imsmooth.py:98: in tearDown
01-Oct-2026 22:39:22     self.assertTrue(len(_tb.showcache()) == 0)
01-Oct-2026 22:39:22 E   AssertionError: False is not true
01-Oct-2026 22:39:22 __________________________ imsmooth_test.test_region ___________________________
01-Oct-2026 22:39:22 test_task_imsmooth.py:98: in tearDown
01-Oct-2026 22:39:22     self.assertTrue(len(_tb.showcache()) == 0)
01-Oct-2026 22:39:22 E   AssertionError: False is not true
01-Oct-2026 22:39:22 __________________________ imsmooth_test.test_smooth ___________________________
01-Oct-2026 22:39:22 test_task_imsmooth.py:98: in tearDown
01-Oct-2026 22:39:22     self.assertTrue(len(_tb.showcache()) == 0)
01-Oct-2026 22:39:22 E   AssertionError: False is not true
01-Oct-2026 22:39:22 __________________________ imsmooth_test.test_stretch __________________________
01-Oct-2026 22:39:22 test_task_imsmooth.py:98: in tearDown
01-Oct-2026 22:39:22     self.assertTrue(len(_tb.showcache()) == 0)
01-Oct-2026 22:39:22 E   AssertionError: False is not true
01-Oct-2026 22:39:22 _________________________ imsmooth_test.test_targetres _________________________
01-Oct-2026 22:39:22 test_task_imsmooth.py:1060: in test_targetres
01-Oct-2026 22:39:22     run_imsmooth(
01-Oct-2026 22:39:22 test_task_imsmooth.py:57: in run_imsmooth
01-Oct-2026 22:39:22     return imsmooth(
01-Oct-2026 22:39:22 ../../../../casa6testenv/lib/python3.12/site-packages/casatasks/imsmooth.py:201: in __call__
01-Oct-2026 22:39:22     task_result = _imsmooth_t( _pc.document['imagename'], _pc.document['kernel'], _pc.document['major'], _pc.document['minor'], _pc.document['pa'], _pc.document['targetres'], _pc.document['kimage'], _pc.document['scale'], _pc.document['region'], _pc.document['box'], _pc.document['chans'], _pc.document['stokes'], _pc.document['mask'], _pc.document['outfile'], _pc.document['stretch'], _pc.document['overwrite'], _pc.document['beam'] )
01-Oct-2026 22:39:22                   ^^^^^^^^^^^^^^^^^^^^^^^^^^^^^^^^^^^^^^^^^^^^^^^^^^^^^^^^^^^^^^^^^^^^^^^^^^^^^^^^^^^^^^^^^^^^^^^^^^^^^^^^^^^^^^^^^^^^^^^^^^^^^^^^^^^^^^^^^^^^^^^^^^^^^^^^^^^^^^^^^^^^^^^^^^^^^^^^^^^^^^^^^^^^^^^^^^^^^^^^^^^^^^^^^^^^^^^^^^^^^^^^^^^^^^^^^^^^^^^^^^^^^^^^^^^^^^^^^^^^^^^^^^^^^^^^^^^^^^^^^^^^^^^^^^^^^^^^^^^^^^^^^^^^^^^^^^^^^^^^^^^^^^^^^^^^^^^^^^^^^^^^^^^^^^^^^^^^^^^^^^^^^^^^^^^^^^^^^^^^^^^^^^^^^^^^^^^^^^^^^^^^^^^^^^^^^^^^^
01-Oct-2026 22:39:22 ../../../../casa6testenv/lib/python3.12/site-packages/casatasks/private/callabletask.py:31: in wrapper
01-Oct-2026 22:39:22     retval = func(*args, **kwargs)
01-Oct-2026 22:39:22              ^^^^^^^^^^^^^^^^^^^^^
01-Oct-2026 22:39:22 ../../../../casa6testenv/lib/python3.12/site-packages/casatasks/private/task_imsmooth.py:170: in imsmooth
01-Oct-2026 22:39:22     print('reg shape', ib.shape())
01-Oct-2026 22:39:22                        ^^^^^^^^
01-Oct-2026 22:39:22 E   AttributeError: 'bool' object has no attribute 'shape'
01-Oct-2026 22:39:22 - generated xml file: /Users/casaci/bamboohome/xml-data/build-dir/CASASPECS-DEVTESTPY312158-TTARM15PY312/casa6/casatestutils/nosedir/xml/test_task_imsmooth/nose.xml -
01-Oct-2026 22:39:22 =========================== short test summary info ============================
01-Oct-2026 22:39:22 ERROR test_task_imsmooth.py::imsmooth_test::test_beam - AssertionError: False...
01-Oct-2026 22:39:22 ERROR test_task_imsmooth.py::imsmooth_test::test_commonbeam - AssertionError:...
01-Oct-2026 22:39:22 ERROR test_task_imsmooth.py::imsmooth_test::test_input - AssertionError: Fals...
01-Oct-2026 22:39:22 ERROR test_task_imsmooth.py::imsmooth_test::test_targetres - AssertionError: ...
01-Oct-2026 22:39:22 FAILED test_task_imsmooth.py::imsmooth_test::test_beam - RuntimeError: Cannot...
01-Oct-2026 22:39:22 FAILED test_task_imsmooth.py::imsmooth_test::test_commonbeam - RuntimeError: ...
01-Oct-2026 22:39:22 FAILED test_task_imsmooth.py::imsmooth_test::test_conserve_flux - AssertionEr...
01-Oct-2026 22:39:22 FAILED test_task_imsmooth.py::imsmooth_test::test_copying_of_input_mask - Ass...
01-Oct-2026 22:39:22 FAILED test_task_imsmooth.py::imsmooth_test::test_history - AssertionError: F...
01-Oct-2026 22:39:22 FAILED test_task_imsmooth.py::imsmooth_test::test_image_kernel - AssertionErr...
01-Oct-2026 22:39:22 FAILED test_task_imsmooth.py::imsmooth_test::test_input - RuntimeError: Excep...
01-Oct-2026 22:39:22 FAILED test_task_imsmooth.py::imsmooth_test::test_multibeam - AssertionError:...
01-Oct-2026 22:39:22 FAILED test_task_imsmooth.py::imsmooth_test::test_overwrite - AssertionError:...
01-Oct-2026 22:39:22 FAILED test_task_imsmooth.py::imsmooth_test::test_region - AssertionError: Fa...
01-Oct-2026 22:39:22 FAILED test_task_imsmooth.py::imsmooth_test::test_smooth - AssertionError: Fa...
01-Oct-2026 22:39:22 FAILED test_task_imsmooth.py::imsmooth_test::test_stretch - AssertionError: F...
01-Oct-2026 22:39:22 FAILED test_task_imsmooth.py::imsmooth_test::test_targetres - AttributeError:...
01-Oct-2026 22:39:22 =================== 13 failed, 1 warning, 4 errors in 33.91s ===================
01-Oct-2026 22:39:22 Namespace(list=False, verbose=False, dry_run=False, classes=None, file=None, mapfile=<_io.TextIOWrapper name='./casatestutils/component_to_test_map.json' mode='r' encoding='UTF-8'>, branch='CAS-14803', merge_target=None, pkg=None, work_dir=None, ncores=2, test_paths=None, test_list=None, test_config=None, test_group='imsmooth', pmode=None, bamboo=False, cachedir=None, ignore_list='test_casampi,test_task_msview,test_task_imview,test_task_plotms', run_skipped=False, only_skipped=False)
01-Oct-2026 22:39:22
01-Oct-2026 22:39:22 Operating system: Darwin
01-Oct-2026 22:39:22
01-Oct-2026 22:39:22 Testing Components['imsmooth']
01-Oct-2026 22:39:22
01-Oct-2026 22:39:22 Arguments Sent Direct To Pytest :  []
01-Oct-2026 22:39:22
01-Oct-2026 22:39:22 Tests to Ignore:  ['test_casampi', 'test_task_msview', 'test_task_imview', 'test_task_plotms']
01-Oct-2026 22:39:22 Running 1 Test(s)
01-Oct-2026 22:39:22 Cleaning: /Users/casaci/bamboohome/xml-data/build-dir/CASASPECS-DEVTESTPY312158-TTARM15PY312/casa6/casatestutils/nosedir/
01-Oct-2026 22:39:22 Tests: ['test_task_imsmooth']
01-Oct-2026 22:39:22 Fetching Repository: casa6
01-Oct-2026 22:39:22         Running:  git clone https://open-bitbucket.nrao.edu/scm/casa/casa6
01-Oct-2026 22:39:22         Running:  git checkout origin/CAS-14803
01-Oct-2026 22:39:22
01-Oct-2026 22:39:22 Fetching Repository: casampi
01-Oct-2026 22:39:22         Running:  git clone https://open-bitbucket.nrao.edu/scm/casa/casampi
01-Oct-2026 22:39:22         Tag: tags/0.6.0
01-Oct-2026 22:39:22         Running:  git checkout tags/0.6.0
01-Oct-2026 22:39:22
01-Oct-2026 22:39:22 Fetching Repository: casaplotms
01-Oct-2026 22:39:22         Running:  git clone https://open-bitbucket.nrao.edu/scm/casa/casaplotms
01-Oct-2026 22:39:22         Tag: tags/3.0.1
01-Oct-2026 22:39:22         Running:  git checkout tags/3.0.1
01-Oct-2026 22:39:22
01-Oct-2026 22:39:22 Fetching Repository: casaviewer
01-Oct-2026 22:39:22         Running:  git clone https://open-bitbucket.nrao.edu/scm/casa/casaviewer
01-Oct-2026 22:39:22         Tag: tags/2.5.1
01-Oct-2026 22:39:22         Running:  git checkout tags/2.5.1
01-Oct-2026 22:39:22 Directory Of Tests:  /Users/casaci/bamboohome/xml-data/build-dir/CASASPECS-DEVTESTPY312158-TTARM15PY312/casa6/casatestutils/nosedir/tests/
01-Oct-2026 22:39:22
01-Oct-2026 22:39:22 Setting Working Directory: /Users/casaci/bamboohome/xml-data/build-dir/CASASPECS-DEVTESTPY312158-TTARM15PY312/casa6/casatestutils/nosedir/test_task_imsmooth/
01-Oct-2026 22:39:22 Test Directory: /Users/casaci/bamboohome/xml-data/build-dir/CASASPECS-DEVTESTPY312158-TTARM15PY312/casa6/casatestutils/nosedir/test_task_imsmooth
01-Oct-2026 22:39:22
01-Oct-2026 22:39:22 Running Command: pytest --junitxml=/Users/casaci/bamboohome/xml-data/build-dir/CASASPECS-DEVTESTPY312158-TTARM15PY312/casa6/casatestutils/nosedir/xml/test_task_imsmooth/nose.xml -s --disable-pytest-warnings --verbose -ra --tb=short /Users/casaci/bamboohome/xml-data/build-dir/CASASPECS-DEVTESTPY312158-TTARM15PY312/casa6/casatestutils/nosedir/test_task_imsmooth/
01-Oct-2026 22:39:22 a nosedir
01-Oct-2026 22:39:22 a nosedir/test_task_imsmooth
01-Oct-2026 22:39:22 a nosedir/summary_of_failed.log
01-Oct-2026 22:39:22 a nosedir/xml
01-Oct-2026 22:39:22 a nosedir/xml/test_task_imsmooth
01-Oct-2026 22:39:22 a nosedir/xml/test_task_imsmooth/nose.xml
01-Oct-2026 22:39:22 a nosedir/test_task_imsmooth/imsmooth_results.im
01-Oct-2026 22:39:22 a nosedir/test_task_imsmooth/imsmooth_zz_out.im
01-Oct-2026 22:39:22 a nosedir/test_task_imsmooth/imsmooth_convolve2.im
01-Oct-2026 22:39:22 a nosedir/test_task_imsmooth/smooth.pointsrc.image
01-Oct-2026 22:39:22 a nosedir/test_task_imsmooth/smooth_test1
01-Oct-2026 22:39:22 a nosedir/test_task_imsmooth/conftest.py
01-Oct-2026 22:39:22 a nosedir/test_task_imsmooth/input_test11
01-Oct-2026 22:39:22 a nosedir/test_task_imsmooth/imsmooth_gxg_K.im
01-Oct-2026 22:39:22 a nosedir/test_task_imsmooth/imsmooth_gxg_cm-2.im
01-Oct-2026 22:39:22 a nosedir/test_task_imsmooth/imsmooth_mysub.im
01-Oct-2026 22:39:22 a nosedir/test_task_imsmooth/imsmooth_convolve3.im
01-Oct-2026 22:39:22 a nosedir/test_task_imsmooth/test_task_imsmooth.py
01-Oct-2026 22:39:22 a nosedir/test_task_imsmooth/imsmooth_rgn.pointsrc.image
01-Oct-2026 22:39:22 a nosedir/test_task_imsmooth/input_test2
01-Oct-2026 22:39:22 a nosedir/test_task_imsmooth/casa-20261002-023907.log
01-Oct-2026 22:39:22 a nosedir/test_task_imsmooth/input_test5
01-Oct-2026 22:39:22 a nosedir/test_task_imsmooth/imsmooth_conv.im
01-Oct-2026 22:39:22 a nosedir/test_task_imsmooth/imsmooth_smooth
01-Oct-2026 22:39:22 a nosedir/test_task_imsmooth/imsmooth_zz.im
01-Oct-2026 22:39:22 a nosedir/test_task_imsmooth/subi2.im
01-Oct-2026 22:39:22 a nosedir/test_task_imsmooth/imsmooth_convolve2d_multibeam.im
01-Oct-2026 22:39:22 a nosedir/test_task_imsmooth/subi3.im
01-Oct-2026 22:39:22 a nosedir/test_task_imsmooth/rgn_test5
01-Oct-2026 22:39:22 a nosedir/test_task_imsmooth/imsmooth_input_overwrite
01-Oct-2026 22:39:22 a nosedir/test_task_imsmooth/rgn_test2
01-Oct-2026 22:39:22 a nosedir/test_task_imsmooth/rgn_test3
01-Oct-2026 22:39:22 a nosedir/test_task_imsmooth/g192_a2.image
01-Oct-2026 22:39:22 a nosedir/test_task_imsmooth/imsmooth_tres1J
01-Oct-2026 22:39:22 a nosedir/test_task_imsmooth/subi0.im
01-Oct-2026 22:39:22 a nosedir/test_task_imsmooth/test_image2dconvolver_multibeam.im
01-Oct-2026 22:39:22 a nosedir/test_task_imsmooth/imsmooth_point_c_bessel.im
01-Oct-2026 22:39:22 a nosedir/test_task_imsmooth/subi4.im
01-Oct-2026 22:39:22 a nosedir/test_task_imsmooth/imsmooth_targetres.fits
01-Oct-2026 22:39:22 a nosedir/test_task_imsmooth/input_test1b
01-Oct-2026 22:39:22 a nosedir/test_task_imsmooth/smooth_test2
01-Oct-2026 22:39:22 a nosedir/test_task_imsmooth/imsmooth_tmp.im
01-Oct-2026 22:39:22 a nosedir/test_task_imsmooth/imsmooth_tres1x.im
01-Oct-2026 22:39:22 a nosedir/test_task_imsmooth/subi1.im
01-Oct-2026 22:39:22 a nosedir/test_task_imsmooth/imsmooth_tbeam1.im
01-Oct-2026 22:39:22 a nosedir/test_task_imsmooth/imsmooth_orig.im
01-Oct-2026 22:39:22 a nosedir/test_task_imsmooth/short_summary.log
01-Oct-2026 22:39:22 a nosedir/test_task_imsmooth/input_test6
01-Oct-2026 22:39:22 a nosedir/test_task_imsmooth/input_test1
01-Oct-2026 22:39:22 a nosedir/test_task_imsmooth/imsmooth_convolve4.im
01-Oct-2026 22:39:22 a nosedir/test_task_imsmooth/imsmooth_cb1.im
01-Oct-2026 22:39:22 a nosedir/test_task_imsmooth/imsmooth_convolve0.im
01-Oct-2026 22:39:22 a nosedir/test_task_imsmooth/tiny.im
01-Oct-2026 22:39:22 a nosedir/test_task_imsmooth/imsmooth_maskim
01-Oct-2026 22:39:22 a nosedir/test_task_imsmooth/imsmooth_convolve1.im
01-Oct-2026 22:39:22 a nosedir/test_task_imsmooth/rgn_test1
01-Oct-2026 22:39:22 a nosedir/test_task_imsmooth/imsmooth_tres1.im
01-Oct-2026 22:39:22 a nosedir/test_task_imsmooth/imsmooth_test_overwrite.im
01-Oct-2026 22:39:22 a nosedir/test_task_imsmooth/g192_a2.image-2.rgn
01-Oct-2026 22:39:22 a nosedir/test_task_imsmooth/imsmooth_conv.im/mask0
01-Oct-2026 22:39:22 a nosedir/test_task_imsmooth/imsmooth_mysub.im/mask0
01-Oct-2026 22:39:22 a nosedir/test_task_imsmooth/imsmooth_results.im/mask0
01-Oct-2026 22:39:22 Finished task 'Test wheel' with result: Success
01-Oct-2026 22:39:22 Starting task 'Parse tests' of type 'com.atlassian.bamboo.plugins.testresultparser:task.testresultparser.junit'
01-Oct-2026 22:39:22 Parsing test results under /Users/casaci/bamboohome/xml-data/build-dir/CASASPECS-DEVTESTPY312158-TTARM15PY312...
01-Oct-2026 22:39:22 Failing task since 13 failing test cases were found.
01-Oct-2026 22:39:22 Finished task 'Parse tests' with result: Failed
01-Oct-2026 22:39:22 Running post build plugin 'Docker Container Cleanup'
01-Oct-2026 22:39:22 Running post build plugin 'NCover Results Collector'
01-Oct-2026 22:39:22 Running post build plugin 'Build Results Label Collector'
01-Oct-2026 22:39:22 Running post build plugin 'Clover Results Collector'
01-Oct-2026 22:39:22 Running post build plugin 'npm Cache Cleanup'
01-Oct-2026 22:39:22 Running post build plugin 'Artifact Copier'
01-Oct-2026 22:39:22 Publishing an artifact: requirements.txt
01-Oct-2026 22:39:22 Finished publishing of artifact Non required job artifact Http Compression On : [requirements.txt], patterns: [requirements.txt] anchored at: [wheeldirectory/] in 47.01 ms
01-Oct-2026 22:39:22 Publishing an artifact: Workdir
01-Oct-2026 22:39:22 Finished publishing of artifact Non required job artifact Http Compression On : [Workdir], patterns: [work*.tar.gz] anchored at: [wheeldirectory/] in 16.70 ms
01-Oct-2026 22:39:22 Finalising the build...
01-Oct-2026 22:39:22 Stopping timer.
01-Oct-2026 22:39:22 Build CASASPECS-DEVTESTPY312158-TTARM15PY312-2 completed.
01-Oct-2026 22:39:23 Running on server: post build plugin 'Build Hanging Detection Configuration'
01-Oct-2026 22:39:23 Running on server: post build plugin 'NCover Results Collector'
01-Oct-2026 22:39:23 Running on server: post build plugin 'Build Labeller'
01-Oct-2026 22:39:23 Running on server: post build plugin 'Clover Delta Calculator'
01-Oct-2026 22:39:23 Running on server: post build plugin 'Maven Dependencies Postprocessor'
01-Oct-2026 22:39:23 All post build plugins have finished
01-Oct-2026 22:39:23 Generating build results summary...
01-Oct-2026 22:39:23 Saving build results to disk...
01-Oct-2026 22:39:23 Store variable context...
01-Oct-2026 22:39:23 Finished building CASASPECS-DEVTESTPY312158-TTARM15PY312-2.