Build: #2 failed

Job: Test Tasks Many Linux 2.28 Py3.12 failed

Build log

The build generated 719 lines of output. Download or view full build log.

01-Oct-2026 20:50:47 Build CASASPECS - Dev Test 3.12 - CAS-14803 - Test Tasks Many Linux 2.28 Py3.12 #2 (CASASPECS-DEVTESTPY312158-TTM228PY312-2) is being prepared for building on agent casaci-4.cv.nrao.edu, bamboo version: 9.6.26
01-Oct-2026 20:50:47 Remote agent on host casaci-4.cv.nrao.edu
01-Oct-2026 20:50:47 Build working directory is /opt/ci_workspace/casa/bamboo/agent2/xml-data/build-dir/CASASPECS-DEVTESTPY312158-TTM228PY312
01-Oct-2026 20:50:47 Executing build CASASPECS - Dev Test 3.12 - CAS-14803 - Test Tasks Many Linux 2.28 Py3.12 #2 (CASASPECS-DEVTESTPY312158-TTM228PY312-2)
01-Oct-2026 20:50:47 Starting task 'Source Code Checkout' of type 'com.atlassian.bamboo.plugins.vcs:task.vcs.checkout'
01-Oct-2026 20:50:47 Build always requires a clean checkout
01-Oct-2026 20:50:47 Cleaning build directory '/opt/ci_workspace/casa/bamboo/agent2/xml-data/build-dir/CASASPECS-DEVTESTPY312158-TTM228PY312'
01-Oct-2026 20:50:47 Checking out into /opt/ci_workspace/casa/bamboo/agent2/xml-data/build-dir/CASASPECS-DEVTESTPY312158-TTM228PY312
01-Oct-2026 20:50:47 Updating source code to revision: fca4920fd5894af7a8bc45e3d5a8675122e76335
01-Oct-2026 20:50:48 Fetching 'refs/heads/CAS-14803' from 'ssh://git@open-bitbucket.nrao.edu:7999/casa/casa6.git'.
01-Oct-2026 20:50:48 Warning: Permanently added '[127.0.0.1]:46167' (RSA) to the list of known hosts.
01-Oct-2026 20:50:48 X11 forwarding request failed on channel 0
01-Oct-2026 20:50:48 Checking out revision fca4920fd5894af7a8bc45e3d5a8675122e76335.
01-Oct-2026 20:50:48 Creating local git repository in '/opt/ci_workspace/casa/bamboo/agent2/xml-data/build-dir/CASASPECS-DEVTESTPY312158-TTM228PY312/.git'.
01-Oct-2026 20:50:48 Cloning into '/opt/ci_workspace/casa/bamboo/agent2/xml-data/build-dir/CASASPECS-DEVTESTPY312158-TTM228PY312'...
01-Oct-2026 20:50:48 done.
01-Oct-2026 20:50:50 Switched to a new branch 'CAS-14803'
01-Oct-2026 20:50:50 branch 'CAS-14803' set up to track 'origin/CAS-14803'.
01-Oct-2026 20:50:50 Submodule 'casatools/casacore' (https://github.com/casacore/casacore.git) registered for path 'casatools/casacore'
01-Oct-2026 20:50:50 Submodule 'casatools/grpc-source' (https://github.com/grpc/grpc) registered for path 'casatools/grpc-source'
01-Oct-2026 20:50:50 Cloning into '/opt/ci_workspace/casa/bamboo/agent2/xml-data/build-dir/CASASPECS-DEVTESTPY312158-TTM228PY312/casatools/casacore'...
01-Oct-2026 20:50:57 Cloning into '/opt/ci_workspace/casa/bamboo/agent2/xml-data/build-dir/CASASPECS-DEVTESTPY312158-TTM228PY312/casatools/grpc-source'...
01-Oct-2026 20:51:17 Submodule path 'casatools/casacore': checked out 'aaf72eb7edd5a5fecefa78ca04713233b7b6ffd6'
01-Oct-2026 20:51:17 Submodule path 'casatools/grpc-source': checked out 'cca868ac8f3641df4003a82b7fc54c921e14f765'
01-Oct-2026 20:51:17 Submodule 'third_party/abseil-cpp' (https://github.com/abseil/abseil-cpp) registered for path 'casatools/grpc-source/third_party/abseil-cpp'
01-Oct-2026 20:51:17 Submodule 'third_party/benchmark' (https://github.com/google/benchmark) registered for path 'casatools/grpc-source/third_party/benchmark'
01-Oct-2026 20:51:17 Submodule 'third_party/bloaty' (https://github.com/google/bloaty.git) registered for path 'casatools/grpc-source/third_party/bloaty'
01-Oct-2026 20:51:17 Submodule 'third_party/boringssl' (https://github.com/google/boringssl.git) registered for path 'casatools/grpc-source/third_party/boringssl'
01-Oct-2026 20:51:17 Submodule 'third_party/boringssl-with-bazel' (https://github.com/google/boringssl.git) registered for path 'casatools/grpc-source/third_party/boringssl-with-bazel'
01-Oct-2026 20:51:17 Submodule 'third_party/cares/cares' (https://github.com/c-ares/c-ares.git) registered for path 'casatools/grpc-source/third_party/cares/cares'
01-Oct-2026 20:51:17 Submodule 'third_party/gflags' (https://github.com/gflags/gflags.git) registered for path 'casatools/grpc-source/third_party/gflags'
01-Oct-2026 20:51:17 Submodule 'third_party/googletest' (https://github.com/google/googletest.git) registered for path 'casatools/grpc-source/third_party/googletest'
01-Oct-2026 20:51:17 Submodule 'third_party/protobuf' (https://github.com/google/protobuf.git) registered for path 'casatools/grpc-source/third_party/protobuf'
01-Oct-2026 20:51:17 Submodule 'third_party/zlib' (https://github.com/madler/zlib) registered for path 'casatools/grpc-source/third_party/zlib'
01-Oct-2026 20:51:17 Cloning into '/opt/ci_workspace/casa/bamboo/agent2/xml-data/build-dir/CASASPECS-DEVTESTPY312158-TTM228PY312/casatools/grpc-source/third_party/abseil-cpp'...
01-Oct-2026 20:51:18 Cloning into '/opt/ci_workspace/casa/bamboo/agent2/xml-data/build-dir/CASASPECS-DEVTESTPY312158-TTM228PY312/casatools/grpc-source/third_party/benchmark'...
01-Oct-2026 20:51:19 Cloning into '/opt/ci_workspace/casa/bamboo/agent2/xml-data/build-dir/CASASPECS-DEVTESTPY312158-TTM228PY312/casatools/grpc-source/third_party/bloaty'...
01-Oct-2026 20:51:19 Cloning into '/opt/ci_workspace/casa/bamboo/agent2/xml-data/build-dir/CASASPECS-DEVTESTPY312158-TTM228PY312/casatools/grpc-source/third_party/boringssl'...
01-Oct-2026 20:51:28 Cloning into '/opt/ci_workspace/casa/bamboo/agent2/xml-data/build-dir/CASASPECS-DEVTESTPY312158-TTM228PY312/casatools/grpc-source/third_party/boringssl-with-bazel'...
01-Oct-2026 20:51:39 Cloning into '/opt/ci_workspace/casa/bamboo/agent2/xml-data/build-dir/CASASPECS-DEVTESTPY312158-TTM228PY312/casatools/grpc-source/third_party/cares/cares'...
01-Oct-2026 20:51:40 Cloning into '/opt/ci_workspace/casa/bamboo/agent2/xml-data/build-dir/CASASPECS-DEVTESTPY312158-TTM228PY312/casatools/grpc-source/third_party/gflags'...
01-Oct-2026 20:51:40 Cloning into '/opt/ci_workspace/casa/bamboo/agent2/xml-data/build-dir/CASASPECS-DEVTESTPY312158-TTM228PY312/casatools/grpc-source/third_party/googletest'...
01-Oct-2026 20:51:41 Cloning into '/opt/ci_workspace/casa/bamboo/agent2/xml-data/build-dir/CASASPECS-DEVTESTPY312158-TTM228PY312/casatools/grpc-source/third_party/protobuf'...
01-Oct-2026 20:51:49 Cloning into '/opt/ci_workspace/casa/bamboo/agent2/xml-data/build-dir/CASASPECS-DEVTESTPY312158-TTM228PY312/casatools/grpc-source/third_party/zlib'...
01-Oct-2026 20:51:50 Submodule path 'casatools/grpc-source/third_party/abseil-cpp': checked out 'cc4bed2d74f7c8717e31f9579214ab52a9c9c610'
01-Oct-2026 20:51:50 Submodule path 'casatools/grpc-source/third_party/benchmark': checked out '5b7683f49e1e9223cf9927b24f6fd3d6bd82e3f8'
01-Oct-2026 20:51:50 Submodule path 'casatools/grpc-source/third_party/bloaty': checked out '73594cde8c9a52a102c4341c244c833aa61b9c06'
01-Oct-2026 20:51:50 Submodule 'third_party/googletest' (https://github.com/google/googletest.git) registered for path 'casatools/grpc-source/third_party/bloaty/third_party/googletest'
01-Oct-2026 20:51:50 Submodule 'third_party/libFuzzer' (https://chromium.googlesource.com/chromium/llvm-project/llvm/lib/Fuzzer) registered for path 'casatools/grpc-source/third_party/bloaty/third_party/libFuzzer'
01-Oct-2026 20:51:50 Submodule 'third_party/re2' (https://github.com/google/re2) registered for path 'casatools/grpc-source/third_party/bloaty/third_party/re2'
01-Oct-2026 20:51:50 Cloning into '/opt/ci_workspace/casa/bamboo/agent2/xml-data/build-dir/CASASPECS-DEVTESTPY312158-TTM228PY312/casatools/grpc-source/third_party/bloaty/third_party/googletest'...
01-Oct-2026 20:51:51 Cloning into '/opt/ci_workspace/casa/bamboo/agent2/xml-data/build-dir/CASASPECS-DEVTESTPY312158-TTM228PY312/casatools/grpc-source/third_party/bloaty/third_party/libFuzzer'...
01-Oct-2026 20:51:52 Cloning into '/opt/ci_workspace/casa/bamboo/agent2/xml-data/build-dir/CASASPECS-DEVTESTPY312158-TTM228PY312/casatools/grpc-source/third_party/bloaty/third_party/re2'...
01-Oct-2026 20:51:53 Submodule path 'casatools/grpc-source/third_party/bloaty/third_party/googletest': checked out 'a2b8a8e07628e5fd60644b6dd99c1b5e7d7f1f47'
01-Oct-2026 20:51:53 Submodule path 'casatools/grpc-source/third_party/bloaty/third_party/libFuzzer': checked out '1b543d6e5073b56be214394890c9193979a3d7e1'
01-Oct-2026 20:51:53 Submodule path 'casatools/grpc-source/third_party/bloaty/third_party/re2': checked out 'c964d9b07816f9b52ca692e23b8b3dba33beec54'
01-Oct-2026 20:51:53 Submodule path 'casatools/grpc-source/third_party/boringssl': checked out 'be2ee342d3781ddb954f91f8a7e660c6f59e87e5'
01-Oct-2026 20:51:53 Submodule path 'casatools/grpc-source/third_party/boringssl-with-bazel': checked out '886e7d75368e3f4fab3f4d0d3584e4abfc557755'
01-Oct-2026 20:51:53 Submodule path 'casatools/grpc-source/third_party/cares/cares': checked out '3be1924221e1326df520f8498d704a5c4c8d0cce'
01-Oct-2026 20:51:53 Submodule path 'casatools/grpc-source/third_party/gflags': checked out '30dbc81fb5ffdc98ea9b14b1918bfe4e8779b26e'
01-Oct-2026 20:51:53 Submodule 'doc' (https://github.com/gflags/gflags.git) registered for path 'casatools/grpc-source/third_party/gflags/doc'
01-Oct-2026 20:51:53 Cloning into '/opt/ci_workspace/casa/bamboo/agent2/xml-data/build-dir/CASASPECS-DEVTESTPY312158-TTM228PY312/casatools/grpc-source/third_party/gflags/doc'...
01-Oct-2026 20:51:54 Submodule path 'casatools/grpc-source/third_party/gflags/doc': checked out '971dd2a4fadac9cdab174c523c22df79efd63aa5'
01-Oct-2026 20:51:54 Submodule path 'casatools/grpc-source/third_party/googletest': checked out 'ec44c6c1675c25b9827aacd08c02433cccde7780'
01-Oct-2026 20:51:54 Submodule path 'casatools/grpc-source/third_party/protobuf': checked out '2761122b810fe8861004ae785cc3ab39f384d342'
01-Oct-2026 20:51:54 Submodule 'third_party/benchmark' (https://github.com/google/benchmark.git) registered for path 'casatools/grpc-source/third_party/protobuf/third_party/benchmark'
01-Oct-2026 20:51:54 Cloning into '/opt/ci_workspace/casa/bamboo/agent2/xml-data/build-dir/CASASPECS-DEVTESTPY312158-TTM228PY312/casatools/grpc-source/third_party/protobuf/third_party/benchmark'...
01-Oct-2026 20:51:54 Submodule path 'casatools/grpc-source/third_party/protobuf/third_party/benchmark': checked out '360e66c1c4777c99402cf8cd535aa510fee16573'
01-Oct-2026 20:51:54 Submodule path 'casatools/grpc-source/third_party/zlib': checked out 'cacf7f1d4e3d44d871b605da3b647f07d718623f'
01-Oct-2026 20:51:54 Updated source code to revision: fca4920fd5894af7a8bc45e3d5a8675122e76335
01-Oct-2026 20:51:54 Finished task 'Source Code Checkout' with result: Success
01-Oct-2026 20:51:54 Running pre-build action: Build Log Labeller Pre Build Action
01-Oct-2026 20:51:54 Running pre-build action: VCS Version Collector
01-Oct-2026 20:51:54 Build CASASPECS - Dev Test 3.12 - CAS-14803 - Test Tasks Many Linux 2.28 Py3.12 #2 (CASASPECS-DEVTESTPY312158-TTM228PY312-2) started building on agent 'casaci-4.cv.nrao.edu' (Remote agent on host casaci-4.cv.nrao.edu)
01-Oct-2026 20:51:54 Starting task 'Update data' of type 'com.atlassian.bamboo.plugins.scripttask:task.builder.script'
01-Oct-2026 20:51:54
Beginning to execute external process for build 'CASASPECS - Dev Test 3.12 - CAS-14803 - Test Tasks Many Linux 2.28 Py3.12 #2 (CASASPECS-DEVTESTPY312158-TTM228PY312-2)'
... running command line:
/opt/ci_workspace/casa/bamboo/agent2/temp/CASASPECS-DEVTESTPY312158-TTM228PY312-2-ScriptBuildTask-12990270859719109479.sh
... in: /opt/ci_workspace/casa/bamboo/agent2/xml-data/build-dir/CASASPECS-DEVTESTPY312158-TTM228PY312
01-Oct-2026 20:51:54 Already up to date.
01-Oct-2026 20:51:54 /opt/ci_workspace/casa/bamboo/agent2/temp/CASASPECS-DEVTESTPY312158-TTM228PY312-2-ScriptBuildTask-12990270859719109479.sh: line 2: cd: /opt/casa/data/casa-data-req: No such file or directory
01-Oct-2026 20:51:55 Already up to date.
01-Oct-2026 20:51:55 Data update complete
01-Oct-2026 20:51:55 Finished task 'Update data' with result: Success
01-Oct-2026 20:51:55
Substituting variable: ${bamboo.repository.branch.name} with CAS-14803
01-Oct-2026 20:51:55 Starting task 'Create wheeldirectory' of type 'com.atlassian.bamboo.plugins.scripttask:task.builder.script'
01-Oct-2026 20:51:55
Beginning to execute external process for build 'CASASPECS - Dev Test 3.12 - CAS-14803 - Test Tasks Many Linux 2.28 Py3.12 #2 (CASASPECS-DEVTESTPY312158-TTM228PY312-2)'
... running command line:
/opt/ci_workspace/casa/bamboo/agent2/temp/CASASPECS-DEVTESTPY312158-TTM228PY312-2-ScriptBuildTask-2776613456166507321.sh
... in: /opt/ci_workspace/casa/bamboo/agent2/xml-data/build-dir/CASASPECS-DEVTESTPY312158-TTM228PY312
01-Oct-2026 20:51:55 Finished task 'Create wheeldirectory' with result: Success
01-Oct-2026 20:51:55 Starting task 'Get latest wheel' of type 'com.atlassian.bamboo.plugins.bamboo-artifact-downloader-plugin:artifactdownloadertask'
01-Oct-2026 20:51:55 Preparing to download plan result CASASPECS-DBC268-2 artifact: Non required shared artifact Http Compression On : [ManyLinux228 Python 3.12 Casatestutils], patterns: [casatestutils*.whl] anchored at: [source/wheels]
01-Oct-2026 20:51:55 Retrieving artifact ManyLinux228 Python 3.12 Casatestutils for CASASPECS-DBC268-2 using Bamboo server artifact handler
01-Oct-2026 20:51:55 Artifact [ManyLinux228 Python 3.12 Casatestutils] downloaded successfully in 14.03 ms to wheeldirectory/
01-Oct-2026 20:51:55 Preparing to download plan result CASASPECS-DBC268-2 artifact: Non required shared artifact Http Compression On : [ManyLinux228 Python 3.12 Tool wheel], patterns: [casatools*.whl] anchored at: [source/wheels]
01-Oct-2026 20:51:55 Retrieving artifact ManyLinux228 Python 3.12 Tool wheel for CASASPECS-DBC268-2 using Bamboo server artifact handler
01-Oct-2026 20:51:57 Artifact [ManyLinux228 Python 3.12 Tool wheel] downloaded successfully in 2.781 s to wheeldirectory/
01-Oct-2026 20:51:57 Preparing to download plan result CASASPECS-DBC268-2 artifact: Non required shared artifact Http Compression On : [ManyLinux228 Python 3.12 Task wheel], patterns: [casatasks*.whl] anchored at: [source/wheels]
01-Oct-2026 20:51:57 Retrieving artifact ManyLinux228 Python 3.12 Task wheel for CASASPECS-DBC268-2 using Bamboo server artifact handler
01-Oct-2026 20:51:57 Artifact [ManyLinux228 Python 3.12 Task wheel] downloaded successfully in 121.7 ms to wheeldirectory/
01-Oct-2026 20:51:57 Finished task 'Get latest wheel' with result: Success
01-Oct-2026 20:51:57
Substituting variable: ${bamboo.agentId} with 153550850
01-Oct-2026 20:51:57
Substituting variable: ${bamboo.agentId} with 153550850
01-Oct-2026 20:51:57
Substituting variable: ${bamboo.agentId} with 153550850
01-Oct-2026 20:51:57 Starting task 'Stop and remove running wheel-container-test' of type 'com.atlassian.bamboo.plugins.scripttask:task.builder.script'
01-Oct-2026 20:51:57
Beginning to execute external process for build 'CASASPECS - Dev Test 3.12 - CAS-14803 - Test Tasks Many Linux 2.28 Py3.12 #2 (CASASPECS-DEVTESTPY312158-TTM228PY312-2)'
... running command line:
/opt/ci_workspace/casa/bamboo/agent2/temp/CASASPECS-DEVTESTPY312158-TTM228PY312-2-ScriptBuildTask-2384536023570246176.sh
... in: /opt/ci_workspace/casa/bamboo/agent2/xml-data/build-dir/CASASPECS-DEVTESTPY312158-TTM228PY312
01-Oct-2026 20:51:57 Error response from daemon: No such container: wheel-container-test_153550850
01-Oct-2026 20:51:58 Error response from daemon: No such container: wheel-container-test_153550850
01-Oct-2026 20:51:58 Removed wheel-container-test_153550850
01-Oct-2026 20:51:58 Finished task 'Stop and remove running wheel-container-test' with result: Success
01-Oct-2026 20:51:58
Substituting variable: ${bamboo.working.directory} with /opt/ci_workspace/casa/bamboo/agent2/xml-data/build-dir/CASASPECS-DEVTESTPY312158-TTM228PY312
01-Oct-2026 20:51:58
Substituting variable: ${bamboo.agentId} with 153550850
01-Oct-2026 20:51:58 Starting task 'Start container' of type 'com.atlassian.bamboo.plugins.bamboo-docker-plugin:task.docker.cli'
01-Oct-2026 20:51:58 Running image name (casa-docker.nrao.edu:5000/casa-test-rocky-8.10:4)
01-Oct-2026 20:51:58
Beginning to execute external process for build 'CASASPECS - Dev Test 3.12 - CAS-14803 - Test Tasks Many Linux 2.28 Py3.12 #2 (CASASPECS-DEVTESTPY312158-TTM228PY312-2)'
... running command line:
/usr/bin/docker run --volume /opt/ci_workspace/casa/bamboo/agent2/xml-data/build-dir/CASASPECS-DEVTESTPY312158-TTM228PY312/wheeldirectory:/wheeldirectory --volume /opt/casa/data:/opt/casa/data --detach --cpus=8 --memory=64g --name wheel-container-test_153550850 casa-docker.nrao.edu:5000/casa-test-rocky-8.10:4 tail -f /dev/null
... in: /opt/ci_workspace/casa/bamboo/agent2/xml-data/build-dir/CASASPECS-DEVTESTPY312158-TTM228PY312
01-Oct-2026 20:51:59 34463a3aa7b3ee966ee7c88fb98bac52b92dae8e7842e3bb0f9c0305c8cc09a6
01-Oct-2026 20:51:59 Finished task 'Start container' with result: Success
01-Oct-2026 20:51:59
Substituting variable: ${bamboo.agentId} with 153550850
01-Oct-2026 20:51:59
Substituting variable: ${bamboo.planRepository.branchName} with CAS-14803
01-Oct-2026 20:51:59 Starting task 'Test wheel' of type 'com.atlassian.bamboo.plugins.scripttask:task.builder.script'
01-Oct-2026 20:51:59
Beginning to execute external process for build 'CASASPECS - Dev Test 3.12 - CAS-14803 - Test Tasks Many Linux 2.28 Py3.12 #2 (CASASPECS-DEVTESTPY312158-TTM228PY312-2)'
... running command line:
/opt/ci_workspace/casa/bamboo/agent2/temp/CASASPECS-DEVTESTPY312158-TTM228PY312-2-ScriptBuildTask-6544220582346968827.sh
... in: /opt/ci_workspace/casa/bamboo/agent2/xml-data/build-dir/CASASPECS-DEVTESTPY312158-TTM228PY312
01-Oct-2026 20:51:59 branch: CAS-14803
01-Oct-2026 20:51:59 Python version: 3.12
01-Oct-2026 20:51:59   % Total    % Received % Xferd  Average Speed   Time    Time     Time  Current
01-Oct-2026 20:51:59                                  Dload  Upload   Total   Spent    Left  Speed
01-Oct-2026 20:51:59
01-Oct-2026 20:51:59   0     0    0     0    0     0      0      0 --:--:-- --:--:-- --:--:--     0
01-Oct-2026 20:51:59 100 6002k  100 6002k    0     0  70.6M      0 --:--:-- --:--:-- --:--:-- 70.6M
01-Oct-2026 20:51:59 bamboo_jira_components:''
01-Oct-2026 20:51:59 bamboo_testlist:''
01-Oct-2026 20:52:00 Ticket components:  -j "imsmooth"
01-Oct-2026 20:52:00 datapath=[ "/opt/casa/data/master", "/opt/casa/data/casatestdata" ]
01-Oct-2026 20:52:00 measurespath="/opt/casa/data/master"
01-Oct-2026 20:52:00 measures_auto_update=False
01-Oct-2026 20:52:00 data_auto_update=False
01-Oct-2026 20:52:00 Ticket fix version: CASA 6.ACTIVE
01-Oct-2026 20:52:00 No matching version found
01-Oct-2026 20:52:00 datapath=[ "/opt/casa/data/master", "/opt/casa/data/casatestdata" ]
01-Oct-2026 20:52:00 measurespath="/opt/casa/data/master"
01-Oct-2026 20:52:00 measures_auto_update=False
01-Oct-2026 20:52:00 data_auto_update=False
01-Oct-2026 20:53:20 branch 'CAS-14803' set up to track 'origin/CAS-14803'.
01-Oct-2026 20:53:20 Switched to a new branch 'CAS-14803'
01-Oct-2026 20:53:20 Updated 0 paths from f67e31d4f3
01-Oct-2026 20:53:20 Updated 0 paths from f67e31d4f3
01-Oct-2026 20:53:20 Updated 0 paths from 3aa39f022e
01-Oct-2026 20:53:20 Requirement already satisfied: pip in /home/casatest/venv/lib/python3.12/site-packages (24.3.1)
01-Oct-2026 20:53:20 Collecting pip
01-Oct-2026 20:53:20   Downloading pip-26.2.1-py3-none-any.whl.metadata (4.6 kB)
01-Oct-2026 20:53:20 Collecting setuptools
01-Oct-2026 20:53:20   Downloading setuptools-84.0.0-py3-none-any.whl.metadata (6.6 kB)
01-Oct-2026 20:53:20 Collecting wheel
01-Oct-2026 20:53:20   Downloading wheel-0.48.0-py3-none-any.whl.metadata (2.3 kB)
01-Oct-2026 20:53:21 Collecting numpy
01-Oct-2026 20:53:21   Downloading numpy-2.5.3-cp312-cp312-manylinux_2_27_x86_64.manylinux_2_28_x86_64.whl.metadata (6.6 kB)
01-Oct-2026 20:53:21 Collecting packaging>=24.0 (from wheel)
01-Oct-2026 20:53:21   Downloading packaging-26.3-py3-none-any.whl.metadata (3.5 kB)
01-Oct-2026 20:53:21 Downloading pip-26.2.1-py3-none-any.whl (1.8 MB)
01-Oct-2026 20:53:21    ━━━━━━━━━━━━━━━━━━━━━━━━━━━━━━━━━━━━━━━━ 1.8/1.8 MB 108.5 MB/s eta 0:00:00
01-Oct-2026 20:53:21 Downloading setuptools-84.0.0-py3-none-any.whl (818 kB)
01-Oct-2026 20:53:21    ━━━━━━━━━━━━━━━━━━━━━━━━━━━━━━━━━━━━━━━ 818.2/818.2 kB 117.7 MB/s eta 0:00:00
01-Oct-2026 20:53:21 Downloading wheel-0.48.0-py3-none-any.whl (33 kB)
01-Oct-2026 20:53:21 Downloading numpy-2.5.3-cp312-cp312-manylinux_2_27_x86_64.manylinux_2_28_x86_64.whl (16.7 MB)
01-Oct-2026 20:53:21    ━━━━━━━━━━━━━━━━━━━━━━━━━━━━━━━━━━━━━━━━ 16.7/16.7 MB 229.4 MB/s eta 0:00:00
01-Oct-2026 20:53:21 Downloading packaging-26.3-py3-none-any.whl (129 kB)
01-Oct-2026 20:53:21 Installing collected packages: setuptools, pip, packaging, numpy, wheel
01-Oct-2026 20:53:21   Attempting uninstall: pip
01-Oct-2026 20:53:21     Found existing installation: pip 24.3.1
01-Oct-2026 20:53:21     Uninstalling pip-24.3.1:
01-Oct-2026 20:53:21       Successfully uninstalled pip-24.3.1
01-Oct-2026 20:53:24 Successfully installed numpy-2.5.3 packaging-26.3 pip-26.2.1 setuptools-84.0.0 wheel-0.48.0
01-Oct-2026 20:53:24 Looking in indexes: https://pypi.org/simple, https://test.pypi.org/simple
01-Oct-2026 20:53:24 Collecting casaconfig==1.5.0
01-Oct-2026 20:53:24   Downloading casaconfig-1.5.0-py3-none-any.whl.metadata (4.0 kB)
01-Oct-2026 20:53:24 Collecting certifi>=2023.5.7 (from casaconfig==1.5.0)
01-Oct-2026 20:53:24   Downloading certifi-2026.7.22-py3-none-any.whl.metadata (2.5 kB)
01-Oct-2026 20:53:24 Downloading casaconfig-1.5.0-py3-none-any.whl (77 kB)
01-Oct-2026 20:53:24 Downloading certifi-2026.7.22-py3-none-any.whl (136 kB)
01-Oct-2026 20:53:24 Installing collected packages: certifi, casaconfig
01-Oct-2026 20:53:24
01-Oct-2026 20:53:24 Successfully installed casaconfig-1.5.0 certifi-2026.7.22
01-Oct-2026 20:53:25 Processing ./casatestutils-6.7.7.8a14803.dev2-py3-none-any.whl
01-Oct-2026 20:53:25 Collecting pytest>=6.0 (from casatestutils==6.7.7.8a14803.dev2)
01-Oct-2026 20:53:25   Downloading pytest-9.1.1-py3-none-any.whl.metadata (7.6 kB)
01-Oct-2026 20:53:25 Collecting astropy (from casatestutils==6.7.7.8a14803.dev2)
01-Oct-2026 20:53:25   Downloading astropy-8.0.1-cp311-abi3-manylinux2014_x86_64.manylinux_2_17_x86_64.manylinux_2_28_x86_64.whl.metadata (11 kB)
01-Oct-2026 20:53:25 Collecting iniconfig>=1.0.1 (from pytest>=6.0->casatestutils==6.7.7.8a14803.dev2)
01-Oct-2026 20:53:25   Downloading iniconfig-2.3.0-py3-none-any.whl.metadata (2.5 kB)
01-Oct-2026 20:53:25 Requirement already satisfied: packaging>=22 in /home/casatest/venv/lib/python3.12/site-packages (from pytest>=6.0->casatestutils==6.7.7.8a14803.dev2) (26.3)
01-Oct-2026 20:53:25 Collecting pluggy<2,>=1.5 (from pytest>=6.0->casatestutils==6.7.7.8a14803.dev2)
01-Oct-2026 20:53:25   Downloading pluggy-1.6.0-py3-none-any.whl.metadata (4.8 kB)
01-Oct-2026 20:53:25 Collecting pygments>=2.7.2 (from pytest>=6.0->casatestutils==6.7.7.8a14803.dev2)
01-Oct-2026 20:53:25   Downloading pygments-2.21.0-py3-none-any.whl.metadata (2.5 kB)
01-Oct-2026 20:53:25 Collecting astropy-iers-data>=0.2026.6.22.1.23.34 (from astropy->casatestutils==6.7.7.8a14803.dev2)
01-Oct-2026 20:53:25   Downloading astropy_iers_data-0.2026.9.28.0.59.37-py3-none-any.whl.metadata (3.4 kB)
01-Oct-2026 20:53:25 Requirement already satisfied: numpy>=2.0 in /home/casatest/venv/lib/python3.12/site-packages (from astropy->casatestutils==6.7.7.8a14803.dev2) (2.5.3)
01-Oct-2026 20:53:25 Collecting pyerfa>=2.0.1.3 (from astropy->casatestutils==6.7.7.8a14803.dev2)
01-Oct-2026 20:53:25   Downloading pyerfa-2.0.1.5-cp39-abi3-manylinux_2_17_x86_64.manylinux2014_x86_64.whl.metadata (5.7 kB)
01-Oct-2026 20:53:25 Collecting PyYAML>=6.0.0 (from astropy->casatestutils==6.7.7.8a14803.dev2)
01-Oct-2026 20:53:25   Downloading pyyaml-6.0.3-cp312-cp312-manylinux2014_x86_64.manylinux_2_17_x86_64.manylinux_2_28_x86_64.whl.metadata (2.4 kB)
01-Oct-2026 20:53:25 Downloading pytest-9.1.1-py3-none-any.whl (386 kB)
01-Oct-2026 20:53:25 Downloading pluggy-1.6.0-py3-none-any.whl (20 kB)
01-Oct-2026 20:53:25 Downloading iniconfig-2.3.0-py3-none-any.whl (7.5 kB)
01-Oct-2026 20:53:25 Downloading pygments-2.21.0-py3-none-any.whl (1.3 MB)
01-Oct-2026 20:53:26    ━━━━━━━━━━━━━━━━━━━━━━━━━━━━━━━━━━━━━━━━ 1.3/1.3 MB 3.6 MB/s  0:00:00
01-Oct-2026 20:53:26 Downloading astropy-8.0.1-cp311-abi3-manylinux2014_x86_64.manylinux_2_17_x86_64.manylinux_2_28_x86_64.whl (10.5 MB)
01-Oct-2026 20:53:32    ━━━━━━━━━━━━━━━━━━━━━━━━━━━━━━━━━━━━━━━━ 10.5/10.5 MB 1.7 MB/s  0:00:06
01-Oct-2026 20:53:32 Downloading astropy_iers_data-0.2026.9.28.0.59.37-py3-none-any.whl (2.0 MB)
01-Oct-2026 20:53:33    ━━━━━━━━━━━━━━━━━━━━━━━━━━━━━━━━━━━━━━━━ 2.0/2.0 MB 1.9 MB/s  0:00:01
01-Oct-2026 20:53:33 Downloading pyerfa-2.0.1.5-cp39-abi3-manylinux_2_17_x86_64.manylinux2014_x86_64.whl (738 kB)
01-Oct-2026 20:53:33    ━━━━━━━━━━━━━━━━━━━━━━━━━━━━━━━━━━━━━━━━ 738.7/738.7 kB 2.5 MB/s  0:00:00
01-Oct-2026 20:53:33 Downloading pyyaml-6.0.3-cp312-cp312-manylinux2014_x86_64.manylinux_2_17_x86_64.manylinux_2_28_x86_64.whl (807 kB)
01-Oct-2026 20:53:34    ━━━━━━━━━━━━━━━━━━━━━━━━━━━━━━━━━━━━━━━━ 807.9/807.9 kB 2.9 MB/s  0:00:00
01-Oct-2026 20:53:34 Installing collected packages: PyYAML, pygments, pyerfa, pluggy, iniconfig, astropy-iers-data, pytest, astropy, casatestutils
01-Oct-2026 20:53:37
01-Oct-2026 20:53:37 Successfully installed PyYAML-6.0.3 astropy-8.0.1 astropy-iers-data-0.2026.9.28.0.59.37 casatestutils-6.7.7.8a14803.dev2 iniconfig-2.3.0 pluggy-1.6.0 pyerfa-2.0.1.5 pygments-2.21.0 pytest-9.1.1
01-Oct-2026 20:53:37 Processing ./casatools-6.7.7.8a14803.dev2-cp312-cp312-manylinux_2_28_x86_64.whl
01-Oct-2026 20:53:38 Requirement already satisfied: numpy in /home/casatest/venv/lib/python3.12/site-packages (from casatools==6.7.7.8a14803.dev2) (2.5.3)
01-Oct-2026 20:53:38 Requirement already satisfied: casaconfig in /home/casatest/venv/lib/python3.12/site-packages (from casatools==6.7.7.8a14803.dev2) (1.5.0)
01-Oct-2026 20:53:38 Requirement already satisfied: certifi>=2023.5.7 in /home/casatest/venv/lib/python3.12/site-packages (from casaconfig->casatools==6.7.7.8a14803.dev2) (2026.7.22)
01-Oct-2026 20:53:38 Installing collected packages: casatools
01-Oct-2026 20:53:39 Successfully installed casatools-6.7.7.8a14803.dev2
01-Oct-2026 20:53:39 Processing ./casatasks-6.7.7.8a14803.dev2-py3-none-any.whl
01-Oct-2026 20:53:39 Requirement already satisfied: casatools==6.7.7.8a14803.dev2 in /home/casatest/venv/lib/python3.12/site-packages (from casatasks==6.7.7.8a14803.dev2) (6.7.7.8a14803.dev2)
01-Oct-2026 20:53:39 Collecting matplotlib (from casatasks==6.7.7.8a14803.dev2)
01-Oct-2026 20:53:39   Downloading matplotlib-3.11.2-cp312-cp312-manylinux2014_x86_64.manylinux_2_17_x86_64.whl.metadata (80 kB)
01-Oct-2026 20:53:39 Collecting scipy (from casatasks==6.7.7.8a14803.dev2)
01-Oct-2026 20:53:39   Downloading scipy-1.18.1-cp312-cp312-manylinux_2_27_x86_64.manylinux_2_28_x86_64.whl.metadata (62 kB)
01-Oct-2026 20:53:39 Requirement already satisfied: certifi in /home/casatest/venv/lib/python3.12/site-packages (from casatasks==6.7.7.8a14803.dev2) (2026.7.22)
01-Oct-2026 20:53:39 Requirement already satisfied: pyerfa in /home/casatest/venv/lib/python3.12/site-packages (from casatasks==6.7.7.8a14803.dev2) (2.0.1.5)
01-Oct-2026 20:53:39 Requirement already satisfied: numpy in /home/casatest/venv/lib/python3.12/site-packages (from casatools==6.7.7.8a14803.dev2->casatasks==6.7.7.8a14803.dev2) (2.5.3)
01-Oct-2026 20:53:39 Requirement already satisfied: casaconfig in /home/casatest/venv/lib/python3.12/site-packages (from casatools==6.7.7.8a14803.dev2->casatasks==6.7.7.8a14803.dev2) (1.5.0)
01-Oct-2026 20:53:39 Collecting contourpy>=1.0.1 (from matplotlib->casatasks==6.7.7.8a14803.dev2)
01-Oct-2026 20:53:39   Downloading contourpy-1.4.0-cp312-cp312-manylinux_2_27_x86_64.manylinux_2_28_x86_64.whl.metadata (3.8 kB)
01-Oct-2026 20:53:39 Collecting cycler>=0.10 (from matplotlib->casatasks==6.7.7.8a14803.dev2)
01-Oct-2026 20:53:39   Downloading cycler-0.12.1-py3-none-any.whl.metadata (3.8 kB)
01-Oct-2026 20:53:40 Collecting fonttools>=4.28.2 (from matplotlib->casatasks==6.7.7.8a14803.dev2)
01-Oct-2026 20:53:40   Downloading fonttools-4.66.1-cp312-cp312-manylinux2014_x86_64.manylinux_2_17_x86_64.whl.metadata (130 kB)
01-Oct-2026 20:53:40 Collecting kiwisolver>=1.3.1 (from matplotlib->casatasks==6.7.7.8a14803.dev2)
01-Oct-2026 20:53:40   Downloading kiwisolver-1.5.1-cp312-cp312-manylinux2014_x86_64.manylinux_2_17_x86_64.whl.metadata (5.2 kB)
01-Oct-2026 20:53:40 Requirement already satisfied: packaging>=20.0 in /home/casatest/venv/lib/python3.12/site-packages (from matplotlib->casatasks==6.7.7.8a14803.dev2) (26.3)
01-Oct-2026 20:53:40 Collecting pillow>=9 (from matplotlib->casatasks==6.7.7.8a14803.dev2)
01-Oct-2026 20:53:40   Downloading pillow-12.3.0-cp312-cp312-manylinux_2_27_x86_64.manylinux_2_28_x86_64.whl.metadata (9.1 kB)
01-Oct-2026 20:53:40 Collecting pyparsing>=3 (from matplotlib->casatasks==6.7.7.8a14803.dev2)
01-Oct-2026 20:53:40   Downloading pyparsing-3.3.3-py3-none-any.whl.metadata (5.9 kB)
01-Oct-2026 20:53:40 Collecting python-dateutil>=2.7 (from matplotlib->casatasks==6.7.7.8a14803.dev2)
01-Oct-2026 20:53:40   Downloading python_dateutil-2.9.0.post0-py2.py3-none-any.whl.metadata (8.4 kB)
01-Oct-2026 20:53:40 Collecting six>=1.5 (from python-dateutil>=2.7->matplotlib->casatasks==6.7.7.8a14803.dev2)
01-Oct-2026 20:53:40   Downloading six-1.17.0-py2.py3-none-any.whl.metadata (1.7 kB)
01-Oct-2026 20:53:40 Downloading matplotlib-3.11.2-cp312-cp312-manylinux2014_x86_64.manylinux_2_17_x86_64.whl (9.9 MB)
01-Oct-2026 20:53:40    ━━━━━━━━━━━━━━━━━━━━━━━━━━━━━━━━━━━━━━━━ 9.9/9.9 MB 140.7 MB/s  0:00:00
01-Oct-2026 20:53:40 Downloading contourpy-1.4.0-cp312-cp312-manylinux_2_27_x86_64.manylinux_2_28_x86_64.whl (383 kB)
01-Oct-2026 20:53:40 Downloading cycler-0.12.1-py3-none-any.whl (8.3 kB)
01-Oct-2026 20:53:40 Downloading fonttools-4.66.1-cp312-cp312-manylinux2014_x86_64.manylinux_2_17_x86_64.whl (5.4 MB)
01-Oct-2026 20:53:40    ━━━━━━━━━━━━━━━━━━━━━━━━━━━━━━━━━━━━━━━━ 5.4/5.4 MB 144.3 MB/s  0:00:00
01-Oct-2026 20:53:40 Downloading kiwisolver-1.5.1-cp312-cp312-manylinux2014_x86_64.manylinux_2_17_x86_64.whl (1.5 MB)
01-Oct-2026 20:53:40    ━━━━━━━━━━━━━━━━━━━━━━━━━━━━━━━━━━━━━━━━ 1.5/1.5 MB 132.0 MB/s  0:00:00
01-Oct-2026 20:53:40 Downloading pillow-12.3.0-cp312-cp312-manylinux_2_27_x86_64.manylinux_2_28_x86_64.whl (6.9 MB)
01-Oct-2026 20:53:40    ━━━━━━━━━━━━━━━━━━━━━━━━━━━━━━━━━━━━━━━━ 6.9/6.9 MB 135.8 MB/s  0:00:00
01-Oct-2026 20:53:40 Downloading pyparsing-3.3.3-py3-none-any.whl (126 kB)
01-Oct-2026 20:53:40 Downloading python_dateutil-2.9.0.post0-py2.py3-none-any.whl (229 kB)
01-Oct-2026 20:53:40 Downloading six-1.17.0-py2.py3-none-any.whl (11 kB)
01-Oct-2026 20:53:40 Downloading scipy-1.18.1-cp312-cp312-manylinux_2_27_x86_64.manylinux_2_28_x86_64.whl (35.3 MB)
01-Oct-2026 20:53:48    ━━━━━━━━━━━━━━━━━━━━━━━━━━━━━━━━━━━━━━━━ 35.3/35.3 MB 4.4 MB/s  0:00:07
01-Oct-2026 20:53:48 Installing collected packages: six, scipy, pyparsing, pillow, kiwisolver, fonttools, cycler, contourpy, python-dateutil, matplotlib, casatasks
01-Oct-2026 20:53:55
01-Oct-2026 20:53:55 Successfully installed casatasks-6.7.7.8a14803.dev2 contourpy-1.4.0 cycler-0.12.1 fonttools-4.66.1 kiwisolver-1.5.1 matplotlib-3.11.2 pillow-12.3.0 pyparsing-3.3.3 python-dateutil-2.9.0.post0 scipy-1.18.1 six-1.17.0
01-Oct-2026 20:53:55 Runtest command: python3.12 runtest.py --ignore_list 'test_casampi,test_task_msview,test_task_imview,test_task_plotms' -t /home/casatest/casa6/casatasks/tests/tasks,/home/casatest/casa6/casatasks/tests/scripts -e /home/casatest/casa6/casatestutils/casatestutils/component_to_test_map.json  -j "imsmooth"  2>&1 | tee casatasks_test.log
01-Oct-2026 20:53:55 LICENSE
01-Oct-2026 20:53:55 README.md
01-Oct-2026 20:53:55 __init__.py
01-Oct-2026 20:53:55 casatestutils
01-Oct-2026 20:53:55 pyproject.toml
01-Oct-2026 20:53:55 runtest.py
01-Oct-2026 20:53:55 setup.py
01-Oct-2026 20:53:55 testrunner
01-Oct-2026 20:53:55 tests
01-Oct-2026 20:53:55 version
01-Oct-2026 20:53:55 xmlrunner_to_junit.py
01-Oct-2026 20:53:55 ============================= test session starts ==============================
01-Oct-2026 20:53:55 platform linux -- Python 3.12.9, pytest-9.1.1, pluggy-1.6.0 -- /home/casatest/venv/bin/python3.12
01-Oct-2026 20:53:55 cachedir: .pytest_cache
01-Oct-2026 20:53:55 rootdir: /home/casatest/casa6/casatestutils/nosedir/test_task_imsmooth
01-Oct-2026 20:53:55 configfile: pytest.ini
01-Oct-2026 20:53:57 collecting ... collected 13 items
01-Oct-2026 20:53:57
01-Oct-2026 20:53:57
01-Oct-2026 20:53:57 test_task_imsmooth.py::imsmooth_test::test_beam 2026-10-02 00:53:57        WARN        imsmooth::image::commonbeam (file src/tools/image/image_cmpt.cc, line 824)        This image only has one beam, so just returning that
01-Oct-2026 20:53:57 2026-10-02 00:53:57        WARN        image::open (file src/tools/image/image_cmpt.cc, line 4289)        Another image is already open, closing first
01-Oct-2026 20:53:57 2026-10-02 00:53:57        WARN        imsmooth::image::commonbeam (file src/tools/image/image_cmpt.cc, line 824)        This image only has one beam, so just returning that
01-Oct-2026 20:53:57 2026-10-02 00:53:57        SEVERE        imsmooth::image::deconvolvefrombeam (file src/tools/image/image_cmpt.cc, line 1663)        Exception Reported: Cannot understand source values
01-Oct-2026 20:53:57 2026-10-02 00:53:57        SEVERE        imsmooth::::casa        Task imsmooth raised an exception of class RuntimeError with the following message: Cannot understand source values
01-Oct-2026 20:53:57
01-Oct-2026 20:53:57 Test the beam parameter
01-Oct-2026 20:53:57 {'fit': {'major': {'unit': 'arcsec', 'value': 5.291502622129181}, 'minor': {'unit': 'arcsec', 'value': 2.6457513110645907}, 'pa': {'unit': 'deg', 'value': -0.0}, 'success': True}, 'return': False}  val  1.2826964324176052e-05
01-Oct-2026 20:53:57 FAILED
01-Oct-2026 20:53:57 test_task_imsmooth.py::imsmooth_test::test_beam ERROR
01-Oct-2026 20:53:57
01-Oct-2026 20:53:57 test_task_imsmooth.py::imsmooth_test::test_commonbeam 2026-10-02 00:53:57        WARN        imsmooth::image::commonbeam (file src/tools/image/image_cmpt.cc, line 824)        This image only has one beam, so just returning that
01-Oct-2026 20:53:57 2026-10-02 00:53:57        WARN        imsmooth::image::commonbeam (file src/tools/image/image_cmpt.cc, line 824)        This image only has one beam, so just returning that
01-Oct-2026 20:53:57 2026-10-02 00:53:57        SEVERE        imsmooth::image::deconvolvefrombeam (file src/tools/image/image_cmpt.cc, line 1663)        Exception Reported: Cannot understand source values
01-Oct-2026 20:53:57 2026-10-02 00:53:57        SEVERE        imsmooth::::casa        Task imsmooth raised an exception of class RuntimeError with the following message: Cannot understand source values
01-Oct-2026 20:53:57
01-Oct-2026 20:53:57 Test kernel='commonbeam' in imsmooth
01-Oct-2026 20:53:57 FAILED
01-Oct-2026 20:53:57 test_task_imsmooth.py::imsmooth_test::test_commonbeam ERROR
01-Oct-2026 20:53:57
01-Oct-2026 20:53:57 test_task_imsmooth.py::imsmooth_test::test_conserve_flux 2026-10-02 00:53:58        WARN        componentlist::fromrecord        componentlist is not empty; overwriting it
01-Oct-2026 20:53:57 2026-10-02 00:53:58        WARN        ImageFitter::_finishConstruction        Unrecognized intensity unit cm-2. Will assume Jy/pixel
01-Oct-2026 20:53:57 2026-10-02 00:53:58        WARN        SkyCompRep::convertToJy        Cannot convert units of brightness to Jy - will assume Jy
01-Oct-2026 20:53:57 2026-10-02 00:53:58        WARN        SkyCompRep::peakToIntegralFlux()        The image units 'cm-2' are not consistent
01-Oct-2026 20:53:57 2026-10-02 00:53:58        WARN        SkyCompRep::peakToIntegralFlux()+        with Jy when integrated over the sky.  Assuming Jy/pixel
01-Oct-2026 20:53:57 2026-10-02 00:53:58        WARN        SkyCompRep::integralToPeakFlux()        The image units 'cm-2' are not consistent
01-Oct-2026 20:53:57 2026-10-02 00:53:58        WARN        SkyCompRep::integralToPeakFlux()+        with Jy when integrated over the sky.  Assuming Jy/pixel
01-Oct-2026 20:53:57 2026-10-02 00:53:58        WARN        ImageFitter::_finishConstruction        Unrecognized intensity unit cm-2. Will assume Jy/pixel
01-Oct-2026 20:53:57 2026-10-02 00:53:58        WARN        SkyCompRep::convertToJy        Cannot convert units of brightness to Jy - will assume Jy
01-Oct-2026 20:53:57 2026-10-02 00:53:58        WARN        SkyCompRep::peakToIntegralFlux()        The image units 'cm-2' are not consistent
01-Oct-2026 20:53:57 2026-10-02 00:53:58        WARN        SkyCompRep::peakToIntegralFlux()+        with Jy when integrated over the sky.  Assuming Jy/pixel
01-Oct-2026 20:53:57 2026-10-02 00:53:58        WARN        SkyCompRep::integralToPeakFlux()        The image units 'cm-2' are not consistent
01-Oct-2026 20:53:57 2026-10-02 00:53:58        WARN        SkyCompRep::integralToPeakFlux()+        with Jy when integrated over the sky.  Assuming Jy/pixel
01-Oct-2026 20:53:57 2026-10-02 00:53:58        WARN        componentlist::fromrecord        componentlist is not empty; overwriting it
01-Oct-2026 20:53:57
01-Oct-2026 20:53:57 Test flux density is conserved for images with units of K or anything without 'beam'
01-Oct-2026 20:53:57 FAILED
01-Oct-2026 20:53:57
01-Oct-2026 20:53:57 test_task_imsmooth.py::imsmooth_test::test_copying_of_input_mask
01-Oct-2026 20:53:57 CAS-12904: copy input mask to output image
01-Oct-2026 20:53:57 FAILED
01-Oct-2026 20:53:57
01-Oct-2026 20:53:58 test_task_imsmooth.py::imsmooth_test::test_history
01-Oct-2026 20:53:58 Test that history is written
01-Oct-2026 20:53:58 FAILED
01-Oct-2026 20:53:58
01-Oct-2026 20:53:58 test_task_imsmooth.py::imsmooth_test::test_image_kernel 2026-10-02 00:53:58        WARN        image::open (file src/tools/image/image_cmpt.cc, line 4289)        Another image is already open, closing first
01-Oct-2026 20:53:58
01-Oct-2026 20:53:58 Test image as kernel, CAS-5844
01-Oct-2026 20:53:58 max 5.418622304137477e-05
01-Oct-2026 20:53:58 FAILED
01-Oct-2026 20:53:58
01-Oct-2026 20:53:58 test_task_imsmooth.py::imsmooth_test::test_input 2026-10-02 00:53:58        WARN        imsmooth::::casa        The IMAGENAME parameter tests will cause errors to occur, do not be alarmed
01-Oct-2026 20:53:58 2026-10-02 00:53:58        WARN        imsmooth::image::commonbeam (file src/tools/image/image_cmpt.cc, line 824)        This image only has one beam, so just returning that
01-Oct-2026 20:53:58 2026-10-02 00:53:58        WARN        imsmooth::image::commonbeam (file src/tools/image/image_cmpt.cc, line 824)        This image only has one beam, so just returning that
01-Oct-2026 20:53:58 2026-10-02 00:53:58        WARN        imsmooth::::casa        The OUTFILE parameter tests will cause errors to occur, do not be alarmed
01-Oct-2026 20:53:58 2026-10-02 00:53:58        WARN        imsmooth::image::commonbeam (file src/tools/image/image_cmpt.cc, line 824)        This image only has one beam, so just returning that
01-Oct-2026 20:53:58 2026-10-02 00:53:58        SEVERE        imsmooth::ImageInputProcessor::_process        Replaceable flag is false and there is already a file or directory named input_test1 so the output image will not be written
01-Oct-2026 20:53:58 2026-10-02 00:53:58        SEVERE        imsmooth::image::_convolve2d (file src/tools/image/image_cmpt.cc, line 1212)        Exception Reported: 2026-10-02 00:53:58        SEVERE        imsmooth::ImageInputProcessor::_process        Replaceable flag is false and there is already a file or directory named input_test1 so the output image will not be written
01-Oct-2026 20:53:58 2026-10-02 00:53:58        SEVERE        imsmooth::::casa        Task imsmooth raised an exception of class RuntimeError with the following message: 2026-10-02 00:53:58        SEVERE        imsmooth::ImageInputProcessor::_process        Replaceable flag is false and there is already a file or directory named input_test1 so the output image will not be written
01-Oct-2026 20:53:58 2026-10-02 00:53:58        WARN        imsmooth::image::commonbeam (file src/tools/image/image_cmpt.cc, line 824)        This image only has one beam, so just returning that
01-Oct-2026 20:53:58 2026-10-02 00:53:58        WARN        imsmooth::::casa        The KERNEL parameter tests will cause errors to occur, do not be alarmed
01-Oct-2026 20:53:58 2026-10-02 00:53:58        WARN        imsmooth::image::commonbeam (file src/tools/image/image_cmpt.cc, line 824)        This image only has one beam, so just returning that
01-Oct-2026 20:53:58 2026-10-02 00:53:58        WARN        imsmooth::::casa        The MAJOR parameter tests will cause errors to occur, do not be alarmed
01-Oct-2026 20:53:58 2026-10-02 00:53:58        WARN        imsmooth::image::commonbeam (file src/tools/image/image_cmpt.cc, line 824)        This image only has one beam, so just returning that
01-Oct-2026 20:53:58 2026-10-02 00:53:58        WARN        imsmooth::image::commonbeam (file src/tools/image/image_cmpt.cc, line 824)        This image only has one beam, so just returning that
01-Oct-2026 20:53:58 2026-10-02 00:53:58        SEVERE        imsmooth::image::deconvolvefrombeam (file src/tools/image/image_cmpt.cc, line 1663)        Exception Reported: Exception: Major axis must have angular units (pix is not)..
01-Oct-2026 20:53:58 2026-10-02 00:53:58        SEVERE        imsmooth::image::deconvolvefrombeam (file src/tools/image/image_cmpt.cc, line 1663)+        ... thrown by void casacore::GaussianBeam::setMajorMinor(const Quantity&, const Quantity&) at File: /source/casa6/casatools/casacore/scimath/Mathematics/GaussianBeam.cc, line: 148
01-Oct-2026 20:53:58 2026-10-02 00:53:58        SEVERE        imsmooth::::casa        Task imsmooth raised an exception of class RuntimeError with the following message: Exception: Major axis must have angular units (pix is not)..
01-Oct-2026 20:53:58 2026-10-02 00:53:58        SEVERE        imsmooth::::casa+        ... thrown by void casacore::GaussianBeam::setMajorMinor(const Quantity&, const Quantity&) at File: /source/casa6/casatools/casacore/scimath/Mathematics/GaussianBeam.cc, line: 148
01-Oct-2026 20:53:58
01-Oct-2026 20:53:58 Imsmooth: Testing INPUT/OUTPUT tests
01-Oct-2026 20:53:58 {'fit': {'major': {'unit': 'arcsec', 'value': 0.0}, 'minor': {'unit': 'arcsec', 'value': 0.0}, 'pa': {'unit': 'deg', 'value': 0.0}, 'success': False}, 'return': False}  val  0.0
01-Oct-2026 20:53:58 {'fit': {'major': {'unit': 'arcsec', 'value': 0.0}, 'minor': {'unit': 'arcsec', 'value': 0.0}, 'pa': {'unit': 'deg', 'value': 0.0}, 'success': False}, 'return': False}  val  0.0
01-Oct-2026 20:53:58 {'fit': {'major': {'unit': 'arcsec', 'value': 0.0}, 'minor': {'unit': 'arcsec', 'value': 0.0}, 'pa': {'unit': 'deg', 'value': 0.0}, 'success': False}, 'return': False}  val  0.0
01-Oct-2026 20:53:58 {'fit': {'major': {'unit': 'arcsec', 'value': 0.0}, 'minor': {'unit': 'arcsec', 'value': 0.0}, 'pa': {'unit': 'deg', 'value': 0.0}, 'success': False}, 'return': False}  val  0.0
01-Oct-2026 20:53:58 {'fit': {'major': {'unit': 'arcsec', 'value': 0.0}, 'minor': {'unit': 'arcsec', 'value': 0.0}, 'pa': {'unit': 'deg', 'value': 0.0}, 'success': False}, 'return': False}  val  0.0
01-Oct-2026 20:53:58 {'fit': {'major': {'unit': 'arcsec', 'value': 0.0}, 'minor': {'unit': 'arcsec', 'value': 0.0}, 'pa': {'unit': 'deg', 'value': 0.0}, 'success': False}, 'return': False}  val  0.0
01-Oct-2026 20:53:58 FAILED
01-Oct-2026 20:53:58 test_task_imsmooth.py::imsmooth_test::test_input ERROR
01-Oct-2026 20:53:58
01-Oct-2026 20:53:58 test_task_imsmooth.py::imsmooth_test::test_multibeam 2026-10-02 00:53:59        WARN        imsmooth::image::commonbeam (file src/tools/image/image_cmpt.cc, line 824)        This image only has one beam, so just returning that
01-Oct-2026 20:53:58 2026-10-02 00:53:59        WARN        imsmooth::image::commonbeam (file src/tools/image/image_cmpt.cc, line 824)        This image only has one beam, so just returning that
01-Oct-2026 20:53:58 2026-10-02 00:53:59        WARN        imsmooth::image::commonbeam (file src/tools/image/image_cmpt.cc, line 824)        This image only has one beam, so just returning that
01-Oct-2026 20:53:58 2026-10-02 00:53:59        WARN        imsmooth::image::commonbeam (file src/tools/image/image_cmpt.cc, line 824)        This image only has one beam, so just returning that
01-Oct-2026 20:53:58 2026-10-02 00:53:59        WARN        imsmooth::image::commonbeam (file src/tools/image/image_cmpt.cc, line 824)        This image only has one beam, so just returning that
01-Oct-2026 20:53:58
01-Oct-2026 20:53:58 Test per plane beams
01-Oct-2026 20:53:58 {'fit': {'major': {'unit': 'arcsec', 'value': 321.87959251178336}, 'minor': {'unit': 'arcsec', 'value': 137.08948874530165}, 'pa': {'unit': 'deg', 'value': -69.59027536693638}, 'success': True}, 'return': False}  val  0.00066462859680034
01-Oct-2026 20:53:58 {'fit': {'major': {'unit': 'arcsec', 'value': 547.8906364742298}, 'minor': {'unit': 'arcsec', 'value': 409.65332961403243}, 'pa': {'unit': 'deg', 'value': -87.3125738965605}, 'success': True}, 'return': False}  val  0.0019860553870895714
01-Oct-2026 20:53:58 {'fit': {'major': {'unit': 'arcsec', 'value': 513.8525682319146}, 'minor': {'unit': 'arcsec', 'value': 373.0355721931427}, 'pa': {'unit': 'deg', 'value': -83.598768316534}, 'success': True}, 'return': False}  val  0.0018085274893975957
01-Oct-2026 20:53:58 {'fit': {'major': {'unit': 'arcsec', 'value': 468.1327037486219}, 'minor': {'unit': 'arcsec', 'value': 323.8082328802109}, 'pa': {'unit': 'deg', 'value': -79.55330267543454}, 'success': True}, 'return': False}  val  0.0015698666135622891
01-Oct-2026 20:53:58 {'fit': {'major': {'unit': 'arcsec', 'value': 406.94533484003273}, 'minor': {'unit': 'arcsec', 'value': 254.54959134112423}, 'pa': {'unit': 'deg', 'value': -75.00305161548785}, 'success': True}, 'return': False}  val  0.001234091244030185
01-Oct-2026 20:53:58 {'fit': {'major': {'unit': 'arcsec', 'value': 321.87959251178336}, 'minor': {'unit': 'arcsec', 'value': 137.08948874530165}, 'pa': {'unit': 'deg', 'value': -69.59027536693638}, 'success': True}, 'return': False}  val  0.00066462859680034
01-Oct-2026 20:53:58 FAILED
01-Oct-2026 20:53:58
01-Oct-2026 20:53:58 test_task_imsmooth.py::imsmooth_test::test_overwrite 2026-10-02 00:53:59        SEVERE        imsmooth::ImageInputProcessor::_process        Replaceable flag is false and there is already a file or directory named imsmooth_test_overwrite.im so the output image will not be written
01-Oct-2026 20:53:58 2026-10-02 00:53:59        SEVERE        imsmooth::image::_convolve2d (file src/tools/image/image_cmpt.cc, line 1212)        Exception Reported: 2026-10-02 00:53:59        SEVERE        imsmooth::ImageInputProcessor::_process        Replaceable flag is false and there is already a file or directory named imsmooth_test_overwrite.im so the output image will not be written
01-Oct-2026 20:53:58 2026-10-02 00:53:59        SEVERE        imsmooth::::casa        Task imsmooth raised an exception of class RuntimeError with the following message: 2026-10-02 00:53:59        SEVERE        imsmooth::ImageInputProcessor::_process        Replaceable flag is false and there is already a file or directory named imsmooth_test_overwrite.im so the output image will not be written
01-Oct-2026 20:53:58
01-Oct-2026 20:53:58 test overwrite parameter 
01-Oct-2026 20:53:58 FAILED
01-Oct-2026 20:53:58
01-Oct-2026 20:53:59 test_task_imsmooth.py::imsmooth_test::test_region
01-Oct-2026 20:53:59 Imsmooth: Region selection correction test
01-Oct-2026 20:53:59 FAILED
01-Oct-2026 20:53:59
01-Oct-2026 20:54:01 test_task_imsmooth.py::imsmooth_test::test_smooth
01-Oct-2026 20:54:01 Imsmooth: Testing correctness
01-Oct-2026 20:54:01 FAILED
01-Oct-2026 20:54:01
01-Oct-2026 20:54:01 test_task_imsmooth.py::imsmooth_test::test_stretch 2026-10-02 00:54:02        WARN        imsmooth::::casa        The outfile paramter is empty, consequently the smoothed image will be
01-Oct-2026 20:54:01 2026-10-02 00:54:02        WARN        imsmooth::::casa+        saved on disk in file, imsmooth_results.im
01-Oct-2026 20:54:01 2026-10-02 00:54:02        SEVERE        image::_convolve2d (file src/tools/image/image_cmpt.cc, line 1212)        Exception Reported: The input image shape ([200, 200, 1, 20]) and mask shape ([200, 200, 1, 1]) are different, and it was specified that the mask should not be extended, so the mask cannot be applied to the (sub)image. Specifying that the mask should be extended may resolve the issue at File: /source/casainstall/include/casacpp/imageanalysis/ImageAnalysis/SubImageFactory.tcc, line: 306
01-Oct-2026 20:54:01 2026-10-02 00:54:02        SEVERE        imsmooth::::casa        Task imsmooth raised an exception of class RuntimeError with the following message: The input image shape ([200, 200, 1, 20]) and mask shape ([200, 200, 1, 1]) are different, and it was specified that the mask should not be extended, so the mask cannot be applied to the (sub)image. Specifying that the mask should be extended may resolve the issue at File: /source/casainstall/include/casacpp/imageanalysis/ImageAnalysis/SubImageFactory.tcc, line: 306
01-Oct-2026 20:54:01 2026-10-02 00:54:02        WARN        imsmooth::::casa        The outfile paramter is empty, consequently the smoothed image will be
01-Oct-2026 20:54:01 2026-10-02 00:54:02        WARN        imsmooth::::casa+        saved on disk in file, imsmooth_results.im
01-Oct-2026 20:54:01 2026-10-02 00:54:02        WARN        Image2DConvolver::_dealWithRestoringBeam        Convolving kernel has minor axis 2 arcsec which is less than the pixel diagonal length of 84.8528 arcsec. Thus, the kernel is poorly sampled, and so the output of this application may not be what you expect. You should consider increasing the kernel size or regridding the image to a smaller pixel size
01-Oct-2026 20:54:02
01-Oct-2026 20:54:02 imsmooth(): Test stretch parameter
01-Oct-2026 20:54:02 FAILED
01-Oct-2026 20:54:02
01-Oct-2026 20:54:02 test_task_imsmooth.py::imsmooth_test::test_targetres 2026-10-02 00:54:03        WARN        imsmooth::image::commonbeam (file src/tools/image/image_cmpt.cc, line 824)        This image only has one beam, so just returning that
01-Oct-2026 20:54:02 2026-10-02 00:54:03        WARN        imsmooth::image::commonbeam (file src/tools/image/image_cmpt.cc, line 824)        This image only has one beam, so just returning that
01-Oct-2026 20:54:02 2026-10-02 00:54:03        WARN        imsmooth::::casa        difference Gaussian beam is subpixel doing regridding before convolution
01-Oct-2026 20:54:02 2026-10-02 00:54:03        SEVERE        AppInfo::workDirectory(uInt) (file /source/casa6/casatools/casacore/casa/System/AppInfo.cc, line 106)        No work directory with at least 101438731MB free can be found.
01-Oct-2026 20:54:02 2026-10-02 00:54:03        SEVERE        AppInfo::workDirectory(uInt) (file /source/casa6/casatools/casacore/casa/System/AppInfo.cc, line 106)+        Check aipsrc variable user.directories.work.
01-Oct-2026 20:54:02 2026-10-02 00:54:03        SEVERE        image::regrid        Exception Reported: 2026-10-02 00:54:03        SEVERE        AppInfo::workDirectory(uInt) (file /source/casa6/casatools/casacore/casa/System/AppInfo.cc, line 106)        No work directory with at least 101438731MB free can be found.
01-Oct-2026 20:54:02 2026-10-02 00:54:03        SEVERE        image::regrid+        2026-10-02 00:54:03        SEVERE        AppInfo::workDirectory(uInt) (file /source/casa6/casatools/casacore/casa/System/AppInfo.cc, line 106)+        Check aipsrc variable user.directories.work.
01-Oct-2026 20:54:02 2026-10-02 00:54:03        SEVERE        imsmooth::::casa        Task imsmooth raised an exception of class AttributeError with the following message: 'bool' object has no attribute 'shape'
01-Oct-2026 20:54:02
01-Oct-2026 20:54:02 Test targetres parameter
01-Oct-2026 20:54:02 {'fit': {'major': {'unit': 'arcsec', 'value': 5.291502622129181}, 'minor': {'unit': 'arcsec', 'value': 2.6457513110645907}, 'pa': {'unit': 'deg', 'value': -0.0}, 'success': True}, 'return': False}  val  1.2826964324176052e-05
01-Oct-2026 20:54:02 {'fit': {'major': {'unit': 'arcsec', 'value': 8.0}, 'minor': {'unit': 'arcsec', 'value': 4.0}, 'pa': {'unit': 'deg', 'value': -0.0}, 'success': True}, 'return': False}  val  1.939254724438144e-05
01-Oct-2026 20:54:02 FAILED
01-Oct-2026 20:54:02 test_task_imsmooth.py::imsmooth_test::test_targetres ERROR
01-Oct-2026 20:54:02
01-Oct-2026 20:54:02 ==================================== ERRORS ====================================
01-Oct-2026 20:54:02 _________________ ERROR at teardown of imsmooth_test.test_beam _________________
01-Oct-2026 20:54:02 test_task_imsmooth.py:98: in tearDown
01-Oct-2026 20:54:02     self.assertTrue(len(_tb.showcache()) == 0)
01-Oct-2026 20:54:02 E   AssertionError: False is not true
01-Oct-2026 20:54:02 ______________ ERROR at teardown of imsmooth_test.test_commonbeam ______________
01-Oct-2026 20:54:02 test_task_imsmooth.py:98: in tearDown
01-Oct-2026 20:54:02     self.assertTrue(len(_tb.showcache()) == 0)
01-Oct-2026 20:54:02 E   AssertionError: False is not true
01-Oct-2026 20:54:02 ________________ ERROR at teardown of imsmooth_test.test_input _________________
01-Oct-2026 20:54:02 test_task_imsmooth.py:98: in tearDown
01-Oct-2026 20:54:02     self.assertTrue(len(_tb.showcache()) == 0)
01-Oct-2026 20:54:02 E   AssertionError: False is not true
01-Oct-2026 20:54:02 ______________ ERROR at teardown of imsmooth_test.test_targetres _______________
01-Oct-2026 20:54:02 test_task_imsmooth.py:98: in tearDown
01-Oct-2026 20:54:02     self.assertTrue(len(_tb.showcache()) == 0)
01-Oct-2026 20:54:02 E   AssertionError: False is not true
01-Oct-2026 20:54:02 =================================== FAILURES ===================================
01-Oct-2026 20:54:02 ___________________________ imsmooth_test.test_beam ____________________________
01-Oct-2026 20:54:02 test_task_imsmooth.py:1238: in test_beam
01-Oct-2026 20:54:02     x = run_imsmooth(
01-Oct-2026 20:54:02 test_task_imsmooth.py:57: in run_imsmooth
01-Oct-2026 20:54:02     return imsmooth(
01-Oct-2026 20:54:02 ../../../../venv/lib/python3.12/site-packages/casatasks/imsmooth.py:201: in __call__
01-Oct-2026 20:54:02     task_result = _imsmooth_t( _pc.document['imagename'], _pc.document['kernel'], _pc.document['major'], _pc.document['minor'], _pc.document['pa'], _pc.document['targetres'], _pc.document['kimage'], _pc.document['scale'], _pc.document['region'], _pc.document['box'], _pc.document['chans'], _pc.document['stokes'], _pc.document['mask'], _pc.document['outfile'], _pc.document['stretch'], _pc.document['overwrite'], _pc.document['beam'] )
01-Oct-2026 20:54:02                   ^^^^^^^^^^^^^^^^^^^^^^^^^^^^^^^^^^^^^^^^^^^^^^^^^^^^^^^^^^^^^^^^^^^^^^^^^^^^^^^^^^^^^^^^^^^^^^^^^^^^^^^^^^^^^^^^^^^^^^^^^^^^^^^^^^^^^^^^^^^^^^^^^^^^^^^^^^^^^^^^^^^^^^^^^^^^^^^^^^^^^^^^^^^^^^^^^^^^^^^^^^^^^^^^^^^^^^^^^^^^^^^^^^^^^^^^^^^^^^^^^^^^^^^^^^^^^^^^^^^^^^^^^^^^^^^^^^^^^^^^^^^^^^^^^^^^^^^^^^^^^^^^^^^^^^^^^^^^^^^^^^^^^^^^^^^^^^^^^^^^^^^^^^^^^^^^^^^^^^^^^^^^^^^^^^^^^^^^^^^^^^^^^^^^^^^^^^^^^^^^^^^^^^^^^^^^^^^^^
01-Oct-2026 20:54:02 ../../../../venv/lib/python3.12/site-packages/casatasks/private/callabletask.py:31: in wrapper
01-Oct-2026 20:54:02     retval = func(*args, **kwargs)
01-Oct-2026 20:54:02              ^^^^^^^^^^^^^^^^^^^^^
01-Oct-2026 20:54:02 ../../../../venv/lib/python3.12/site-packages/casatasks/private/task_imsmooth.py:163: in imsmooth
01-Oct-2026 20:54:02     pixfac=test_conv_kernel_size(imagename, beamval)
01-Oct-2026 20:54:02            ^^^^^^^^^^^^^^^^^^^^^^^^^^^^^^^^^^^^^^^^^
01-Oct-2026 20:54:02 ../../../../venv/lib/python3.12/site-packages/casatasks/private/ialib.py:232: in test_conv_kernel_size
01-Oct-2026 20:54:02     res=ia.deconvolvefrombeam(source=beam, beam=source)
01-Oct-2026 20:54:02         ^^^^^^^^^^^^^^^^^^^^^^^^^^^^^^^^^^^^^^^^^^^^^^^
01-Oct-2026 20:54:02 ../../../../venv/lib/python3.12/site-packages/casatools/image.py:1250: in deconvolvefrombeam
01-Oct-2026 20:54:02     return self._swigobj.deconvolvefrombeam(source, beam)
01-Oct-2026 20:54:02            ^^^^^^^^^^^^^^^^^^^^^^^^^^^^^^^^^^^^^^^^^^^^^^
01-Oct-2026 20:54:02 ../../../../venv/lib/python3.12/site-packages/casatools/__casac__/image.py:2903: in deconvolvefrombeam
01-Oct-2026 20:54:02     return _image.image_deconvolvefrombeam(self, *args, **kwargs)
01-Oct-2026 20:54:02            ^^^^^^^^^^^^^^^^^^^^^^^^^^^^^^^^^^^^^^^^^^^^^^^^^^^^^^
01-Oct-2026 20:54:02 E   RuntimeError: Cannot understand source values
01-Oct-2026 20:54:02 ________________________ imsmooth_test.test_commonbeam _________________________
01-Oct-2026 20:54:02 test_task_imsmooth.py:1316: in test_commonbeam
01-Oct-2026 20:54:02     imsmooth(
01-Oct-2026 20:54:02 ../../../../venv/lib/python3.12/site-packages/casatasks/imsmooth.py:201: in __call__
01-Oct-2026 20:54:02     task_result = _imsmooth_t( _pc.document['imagename'], _pc.document['kernel'], _pc.document['major'], _pc.document['minor'], _pc.document['pa'], _pc.document['targetres'], _pc.document['kimage'], _pc.document['scale'], _pc.document['region'], _pc.document['box'], _pc.document['chans'], _pc.document['stokes'], _pc.document['mask'], _pc.document['outfile'], _pc.document['stretch'], _pc.document['overwrite'], _pc.document['beam'] )
01-Oct-2026 20:54:02                   ^^^^^^^^^^^^^^^^^^^^^^^^^^^^^^^^^^^^^^^^^^^^^^^^^^^^^^^^^^^^^^^^^^^^^^^^^^^^^^^^^^^^^^^^^^^^^^^^^^^^^^^^^^^^^^^^^^^^^^^^^^^^^^^^^^^^^^^^^^^^^^^^^^^^^^^^^^^^^^^^^^^^^^^^^^^^^^^^^^^^^^^^^^^^^^^^^^^^^^^^^^^^^^^^^^^^^^^^^^^^^^^^^^^^^^^^^^^^^^^^^^^^^^^^^^^^^^^^^^^^^^^^^^^^^^^^^^^^^^^^^^^^^^^^^^^^^^^^^^^^^^^^^^^^^^^^^^^^^^^^^^^^^^^^^^^^^^^^^^^^^^^^^^^^^^^^^^^^^^^^^^^^^^^^^^^^^^^^^^^^^^^^^^^^^^^^^^^^^^^^^^^^^^^^^^^^^^^^^
01-Oct-2026 20:54:02 ../../../../venv/lib/python3.12/site-packages/casatasks/private/callabletask.py:31: in wrapper
01-Oct-2026 20:54:02     retval = func(*args, **kwargs)
01-Oct-2026 20:54:02              ^^^^^^^^^^^^^^^^^^^^^
01-Oct-2026 20:54:02 ../../../../venv/lib/python3.12/site-packages/casatasks/private/task_imsmooth.py:163: in imsmooth
01-Oct-2026 20:54:02     pixfac=test_conv_kernel_size(imagename, beamval)
01-Oct-2026 20:54:02            ^^^^^^^^^^^^^^^^^^^^^^^^^^^^^^^^^^^^^^^^^
01-Oct-2026 20:54:02 ../../../../venv/lib/python3.12/site-packages/casatasks/private/ialib.py:232: in test_conv_kernel_size
01-Oct-2026 20:54:02     res=ia.deconvolvefrombeam(source=beam, beam=source)
01-Oct-2026 20:54:02         ^^^^^^^^^^^^^^^^^^^^^^^^^^^^^^^^^^^^^^^^^^^^^^^
01-Oct-2026 20:54:02 ../../../../venv/lib/python3.12/site-packages/casatools/image.py:1250: in deconvolvefrombeam
01-Oct-2026 20:54:02     return self._swigobj.deconvolvefrombeam(source, beam)
01-Oct-2026 20:54:02            ^^^^^^^^^^^^^^^^^^^^^^^^^^^^^^^^^^^^^^^^^^^^^^
01-Oct-2026 20:54:02 ../../../../venv/lib/python3.12/site-packages/casatools/__casac__/image.py:2903: in deconvolvefrombeam
01-Oct-2026 20:54:02     return _image.image_deconvolvefrombeam(self, *args, **kwargs)
01-Oct-2026 20:54:02            ^^^^^^^^^^^^^^^^^^^^^^^^^^^^^^^^^^^^^^^^^^^^^^^^^^^^^^
01-Oct-2026 20:54:02 E   RuntimeError: Cannot understand source values
01-Oct-2026 20:54:02 _______________________ imsmooth_test.test_conserve_flux _______________________
01-Oct-2026 20:54:02 test_task_imsmooth.py:98: in tearDown
01-Oct-2026 20:54:02     self.assertTrue(len(_tb.showcache()) == 0)
01-Oct-2026 20:54:02 E   AssertionError: False is not true
01-Oct-2026 20:54:02 ___________________ imsmooth_test.test_copying_of_input_mask ___________________
01-Oct-2026 20:54:02 test_task_imsmooth.py:98: in tearDown
01-Oct-2026 20:54:02     self.assertTrue(len(_tb.showcache()) == 0)
01-Oct-2026 20:54:02 E   AssertionError: False is not true
01-Oct-2026 20:54:02 __________________________ imsmooth_test.test_history __________________________
01-Oct-2026 20:54:02 test_task_imsmooth.py:98: in tearDown
01-Oct-2026 20:54:02     self.assertTrue(len(_tb.showcache()) == 0)
01-Oct-2026 20:54:02 E   AssertionError: False is not true
01-Oct-2026 20:54:02 _______________________ imsmooth_test.test_image_kernel ________________________
01-Oct-2026 20:54:02 test_task_imsmooth.py:98: in tearDown
01-Oct-2026 20:54:02     self.assertTrue(len(_tb.showcache()) == 0)
01-Oct-2026 20:54:02 E   AssertionError: False is not true
01-Oct-2026 20:54:02 ___________________________ imsmooth_test.test_input ___________________________
01-Oct-2026 20:54:02 test_task_imsmooth.py:344: in test_input
01-Oct-2026 20:54:02     results = imsmooth( tiny, major='2pix', minor='1pix', pa="deg", outfile=outfile)
01-Oct-2026 20:54:02               ^^^^^^^^^^^^^^^^^^^^^^^^^^^^^^^^^^^^^^^^^^^^^^^^^^^^^^^^^^^^^^^^^^^^^^
01-Oct-2026 20:54:02 ../../../../venv/lib/python3.12/site-packages/casatasks/imsmooth.py:201: in __call__
01-Oct-2026 20:54:02     task_result = _imsmooth_t( _pc.document['imagename'], _pc.document['kernel'], _pc.document['major'], _pc.document['minor'], _pc.document['pa'], _pc.document['targetres'], _pc.document['kimage'], _pc.document['scale'], _pc.document['region'], _pc.document['box'], _pc.document['chans'], _pc.document['stokes'], _pc.document['mask'], _pc.document['outfile'], _pc.document['stretch'], _pc.document['overwrite'], _pc.document['beam'] )
01-Oct-2026 20:54:02                   ^^^^^^^^^^^^^^^^^^^^^^^^^^^^^^^^^^^^^^^^^^^^^^^^^^^^^^^^^^^^^^^^^^^^^^^^^^^^^^^^^^^^^^^^^^^^^^^^^^^^^^^^^^^^^^^^^^^^^^^^^^^^^^^^^^^^^^^^^^^^^^^^^^^^^^^^^^^^^^^^^^^^^^^^^^^^^^^^^^^^^^^^^^^^^^^^^^^^^^^^^^^^^^^^^^^^^^^^^^^^^^^^^^^^^^^^^^^^^^^^^^^^^^^^^^^^^^^^^^^^^^^^^^^^^^^^^^^^^^^^^^^^^^^^^^^^^^^^^^^^^^^^^^^^^^^^^^^^^^^^^^^^^^^^^^^^^^^^^^^^^^^^^^^^^^^^^^^^^^^^^^^^^^^^^^^^^^^^^^^^^^^^^^^^^^^^^^^^^^^^^^^^^^^^^^^^^^^^^
01-Oct-2026 20:54:02 ../../../../venv/lib/python3.12/site-packages/casatasks/private/callabletask.py:31: in wrapper
01-Oct-2026 20:54:02     retval = func(*args, **kwargs)
01-Oct-2026 20:54:02              ^^^^^^^^^^^^^^^^^^^^^
01-Oct-2026 20:54:02 ../../../../venv/lib/python3.12/site-packages/casatasks/private/task_imsmooth.py:163: in imsmooth
01-Oct-2026 20:54:02     pixfac=test_conv_kernel_size(imagename, beamval)
01-Oct-2026 20:54:02            ^^^^^^^^^^^^^^^^^^^^^^^^^^^^^^^^^^^^^^^^^
01-Oct-2026 20:54:02 ../../../../venv/lib/python3.12/site-packages/casatasks/private/ialib.py:232: in test_conv_kernel_size
01-Oct-2026 20:54:02     res=ia.deconvolvefrombeam(source=beam, beam=source)
01-Oct-2026 20:54:02         ^^^^^^^^^^^^^^^^^^^^^^^^^^^^^^^^^^^^^^^^^^^^^^^
01-Oct-2026 20:54:02 ../../../../venv/lib/python3.12/site-packages/casatools/image.py:1250: in deconvolvefrombeam
01-Oct-2026 20:54:02     return self._swigobj.deconvolvefrombeam(source, beam)
01-Oct-2026 20:54:02            ^^^^^^^^^^^^^^^^^^^^^^^^^^^^^^^^^^^^^^^^^^^^^^
01-Oct-2026 20:54:02 ../../../../venv/lib/python3.12/site-packages/casatools/__casac__/image.py:2903: in deconvolvefrombeam
01-Oct-2026 20:54:02     return _image.image_deconvolvefrombeam(self, *args, **kwargs)
01-Oct-2026 20:54:02            ^^^^^^^^^^^^^^^^^^^^^^^^^^^^^^^^^^^^^^^^^^^^^^^^^^^^^^
01-Oct-2026 20:54:02 E   RuntimeError: Exception: Major axis must have angular units (pix is not)..
01-Oct-2026 20:54:02 E   ... thrown by void casacore::GaussianBeam::setMajorMinor(const Quantity&, const Quantity&) at File: /source/casa6/casatools/casacore/scimath/Mathematics/GaussianBeam.cc, line: 148
01-Oct-2026 20:54:02 _________________________ imsmooth_test.test_multibeam _________________________
01-Oct-2026 20:54:02 test_task_imsmooth.py:98: in tearDown
01-Oct-2026 20:54:02     self.assertTrue(len(_tb.showcache()) == 0)
01-Oct-2026 20:54:02 E   AssertionError: False is not true
01-Oct-2026 20:54:02 _________________________ imsmooth_test.test_overwrite _________________________
01-Oct-2026 20:54:02 test_task_imsmooth.py:98: in tearDown
01-Oct-2026 20:54:02     self.assertTrue(len(_tb.showcache()) == 0)
01-Oct-2026 20:54:02 E   AssertionError: False is not true
01-Oct-2026 20:54:02 __________________________ imsmooth_test.test_region ___________________________
01-Oct-2026 20:54:02 test_task_imsmooth.py:98: in tearDown
01-Oct-2026 20:54:02     self.assertTrue(len(_tb.showcache()) == 0)
01-Oct-2026 20:54:02 E   AssertionError: False is not true
01-Oct-2026 20:54:02 __________________________ imsmooth_test.test_smooth ___________________________
01-Oct-2026 20:54:02 test_task_imsmooth.py:98: in tearDown
01-Oct-2026 20:54:02     self.assertTrue(len(_tb.showcache()) == 0)
01-Oct-2026 20:54:02 E   AssertionError: False is not true
01-Oct-2026 20:54:02 __________________________ imsmooth_test.test_stretch __________________________
01-Oct-2026 20:54:02 test_task_imsmooth.py:98: in tearDown
01-Oct-2026 20:54:02     self.assertTrue(len(_tb.showcache()) == 0)
01-Oct-2026 20:54:02 E   AssertionError: False is not true
01-Oct-2026 20:54:02 _________________________ imsmooth_test.test_targetres _________________________
01-Oct-2026 20:54:02 test_task_imsmooth.py:1060: in test_targetres
01-Oct-2026 20:54:02     run_imsmooth(
01-Oct-2026 20:54:02 test_task_imsmooth.py:57: in run_imsmooth
01-Oct-2026 20:54:02     return imsmooth(
01-Oct-2026 20:54:02 ../../../../venv/lib/python3.12/site-packages/casatasks/imsmooth.py:201: in __call__
01-Oct-2026 20:54:02     task_result = _imsmooth_t( _pc.document['imagename'], _pc.document['kernel'], _pc.document['major'], _pc.document['minor'], _pc.document['pa'], _pc.document['targetres'], _pc.document['kimage'], _pc.document['scale'], _pc.document['region'], _pc.document['box'], _pc.document['chans'], _pc.document['stokes'], _pc.document['mask'], _pc.document['outfile'], _pc.document['stretch'], _pc.document['overwrite'], _pc.document['beam'] )
01-Oct-2026 20:54:02                   ^^^^^^^^^^^^^^^^^^^^^^^^^^^^^^^^^^^^^^^^^^^^^^^^^^^^^^^^^^^^^^^^^^^^^^^^^^^^^^^^^^^^^^^^^^^^^^^^^^^^^^^^^^^^^^^^^^^^^^^^^^^^^^^^^^^^^^^^^^^^^^^^^^^^^^^^^^^^^^^^^^^^^^^^^^^^^^^^^^^^^^^^^^^^^^^^^^^^^^^^^^^^^^^^^^^^^^^^^^^^^^^^^^^^^^^^^^^^^^^^^^^^^^^^^^^^^^^^^^^^^^^^^^^^^^^^^^^^^^^^^^^^^^^^^^^^^^^^^^^^^^^^^^^^^^^^^^^^^^^^^^^^^^^^^^^^^^^^^^^^^^^^^^^^^^^^^^^^^^^^^^^^^^^^^^^^^^^^^^^^^^^^^^^^^^^^^^^^^^^^^^^^^^^^^^^^^^^^^
01-Oct-2026 20:54:02 ../../../../venv/lib/python3.12/site-packages/casatasks/private/callabletask.py:31: in wrapper
01-Oct-2026 20:54:02     retval = func(*args, **kwargs)
01-Oct-2026 20:54:02              ^^^^^^^^^^^^^^^^^^^^^
01-Oct-2026 20:54:02 ../../../../venv/lib/python3.12/site-packages/casatasks/private/task_imsmooth.py:170: in imsmooth
01-Oct-2026 20:54:02     print('reg shape', ib.shape())
01-Oct-2026 20:54:02                        ^^^^^^^^
01-Oct-2026 20:54:02 E   AttributeError: 'bool' object has no attribute 'shape'
01-Oct-2026 20:54:02 - generated xml file: /home/casatest/casa6/casatestutils/nosedir/xml/test_task_imsmooth/nose.xml -
01-Oct-2026 20:54:02 =========================== short test summary info ============================
01-Oct-2026 20:54:02 ERROR test_task_imsmooth.py::imsmooth_test::test_beam - AssertionError: False...
01-Oct-2026 20:54:02 ERROR test_task_imsmooth.py::imsmooth_test::test_commonbeam - AssertionError:...
01-Oct-2026 20:54:02 ERROR test_task_imsmooth.py::imsmooth_test::test_input - AssertionError: Fals...
01-Oct-2026 20:54:02 ERROR test_task_imsmooth.py::imsmooth_test::test_targetres - AssertionError: ...
01-Oct-2026 20:54:02 FAILED test_task_imsmooth.py::imsmooth_test::test_beam - RuntimeError: Cannot...
01-Oct-2026 20:54:02 FAILED test_task_imsmooth.py::imsmooth_test::test_commonbeam - RuntimeError: ...
01-Oct-2026 20:54:02 FAILED test_task_imsmooth.py::imsmooth_test::test_conserve_flux - AssertionEr...
01-Oct-2026 20:54:02 FAILED test_task_imsmooth.py::imsmooth_test::test_copying_of_input_mask - Ass...
01-Oct-2026 20:54:02 FAILED test_task_imsmooth.py::imsmooth_test::test_history - AssertionError: F...
01-Oct-2026 20:54:02 FAILED test_task_imsmooth.py::imsmooth_test::test_image_kernel - AssertionErr...
01-Oct-2026 20:54:02 FAILED test_task_imsmooth.py::imsmooth_test::test_input - RuntimeError: Excep...
01-Oct-2026 20:54:02 FAILED test_task_imsmooth.py::imsmooth_test::test_multibeam - AssertionError:...
01-Oct-2026 20:54:02 FAILED test_task_imsmooth.py::imsmooth_test::test_overwrite - AssertionError:...
01-Oct-2026 20:54:02 FAILED test_task_imsmooth.py::imsmooth_test::test_region - AssertionError: Fa...
01-Oct-2026 20:54:02 FAILED test_task_imsmooth.py::imsmooth_test::test_smooth - AssertionError: Fa...
01-Oct-2026 20:54:02 FAILED test_task_imsmooth.py::imsmooth_test::test_stretch - AssertionError: F...
01-Oct-2026 20:54:02 FAILED test_task_imsmooth.py::imsmooth_test::test_targetres - AttributeError:...
01-Oct-2026 20:54:02 =================== 13 failed, 1 warning, 4 errors in 7.18s ====================
01-Oct-2026 20:54:02 Namespace(list=False, verbose=False, dry_run=False, classes=None, file=None, mapfile=<_io.TextIOWrapper name='/home/casatest/casa6/casatestutils/casatestutils/component_to_test_map.json' mode='r' encoding='utf-8'>, branch=None, merge_target=None, pkg=None, work_dir=None, ncores=2, test_paths='/home/casatest/casa6/casatasks/tests/tasks,/home/casatest/casa6/casatasks/tests/scripts', test_list=None, test_config=None, test_group='imsmooth', pmode=None, bamboo=False, cachedir=None, ignore_list='test_casampi,test_task_msview,test_task_imview,test_task_plotms', run_skipped=False, only_skipped=False)
01-Oct-2026 20:54:02
01-Oct-2026 20:54:02 Operating system: Linux
01-Oct-2026 20:54:02
01-Oct-2026 20:54:02 Testing Components['imsmooth']
01-Oct-2026 20:54:02
01-Oct-2026 20:54:02 Arguments Sent Direct To Pytest :  []
01-Oct-2026 20:54:02
01-Oct-2026 20:54:02 Tests to Ignore:  ['test_casampi', 'test_task_msview', 'test_task_imview', 'test_task_plotms']
01-Oct-2026 20:54:02 Running 1 Test(s)
01-Oct-2026 20:54:02 Cleaning: /home/casatest/casa6/casatestutils/nosedir/
01-Oct-2026 20:54:02 Tests: ['/home/casatest/casa6/casatasks/tests/tasks/test_task_imsmooth.py']
01-Oct-2026 20:54:02
01-Oct-2026 20:54:02 Setting Working Directory: /home/casatest/casa6/casatestutils/nosedir/test_task_imsmooth/
01-Oct-2026 20:54:02 Test Directory: /home/casatest/casa6/casatestutils/nosedir/test_task_imsmooth
01-Oct-2026 20:54:02
01-Oct-2026 20:54:02 Running Command: pytest --junitxml=/home/casatest/casa6/casatestutils/nosedir/xml/test_task_imsmooth/nose.xml -s --disable-pytest-warnings --verbose -ra --tb=short /home/casatest/casa6/casatestutils/nosedir/test_task_imsmooth/
01-Oct-2026 20:54:03 total 79620
01-Oct-2026 20:54:03 -rw-r--r-- 1 casaci 15001  1936171 Oct  2 00:51 casatasks-6.7.7.8a14803.dev2-py3-none-any.whl
01-Oct-2026 20:54:03 -rw-r--r-- 1 casaci root     30404 Oct  2 00:54 casatasks_test.log
01-Oct-2026 20:54:03 -rw-r--r-- 1 casaci 15001   161131 Oct  2 00:51 casatestutils-6.7.7.8a14803.dev2-py3-none-any.whl
01-Oct-2026 20:54:03 -rw-r--r-- 1 casaci 15001 79373132 Oct  2 00:51 casatools-6.7.7.8a14803.dev2-cp312-cp312-manylinux_2_28_x86_64.whl
01-Oct-2026 20:54:03 -rw-r--r-- 1 casaci root       907 Oct  2 00:54 requirements.txt
01-Oct-2026 20:54:03 -rw-r--r-- 1 casaci root     13231 Oct  2 00:54 test_task_imsmooth.xml
01-Oct-2026 20:54:03 Finished task 'Test wheel' with result: Success
01-Oct-2026 20:54:03 Starting task 'Inject is_641' of type 'com.atlassian.bamboo.plugins.bamboo-variable-inject-plugin:inject'
01-Oct-2026 20:54:03 Injected variable bamboo.inject.is_641=False in LOCAL scope
01-Oct-2026 20:54:03 Finished task 'Inject is_641' with result: Success
01-Oct-2026 20:54:03
Substituting variable: ${bamboo.agentId} with 153550850
01-Oct-2026 20:54:03
Substituting variable: ${bamboo.agentId} with 153550850
01-Oct-2026 20:54:03
Substituting variable: ${bamboo.agentId} with 153550850
01-Oct-2026 20:54:03
Substituting variable: ${bamboo.agentId} with 153550850
01-Oct-2026 20:54:03 Starting task 'Tar work directory' of type 'com.atlassian.bamboo.plugins.scripttask:task.builder.script'
01-Oct-2026 20:54:03
Beginning to execute external process for build 'CASASPECS - Dev Test 3.12 - CAS-14803 - Test Tasks Many Linux 2.28 Py3.12 #2 (CASASPECS-DEVTESTPY312158-TTM228PY312-2)'
... running command line:
/opt/ci_workspace/casa/bamboo/agent2/temp/CASASPECS-DEVTESTPY312158-TTM228PY312-2-ScriptBuildTask-1207945748299212804.sh
... in: /opt/ci_workspace/casa/bamboo/agent2/xml-data/build-dir/CASASPECS-DEVTESTPY312158-TTM228PY312
01-Oct-2026 20:54:03 Package working directory
01-Oct-2026 20:54:03 nosedir/
01-Oct-2026 20:54:03 nosedir/test_task_imsmooth/
01-Oct-2026 20:54:03 nosedir/test_task_imsmooth/test_task_imsmooth.py
01-Oct-2026 20:54:03 nosedir/test_task_imsmooth/conftest.py
01-Oct-2026 20:54:03 nosedir/test_task_imsmooth/casa-20261002-005355.log
01-Oct-2026 20:54:03 nosedir/test_task_imsmooth/imsmooth_tbeam1.im/
01-Oct-2026 20:54:03 nosedir/test_task_imsmooth/imsmooth_smooth/
01-Oct-2026 20:54:03 nosedir/test_task_imsmooth/short_summary.log
01-Oct-2026 20:54:03 nosedir/test_task_imsmooth/imsmooth_cb1.im/
01-Oct-2026 20:54:03 nosedir/test_task_imsmooth/imsmooth_tres1x.im/
01-Oct-2026 20:54:03 nosedir/test_task_imsmooth/imsmooth_gxg_K.im/
01-Oct-2026 20:54:03 nosedir/test_task_imsmooth/imsmooth_gxg_cm-2.im/
01-Oct-2026 20:54:03 nosedir/test_task_imsmooth/imsmooth_orig.im/
01-Oct-2026 20:54:03 nosedir/test_task_imsmooth/imsmooth_mysub.im/
01-Oct-2026 20:54:03 nosedir/test_task_imsmooth/imsmooth_mysub.im/mask0/
01-Oct-2026 20:54:03 nosedir/test_task_imsmooth/imsmooth_conv.im/
01-Oct-2026 20:54:03 nosedir/test_task_imsmooth/imsmooth_conv.im/mask0/
01-Oct-2026 20:54:03 nosedir/test_task_imsmooth/imsmooth_zz.im/
01-Oct-2026 20:54:03 nosedir/test_task_imsmooth/imsmooth_zz_out.im/
01-Oct-2026 20:54:03 nosedir/test_task_imsmooth/imsmooth_point_c_bessel.im/
01-Oct-2026 20:54:03 nosedir/test_task_imsmooth/input_test1/
01-Oct-2026 20:54:03 nosedir/test_task_imsmooth/input_test1b/
01-Oct-2026 20:54:03 nosedir/test_task_imsmooth/input_test2/
01-Oct-2026 20:54:03 nosedir/test_task_imsmooth/input_test5/
01-Oct-2026 20:54:03 nosedir/test_task_imsmooth/input_test6/
01-Oct-2026 20:54:03 nosedir/test_task_imsmooth/input_test11/
01-Oct-2026 20:54:03 nosedir/test_task_imsmooth/test_image2dconvolver_multibeam.im/
01-Oct-2026 20:54:03 nosedir/test_task_imsmooth/imsmooth_convolve2d_multibeam.im/
01-Oct-2026 20:54:03 nosedir/test_task_imsmooth/subi0.im/
01-Oct-2026 20:54:03 nosedir/test_task_imsmooth/imsmooth_convolve0.im/
01-Oct-2026 20:54:03 nosedir/test_task_imsmooth/subi1.im/
01-Oct-2026 20:54:03 nosedir/test_task_imsmooth/imsmooth_convolve1.im/
01-Oct-2026 20:54:03 nosedir/test_task_imsmooth/subi2.im/
01-Oct-2026 20:54:03 nosedir/test_task_imsmooth/imsmooth_convolve2.im/
01-Oct-2026 20:54:03 nosedir/test_task_imsmooth/subi3.im/
01-Oct-2026 20:54:03 nosedir/test_task_imsmooth/imsmooth_convolve3.im/
01-Oct-2026 20:54:03 nosedir/test_task_imsmooth/subi4.im/
01-Oct-2026 20:54:03 nosedir/test_task_imsmooth/imsmooth_convolve4.im/
01-Oct-2026 20:54:03 nosedir/test_task_imsmooth/imsmooth_input_overwrite/
01-Oct-2026 20:54:03 nosedir/test_task_imsmooth/imsmooth_test_overwrite.im/
01-Oct-2026 20:54:03 nosedir/test_task_imsmooth/imsmooth_rgn.pointsrc.image/
01-Oct-2026 20:54:03 nosedir/test_task_imsmooth/rgn_test1/
01-Oct-2026 20:54:03 nosedir/test_task_imsmooth/rgn_test2/
01-Oct-2026 20:54:03 nosedir/test_task_imsmooth/rgn_test3/
01-Oct-2026 20:54:03 nosedir/test_task_imsmooth/rgn_test5/
01-Oct-2026 20:54:03 nosedir/test_task_imsmooth/smooth.pointsrc.image/
01-Oct-2026 20:54:03 nosedir/test_task_imsmooth/smooth_test1/
01-Oct-2026 20:54:03 nosedir/test_task_imsmooth/smooth_test2/
01-Oct-2026 20:54:03 nosedir/test_task_imsmooth/imsmooth_maskim/
01-Oct-2026 20:54:03 nosedir/test_task_imsmooth/imsmooth_tmp.im/
01-Oct-2026 20:54:03 nosedir/test_task_imsmooth/imsmooth_results.im/
01-Oct-2026 20:54:03 nosedir/test_task_imsmooth/imsmooth_results.im/mask0/
01-Oct-2026 20:54:03 nosedir/test_task_imsmooth/g192_a2.image/
01-Oct-2026 20:54:03 nosedir/test_task_imsmooth/g192_a2.image-2.rgn
01-Oct-2026 20:54:03 nosedir/test_task_imsmooth/imsmooth_targetres.fits
01-Oct-2026 20:54:03 nosedir/test_task_imsmooth/tiny.im/
01-Oct-2026 20:54:03 nosedir/test_task_imsmooth/imsmooth_tres1.im/
01-Oct-2026 20:54:03 nosedir/test_task_imsmooth/imsmooth_tres1J/
01-Oct-2026 20:54:03 nosedir/xml/
01-Oct-2026 20:54:03 nosedir/xml/test_task_imsmooth/
01-Oct-2026 20:54:03 nosedir/xml/test_task_imsmooth/nose.xml
01-Oct-2026 20:54:03 nosedir/summary_of_failed.log
01-Oct-2026 20:54:03 nosedir/requirements.txt
01-Oct-2026 20:54:03 total 79860
01-Oct-2026 20:54:03 -rw-r--r-- 1 casaci 15001  1936171 Oct  2 00:51 casatasks-6.7.7.8a14803.dev2-py3-none-any.whl
01-Oct-2026 20:54:03 -rw-r--r-- 1 casaci root     30404 Oct  2 00:54 casatasks_test.log
01-Oct-2026 20:54:03 -rw-r--r-- 1 casaci 15001   161131 Oct  2 00:51 casatestutils-6.7.7.8a14803.dev2-py3-none-any.whl
01-Oct-2026 20:54:03 -rw-r--r-- 1 casaci 15001 79373132 Oct  2 00:51 casatools-6.7.7.8a14803.dev2-cp312-cp312-manylinux_2_28_x86_64.whl
01-Oct-2026 20:54:03 -rw-r--r-- 1 casaci root       907 Oct  2 00:54 requirements.txt
01-Oct-2026 20:54:03 -rw-r--r-- 1 casaci root     13231 Oct  2 00:54 test_task_imsmooth.xml
01-Oct-2026 20:54:03 -rw-r--r-- 1 casaci root    244979 Oct  2 00:54 work-manylinux_228_casatasks-3.12.tar.gz
01-Oct-2026 20:54:03 Done packaging working directory
01-Oct-2026 20:54:03 Finished task 'Tar work directory' with result: Success
01-Oct-2026 20:54:03 Starting task 'Parse tests' of type 'com.atlassian.bamboo.plugins.testresultparser:task.testresultparser.junit'
01-Oct-2026 20:54:03 Parsing test results under /opt/ci_workspace/casa/bamboo/agent2/xml-data/build-dir/CASASPECS-DEVTESTPY312158-TTM228PY312...
01-Oct-2026 20:54:03 Failing task since 13 failing test cases were found.
01-Oct-2026 20:54:03 Finished task 'Parse tests' with result: Failed
01-Oct-2026 20:54:03 Running post build plugin 'Docker Container Cleanup'
01-Oct-2026 20:54:03
Beginning to execute external process for build 'CASASPECS - Dev Test 3.12 - CAS-14803 - Test Tasks Many Linux 2.28 Py3.12 #2 (CASASPECS-DEVTESTPY312158-TTM228PY312-2)'
... running command line:
/usr/bin/docker rm -f wheel-container-test_153550850
... in: /opt/ci_workspace/casa/bamboo/agent2/xml-data/build-dir/CASASPECS-DEVTESTPY312158-TTM228PY312
01-Oct-2026 20:54:06 wheel-container-test_153550850
01-Oct-2026 20:54:06 Running post build plugin 'NCover Results Collector'
01-Oct-2026 20:54:06 Running post build plugin 'Build Results Label Collector'
01-Oct-2026 20:54:06 Running post build plugin 'Clover Results Collector'
01-Oct-2026 20:54:06 Running post build plugin 'npm Cache Cleanup'
01-Oct-2026 20:54:06 Running post build plugin 'Artifact Copier'
01-Oct-2026 20:54:06 Publishing an artifact: Workdir
01-Oct-2026 20:54:06 Finished publishing of artifact Non required job artifact Http Compression On : [Workdir], patterns: [work*.tar.gz] anchored at: [wheeldirectory/] in 45.30 ms
01-Oct-2026 20:54:06 Publishing an artifact: XML Directories
01-Oct-2026 20:54:06 Finished publishing of artifact Non required job artifact Http Compression On : [XML Directories], patterns: [**/*.xml] anchored at: [wheeldirectory/] in 10.52 ms
01-Oct-2026 20:54:06 Publishing an artifact: casatasks_test.log
01-Oct-2026 20:54:06 Finished publishing of artifact Non required job artifact Http Compression On : [casatasks_test.log], patterns: [casatasks_test.log] anchored at: [wheeldirectory/] in 16.62 ms
01-Oct-2026 20:54:06 Publishing an artifact: requirements.txt
01-Oct-2026 20:54:06 Finished publishing of artifact Non required job artifact Http Compression On : [requirements.txt], patterns: [requirements.txt] anchored at: [wheeldirectory/] in 9.496 ms
01-Oct-2026 20:54:06 Finalising the build...
01-Oct-2026 20:54:06 Stopping timer.
01-Oct-2026 20:54:06 Build CASASPECS-DEVTESTPY312158-TTM228PY312-2 completed.
01-Oct-2026 20:54:06 Running on server: post build plugin 'Build Hanging Detection Configuration'
01-Oct-2026 20:54:06 Running on server: post build plugin 'NCover Results Collector'
01-Oct-2026 20:54:06 Running on server: post build plugin 'Build Labeller'
01-Oct-2026 20:54:06 Running on server: post build plugin 'Clover Delta Calculator'
01-Oct-2026 20:54:06 Running on server: post build plugin 'Maven Dependencies Postprocessor'
01-Oct-2026 20:54:06 All post build plugins have finished
01-Oct-2026 20:54:06 Generating build results summary...
01-Oct-2026 20:54:06 Saving build results to disk...
01-Oct-2026 20:54:06 Store variable context...
01-Oct-2026 20:54:06 Finished building CASASPECS-DEVTESTPY312158-TTM228PY312-2.