Build: #3 failed Manual run by CASA adm account
Build result summary
Details
- Completed
- Queue duration
- < 1 second
- Duration
- 32 minutes
- Labels
- None
- Revisions
-
- CASA6
-
fca4920fd5894af7a8bc45e3d5a8675122e76335
- OPEN-CASA-PKG
-
e5285e68467f01199807a1f1a978aec8a4781be7
- Total tests
- 1424
- Failing since
- #1 (Manual run by CASA adm account – )
- Fixed in
- #4 (Manual run by CASA adm account)
Tests
- 0 New failures
- 26 Existing failures
- 0 Fixed
- 10 Quarantined / skipped
Responsible
-
Kumar Golap
Automatically assigned
Configuration changes
Some of the jobs or stages referenced by this result no longer exist.
Tests
| Status | Test | Failing since | View job | Duration | |
|---|---|---|---|---|---|
|
test_task_imsmooth
imsmooth_test.test_stretch
|
Failing since build #1 (Manual run by CASA adm account) | Test Tasks macOS 15 Py3.12 | < 1 sec | ||
AssertionError: False is not true
test_task_imsmooth.py:98: in tearDown
self.assertTrue(len(_tb.showcache()) == 0)
E AssertionError: False is not true
|
|||||
|
test_task_imsmooth
imsmooth_test.test_input
|
Failing since build #1 (Manual run by CASA adm account) | Test Tasks macOS 15 Py3.12 | < 1 sec | ||
RuntimeError: Exception: Major axis must have angular units (pix is not)..
... thrown by void casacore::GaussianBeam::setMajorMinor(const Quantity &, const Quantity &) at File: ../../scimath/Mathematics/GaussianBeam.cc, line: 152
test_task_imsmooth.py:344: in test_input
results = imsmooth( tiny, major='2pix', minor='1pix', pa="deg", outfile=outfile)
^^^^^^^^^^^^^^^^^^^^^^^^^^^^^^^^^^^^^^^^^^^^^^^^^^^^^^^^^^^^^^^^^^^^^^
../../../../casa6testenv/lib/python3.12/site-packages/casatasks/imsmooth.py:201: in __call__
task_result = _imsmooth_t( _pc.document['imagename'], _pc.document['kernel'], _pc.document['major'], _pc.document['minor'], _pc.document['pa'], _pc.document['targetres'], _pc.document['kimage'], _pc.document['scale'], _pc.document['region'], _pc.document['box'], _pc.document['chans'], _pc.document['stokes'], _pc.document['mask'], _pc.document['outfile'], _pc.document['stretch'], _pc.document['overwrite'], _pc.document['beam'] )
^^^^^^^^^^^^^^^^^^^^^^^^^^^^^^^^^^^^^^^^^^^^^^^^^^^^^^^^^^^^^^^^^^^^^^^^^^^^^^^^^^^^^^^^^^^^^^^^^^^^^^^^^^^^^^^^^^^^^^^^^^^^^^^^^^^^^^^^^^^^^^^^^^^^^^^^^^^^^^^^^^^^^^^^^^^^^^^^^^^^^^^^^^^^^^^^^^^^^^^^^^^^^^^^^^^^^^^^^^^^^^^^^^^^^^^^^^^^^^^^^^^^^^^^^^^^^^^^^^^^^^^^^^^^^^^^^^^^^^^^^^^^^^^^^^^^^^^^^^^^^^^^^^^^^^^^^^^^^^^^^^^^^^^^^^^^^^^^^^^^^^^^^^^^^^^^^^^^^^^^^^^^^^^^^^^^^^^^^^^^^^^^^^^^^^^^^^^^^^^^^^^^^^^^^^^^^^^^^
(17 more lines...)
|
|||||
|
test_task_imsmooth
imsmooth_test.test_beam
|
Failing since build #1 (Manual run by CASA adm account) | Test Tasks macOS 15 Py3.12 | < 1 sec | ||
RuntimeError: Cannot understand source values
test_task_imsmooth.py:1238: in test_beam
x = run_imsmooth(
test_task_imsmooth.py:57: in run_imsmooth
return imsmooth(
../../../../casa6testenv/lib/python3.12/site-packages/casatasks/imsmooth.py:201: in __call__
task_result = _imsmooth_t( _pc.document['imagename'], _pc.document['kernel'], _pc.document['major'], _pc.document['minor'], _pc.document['pa'], _pc.document['targetres'], _pc.document['kimage'], _pc.document['scale'], _pc.document['region'], _pc.document['box'], _pc.document['chans'], _pc.document['stokes'], _pc.document['mask'], _pc.document['outfile'], _pc.document['stretch'], _pc.document['overwrite'], _pc.document['beam'] )
^^^^^^^^^^^^^^^^^^^^^^^^^^^^^^^^^^^^^^^^^^^^^^^^^^^^^^^^^^^^^^^^^^^^^^^^^^^^^^^^^^^^^^^^^^^^^^^^^^^^^^^^^^^^^^^^^^^^^^^^^^^^^^^^^^^^^^^^^^^^^^^^^^^^^^^^^^^^^^^^^^^^^^^^^^^^^^^^^^^^^^^^^^^^^^^^^^^^^^^^^^^^^^^^^^^^^^^^^^^^^^^^^^^^^^^^^^^^^^^^^^^^^^^^^^^^^^^^^^^^^^^^^^^^^^^^^^^^^^^^^^^^^^^^^^^^^^^^^^^^^^^^^^^^^^^^^^^^^^^^^^^^^^^^^^^^^^^^^^^^^^^^^^^^^^^^^^^^^^^^^^^^^^^^^^^^^^^^^^^^^^^^^^^^^^^^^^^^^^^^^^^^^^^^^^^^^^^^^
(16 more lines...)
|
|||||
|
test_task_imsmooth
imsmooth_test.test_conserve_flux
|
Failing since build #1 (Manual run by CASA adm account) | Test Tasks macOS 15 Py3.12 | < 1 sec | ||
AssertionError: False is not true
test_task_imsmooth.py:98: in tearDown
self.assertTrue(len(_tb.showcache()) == 0)
E AssertionError: False is not true
|
|||||
|
test_task_imsmooth
imsmooth_test.test_multibeam
|
Failing since build #1 (Manual run by CASA adm account) | Test Tasks macOS 15 Py3.12 | < 1 sec | ||
AssertionError: False is not true
test_task_imsmooth.py:98: in tearDown
self.assertTrue(len(_tb.showcache()) == 0)
E AssertionError: False is not true
|
|||||
|
test_task_imsmooth
imsmooth_test.test_targetres
|
Failing since build #1 (Manual run by CASA adm account) | Test Tasks macOS 15 Py3.12 | < 1 sec | ||
AttributeError: 'bool' object has no attribute 'shape'
test_task_imsmooth.py:1060: in test_targetres
run_imsmooth(
test_task_imsmooth.py:57: in run_imsmooth
return imsmooth(
../../../../casa6testenv/lib/python3.12/site-packages/casatasks/imsmooth.py:201: in __call__
task_result = _imsmooth_t( _pc.document['imagename'], _pc.document['kernel'], _pc.document['major'], _pc.document['minor'], _pc.document['pa'], _pc.document['targetres'], _pc.document['kimage'], _pc.document['scale'], _pc.document['region'], _pc.document['box'], _pc.document['chans'], _pc.document['stokes'], _pc.document['mask'], _pc.document['outfile'], _pc.document['stretch'], _pc.document['overwrite'], _pc.document['beam'] )
^^^^^^^^^^^^^^^^^^^^^^^^^^^^^^^^^^^^^^^^^^^^^^^^^^^^^^^^^^^^^^^^^^^^^^^^^^^^^^^^^^^^^^^^^^^^^^^^^^^^^^^^^^^^^^^^^^^^^^^^^^^^^^^^^^^^^^^^^^^^^^^^^^^^^^^^^^^^^^^^^^^^^^^^^^^^^^^^^^^^^^^^^^^^^^^^^^^^^^^^^^^^^^^^^^^^^^^^^^^^^^^^^^^^^^^^^^^^^^^^^^^^^^^^^^^^^^^^^^^^^^^^^^^^^^^^^^^^^^^^^^^^^^^^^^^^^^^^^^^^^^^^^^^^^^^^^^^^^^^^^^^^^^^^^^^^^^^^^^^^^^^^^^^^^^^^^^^^^^^^^^^^^^^^^^^^^^^^^^^^^^^^^^^^^^^^^^^^^^^^^^^^^^^^^^^^^^^^^
(7 more lines...)
|
|||||
|
test_task_imsmooth
imsmooth_test.test_region
|
Failing since build #1 (Manual run by CASA adm account) | Test Tasks macOS 15 Py3.12 | < 1 sec | ||
AssertionError: False is not true
test_task_imsmooth.py:98: in tearDown
self.assertTrue(len(_tb.showcache()) == 0)
E AssertionError: False is not true
|
|||||
|
test_task_imsmooth
imsmooth_test.test_copying_of_input_mask
|
Failing since build #1 (Manual run by CASA adm account) | Test Tasks macOS 15 Py3.12 | < 1 sec | ||
AssertionError: False is not true
test_task_imsmooth.py:98: in tearDown
self.assertTrue(len(_tb.showcache()) == 0)
E AssertionError: False is not true
|
|||||
|
test_task_imsmooth
imsmooth_test.test_image_kernel
|
Failing since build #1 (Manual run by CASA adm account) | Test Tasks macOS 15 Py3.12 | < 1 sec | ||
AssertionError: False is not true
test_task_imsmooth.py:98: in tearDown
self.assertTrue(len(_tb.showcache()) == 0)
E AssertionError: False is not true
|
|||||
|
test_task_imsmooth
imsmooth_test.test_history
|
Failing since build #1 (Manual run by CASA adm account) | Test Tasks macOS 15 Py3.12 | < 1 sec | ||
AssertionError: False is not true
test_task_imsmooth.py:98: in tearDown
self.assertTrue(len(_tb.showcache()) == 0)
E AssertionError: False is not true
|
|||||
|
test_task_imsmooth
imsmooth_test.test_commonbeam
|
Failing since build #1 (Manual run by CASA adm account) | Test Tasks macOS 15 Py3.12 | < 1 sec | ||
RuntimeError: Cannot understand source values
test_task_imsmooth.py:1316: in test_commonbeam
imsmooth(
../../../../casa6testenv/lib/python3.12/site-packages/casatasks/imsmooth.py:201: in __call__
task_result = _imsmooth_t( _pc.document['imagename'], _pc.document['kernel'], _pc.document['major'], _pc.document['minor'], _pc.document['pa'], _pc.document['targetres'], _pc.document['kimage'], _pc.document['scale'], _pc.document['region'], _pc.document['box'], _pc.document['chans'], _pc.document['stokes'], _pc.document['mask'], _pc.document['outfile'], _pc.document['stretch'], _pc.document['overwrite'], _pc.document['beam'] )
^^^^^^^^^^^^^^^^^^^^^^^^^^^^^^^^^^^^^^^^^^^^^^^^^^^^^^^^^^^^^^^^^^^^^^^^^^^^^^^^^^^^^^^^^^^^^^^^^^^^^^^^^^^^^^^^^^^^^^^^^^^^^^^^^^^^^^^^^^^^^^^^^^^^^^^^^^^^^^^^^^^^^^^^^^^^^^^^^^^^^^^^^^^^^^^^^^^^^^^^^^^^^^^^^^^^^^^^^^^^^^^^^^^^^^^^^^^^^^^^^^^^^^^^^^^^^^^^^^^^^^^^^^^^^^^^^^^^^^^^^^^^^^^^^^^^^^^^^^^^^^^^^^^^^^^^^^^^^^^^^^^^^^^^^^^^^^^^^^^^^^^^^^^^^^^^^^^^^^^^^^^^^^^^^^^^^^^^^^^^^^^^^^^^^^^^^^^^^^^^^^^^^^^^^^^^^^^^^
../../../../casa6testenv/lib/python3.12/site-packages/casatasks/private/callabletask.py:31: in wrapper
retval = func(*args, **kwargs)
(14 more lines...)
|
|||||
|
test_task_imsmooth
imsmooth_test.test_overwrite
|
Failing since build #1 (Manual run by CASA adm account) | Test Tasks macOS 15 Py3.12 | < 1 sec | ||
AssertionError: False is not true
test_task_imsmooth.py:98: in tearDown
self.assertTrue(len(_tb.showcache()) == 0)
E AssertionError: False is not true
|
|||||
|
test_task_imsmooth
imsmooth_test.test_smooth
|
Failing since build #1 (Manual run by CASA adm account) | Test Tasks macOS 15 Py3.12 | < 1 sec | ||
AssertionError: False is not true
test_task_imsmooth.py:98: in tearDown
self.assertTrue(len(_tb.showcache()) == 0)
E AssertionError: False is not true
|
|||||
|
test_task_imsmooth
imsmooth_test.test_history
|
Failing since build #1 (Manual run by CASA adm account) | Test Tasks Many Linux 2.28 Py3.12 | < 1 sec | ||
AssertionError: False is not true
test_task_imsmooth.py:98: in tearDown
self.assertTrue(len(_tb.showcache()) == 0)
E AssertionError: False is not true
|
|||||
|
test_task_imsmooth
imsmooth_test.test_commonbeam
|
Failing since build #1 (Manual run by CASA adm account) | Test Tasks Many Linux 2.28 Py3.12 | < 1 sec | ||
RuntimeError: Cannot understand source values
test_task_imsmooth.py:1316: in test_commonbeam
imsmooth(
../../../../venv/lib/python3.12/site-packages/casatasks/imsmooth.py:201: in __call__
task_result = _imsmooth_t( _pc.document['imagename'], _pc.document['kernel'], _pc.document['major'], _pc.document['minor'], _pc.document['pa'], _pc.document['targetres'], _pc.document['kimage'], _pc.document['scale'], _pc.document['region'], _pc.document['box'], _pc.document['chans'], _pc.document['stokes'], _pc.document['mask'], _pc.document['outfile'], _pc.document['stretch'], _pc.document['overwrite'], _pc.document['beam'] )
^^^^^^^^^^^^^^^^^^^^^^^^^^^^^^^^^^^^^^^^^^^^^^^^^^^^^^^^^^^^^^^^^^^^^^^^^^^^^^^^^^^^^^^^^^^^^^^^^^^^^^^^^^^^^^^^^^^^^^^^^^^^^^^^^^^^^^^^^^^^^^^^^^^^^^^^^^^^^^^^^^^^^^^^^^^^^^^^^^^^^^^^^^^^^^^^^^^^^^^^^^^^^^^^^^^^^^^^^^^^^^^^^^^^^^^^^^^^^^^^^^^^^^^^^^^^^^^^^^^^^^^^^^^^^^^^^^^^^^^^^^^^^^^^^^^^^^^^^^^^^^^^^^^^^^^^^^^^^^^^^^^^^^^^^^^^^^^^^^^^^^^^^^^^^^^^^^^^^^^^^^^^^^^^^^^^^^^^^^^^^^^^^^^^^^^^^^^^^^^^^^^^^^^^^^^^^^^^^
../../../../venv/lib/python3.12/site-packages/casatasks/private/callabletask.py:31: in wrapper
retval = func(*args, **kwargs)
(14 more lines...)
|
|||||
|
test_task_imsmooth
imsmooth_test.test_conserve_flux
|
Failing since build #1 (Manual run by CASA adm account) | Test Tasks Many Linux 2.28 Py3.12 | < 1 sec | ||
AssertionError: False is not true
test_task_imsmooth.py:98: in tearDown
self.assertTrue(len(_tb.showcache()) == 0)
E AssertionError: False is not true
|
|||||
|
test_task_imsmooth
imsmooth_test.test_overwrite
|
Failing since build #1 (Manual run by CASA adm account) | Test Tasks Many Linux 2.28 Py3.12 | < 1 sec | ||
AssertionError: False is not true
test_task_imsmooth.py:98: in tearDown
self.assertTrue(len(_tb.showcache()) == 0)
E AssertionError: False is not true
|
|||||
|
test_task_imsmooth
imsmooth_test.test_multibeam
|
Failing since build #1 (Manual run by CASA adm account) | Test Tasks Many Linux 2.28 Py3.12 | < 1 sec | ||
AssertionError: False is not true
test_task_imsmooth.py:98: in tearDown
self.assertTrue(len(_tb.showcache()) == 0)
E AssertionError: False is not true
|
|||||
|
test_task_imsmooth
imsmooth_test.test_region
|
Failing since build #1 (Manual run by CASA adm account) | Test Tasks Many Linux 2.28 Py3.12 | < 1 sec | ||
AssertionError: False is not true
test_task_imsmooth.py:98: in tearDown
self.assertTrue(len(_tb.showcache()) == 0)
E AssertionError: False is not true
|
|||||
|
test_task_imsmooth
imsmooth_test.test_stretch
|
Failing since build #1 (Manual run by CASA adm account) | Test Tasks Many Linux 2.28 Py3.12 | < 1 sec | ||
AssertionError: False is not true
test_task_imsmooth.py:98: in tearDown
self.assertTrue(len(_tb.showcache()) == 0)
E AssertionError: False is not true
|
|||||
|
test_task_imsmooth
imsmooth_test.test_beam
|
Failing since build #1 (Manual run by CASA adm account) | Test Tasks Many Linux 2.28 Py3.12 | < 1 sec | ||
RuntimeError: Cannot understand source values
test_task_imsmooth.py:1238: in test_beam
x = run_imsmooth(
test_task_imsmooth.py:57: in run_imsmooth
return imsmooth(
../../../../venv/lib/python3.12/site-packages/casatasks/imsmooth.py:201: in __call__
task_result = _imsmooth_t( _pc.document['imagename'], _pc.document['kernel'], _pc.document['major'], _pc.document['minor'], _pc.document['pa'], _pc.document['targetres'], _pc.document['kimage'], _pc.document['scale'], _pc.document['region'], _pc.document['box'], _pc.document['chans'], _pc.document['stokes'], _pc.document['mask'], _pc.document['outfile'], _pc.document['stretch'], _pc.document['overwrite'], _pc.document['beam'] )
^^^^^^^^^^^^^^^^^^^^^^^^^^^^^^^^^^^^^^^^^^^^^^^^^^^^^^^^^^^^^^^^^^^^^^^^^^^^^^^^^^^^^^^^^^^^^^^^^^^^^^^^^^^^^^^^^^^^^^^^^^^^^^^^^^^^^^^^^^^^^^^^^^^^^^^^^^^^^^^^^^^^^^^^^^^^^^^^^^^^^^^^^^^^^^^^^^^^^^^^^^^^^^^^^^^^^^^^^^^^^^^^^^^^^^^^^^^^^^^^^^^^^^^^^^^^^^^^^^^^^^^^^^^^^^^^^^^^^^^^^^^^^^^^^^^^^^^^^^^^^^^^^^^^^^^^^^^^^^^^^^^^^^^^^^^^^^^^^^^^^^^^^^^^^^^^^^^^^^^^^^^^^^^^^^^^^^^^^^^^^^^^^^^^^^^^^^^^^^^^^^^^^^^^^^^^^^^^^
(16 more lines...)
|
|||||
|
test_task_imsmooth
imsmooth_test.test_targetres
|
Failing since build #1 (Manual run by CASA adm account) | Test Tasks Many Linux 2.28 Py3.12 | < 1 sec | ||
AttributeError: 'bool' object has no attribute 'shape'
test_task_imsmooth.py:1060: in test_targetres
run_imsmooth(
test_task_imsmooth.py:57: in run_imsmooth
return imsmooth(
../../../../venv/lib/python3.12/site-packages/casatasks/imsmooth.py:201: in __call__
task_result = _imsmooth_t( _pc.document['imagename'], _pc.document['kernel'], _pc.document['major'], _pc.document['minor'], _pc.document['pa'], _pc.document['targetres'], _pc.document['kimage'], _pc.document['scale'], _pc.document['region'], _pc.document['box'], _pc.document['chans'], _pc.document['stokes'], _pc.document['mask'], _pc.document['outfile'], _pc.document['stretch'], _pc.document['overwrite'], _pc.document['beam'] )
^^^^^^^^^^^^^^^^^^^^^^^^^^^^^^^^^^^^^^^^^^^^^^^^^^^^^^^^^^^^^^^^^^^^^^^^^^^^^^^^^^^^^^^^^^^^^^^^^^^^^^^^^^^^^^^^^^^^^^^^^^^^^^^^^^^^^^^^^^^^^^^^^^^^^^^^^^^^^^^^^^^^^^^^^^^^^^^^^^^^^^^^^^^^^^^^^^^^^^^^^^^^^^^^^^^^^^^^^^^^^^^^^^^^^^^^^^^^^^^^^^^^^^^^^^^^^^^^^^^^^^^^^^^^^^^^^^^^^^^^^^^^^^^^^^^^^^^^^^^^^^^^^^^^^^^^^^^^^^^^^^^^^^^^^^^^^^^^^^^^^^^^^^^^^^^^^^^^^^^^^^^^^^^^^^^^^^^^^^^^^^^^^^^^^^^^^^^^^^^^^^^^^^^^^^^^^^^^^
(7 more lines...)
|
|||||
|
test_task_imsmooth
imsmooth_test.test_smooth
|
Failing since build #1 (Manual run by CASA adm account) | Test Tasks Many Linux 2.28 Py3.12 | 3 secs | ||
AssertionError: False is not true
test_task_imsmooth.py:98: in tearDown
self.assertTrue(len(_tb.showcache()) == 0)
E AssertionError: False is not true
|
|||||
|
test_task_imsmooth
imsmooth_test.test_copying_of_input_mask
|
Failing since build #1 (Manual run by CASA adm account) | Test Tasks Many Linux 2.28 Py3.12 | < 1 sec | ||
AssertionError: False is not true
test_task_imsmooth.py:98: in tearDown
self.assertTrue(len(_tb.showcache()) == 0)
E AssertionError: False is not true
|
|||||
|
test_task_imsmooth
imsmooth_test.test_input
|
Failing since build #1 (Manual run by CASA adm account) | Test Tasks Many Linux 2.28 Py3.12 | < 1 sec | ||
RuntimeError: Exception: Major axis must have angular units (pix is not)..
... thrown by void casacore::GaussianBeam::setMajorMinor(const Quantity&, const Quantity&) at File: /source/casa6/casatools/casacore/scimath/Mathematics/GaussianBeam.cc, line: 148
test_task_imsmooth.py:344: in test_input
results = imsmooth( tiny, major='2pix', minor='1pix', pa="deg", outfile=outfile)
^^^^^^^^^^^^^^^^^^^^^^^^^^^^^^^^^^^^^^^^^^^^^^^^^^^^^^^^^^^^^^^^^^^^^^
../../../../venv/lib/python3.12/site-packages/casatasks/imsmooth.py:201: in __call__
task_result = _imsmooth_t( _pc.document['imagename'], _pc.document['kernel'], _pc.document['major'], _pc.document['minor'], _pc.document['pa'], _pc.document['targetres'], _pc.document['kimage'], _pc.document['scale'], _pc.document['region'], _pc.document['box'], _pc.document['chans'], _pc.document['stokes'], _pc.document['mask'], _pc.document['outfile'], _pc.document['stretch'], _pc.document['overwrite'], _pc.document['beam'] )
^^^^^^^^^^^^^^^^^^^^^^^^^^^^^^^^^^^^^^^^^^^^^^^^^^^^^^^^^^^^^^^^^^^^^^^^^^^^^^^^^^^^^^^^^^^^^^^^^^^^^^^^^^^^^^^^^^^^^^^^^^^^^^^^^^^^^^^^^^^^^^^^^^^^^^^^^^^^^^^^^^^^^^^^^^^^^^^^^^^^^^^^^^^^^^^^^^^^^^^^^^^^^^^^^^^^^^^^^^^^^^^^^^^^^^^^^^^^^^^^^^^^^^^^^^^^^^^^^^^^^^^^^^^^^^^^^^^^^^^^^^^^^^^^^^^^^^^^^^^^^^^^^^^^^^^^^^^^^^^^^^^^^^^^^^^^^^^^^^^^^^^^^^^^^^^^^^^^^^^^^^^^^^^^^^^^^^^^^^^^^^^^^^^^^^^^^^^^^^^^^^^^^^^^^^^^^^^^^
(17 more lines...)
|
|||||
|
test_task_imsmooth
imsmooth_test.test_image_kernel
|
Failing since build #1 (Manual run by CASA adm account) | Test Tasks Many Linux 2.28 Py3.12 | < 1 sec | ||
AssertionError: False is not true
test_task_imsmooth.py:98: in tearDown
self.assertTrue(len(_tb.showcache()) == 0)
E AssertionError: False is not true
|
|||||