Build: #1 failed Manual run by CASA adm account

Build result summary

Details

Completed
Queue duration
2 seconds
Duration
14 minutes
Labels
None
Revisions
CASA6
fca4920fd5894af7a8bc45e3d5a8675122e76335
OPEN-CASA-PKG
e5285e68467f01199807a1f1a978aec8a4781be7
Total tests
1424
Fixed in
#4 (Manual run by CASA adm account)

Tests

Responsible

  • Kumar Golap Kumar Golap Automatically assigned

Code commits

CASA6
Author Commit Message Commit date
Kumar Golap Kumar Golap fca4920fd5894af7a8bc45e3d5a8675122e76335 added a C++ unit test for Image2DConvolver::convByMultiplyGaussInFT

Configuration changes

Some of the jobs or stages referenced by this result no longer exist.

Restarting failed/incomplete builds only is not possible as some of the affected jobs no longer exist.

Tests

New test failures 26
Status Test View job Duration
Collapse Failed test_task_imsmooth imsmooth_test.test_targetres
Test Tasks macOS 15 Py3.12 < 1 sec
AttributeError: 'bool' object has no attribute 'shape'
test_task_imsmooth.py:1060: in test_targetres
    run_imsmooth(
test_task_imsmooth.py:57: in run_imsmooth
    return imsmooth(
../../../../casa6testenv/lib/python3.12/site-packages/casatasks/imsmooth.py:201: in __call__
    task_result = _imsmooth_t( _pc.document['imagename'], _pc.document['kernel'], _pc.document['major'], _pc.document['minor'], _pc.document['pa'], _pc.document['targetres'], _pc.document['kimage'], _pc.document['scale'], _pc.document['region'], _pc.document['box'], _pc.document['chans'], _pc.document['stokes'], _pc.document['mask'], _pc.document['outfile'], _pc.document['stretch'], _pc.document['overwrite'], _pc.document['beam'] )
                  ^^^^^^^^^^^^^^^^^^^^^^^^^^^^^^^^^^^^^^^^^^^^^^^^^^^^^^^^^^^^^^^^^^^^^^^^^^^^^^^^^^^^^^^^^^^^^^^^^^^^^^^^^^^^^^^^^^^^^^^^^^^^^^^^^^^^^^^^^^^^^^^^^^^^^^^^^^^^^^^^^^^^^^^^^^^^^^^^^^^^^^^^^^^^^^^^^^^^^^^^^^^^^^^^^^^^^^^^^^^^^^^^^^^^^^^^^^^^^^^^^^^^^^^^^^^^^^^^^^^^^^^^^^^^^^^^^^^^^^^^^^^^^^^^^^^^^^^^^^^^^^^^^^^^^^^^^^^^^^^^^^^^^^^^^^^^^^^^^^^^^^^^^^^^^^^^^^^^^^^^^^^^^^^^^^^^^^^^^^^^^^^^^^^^^^^^^^^^^^^^^^^^^^^^^^^^^^^^^
(7 more lines...)
Collapse Failed test_task_imsmooth imsmooth_test.test_overwrite
Test Tasks macOS 15 Py3.12 < 1 sec
AssertionError: False is not true
test_task_imsmooth.py:98: in tearDown
    self.assertTrue(len(_tb.showcache()) == 0)
E   AssertionError: False is not true
Collapse Failed test_task_imsmooth imsmooth_test.test_copying_of_input_mask
Test Tasks macOS 15 Py3.12 < 1 sec
AssertionError: False is not true
test_task_imsmooth.py:98: in tearDown
    self.assertTrue(len(_tb.showcache()) == 0)
E   AssertionError: False is not true
Collapse Failed test_task_imsmooth imsmooth_test.test_smooth
Test Tasks macOS 15 Py3.12 1 sec
AssertionError: False is not true
test_task_imsmooth.py:98: in tearDown
    self.assertTrue(len(_tb.showcache()) == 0)
E   AssertionError: False is not true
Collapse Failed test_task_imsmooth imsmooth_test.test_image_kernel
Test Tasks macOS 15 Py3.12 < 1 sec
AssertionError: False is not true
test_task_imsmooth.py:98: in tearDown
    self.assertTrue(len(_tb.showcache()) == 0)
E   AssertionError: False is not true
Collapse Failed test_task_imsmooth imsmooth_test.test_history
Test Tasks macOS 15 Py3.12 < 1 sec
AssertionError: False is not true
test_task_imsmooth.py:98: in tearDown
    self.assertTrue(len(_tb.showcache()) == 0)
E   AssertionError: False is not true
Collapse Failed test_task_imsmooth imsmooth_test.test_region
Test Tasks macOS 15 Py3.12 < 1 sec
AssertionError: False is not true
test_task_imsmooth.py:98: in tearDown
    self.assertTrue(len(_tb.showcache()) == 0)
E   AssertionError: False is not true
Collapse Failed test_task_imsmooth imsmooth_test.test_stretch
Test Tasks macOS 15 Py3.12 < 1 sec
AssertionError: False is not true
test_task_imsmooth.py:98: in tearDown
    self.assertTrue(len(_tb.showcache()) == 0)
E   AssertionError: False is not true
Collapse Failed test_task_imsmooth imsmooth_test.test_commonbeam
Test Tasks macOS 15 Py3.12 < 1 sec
RuntimeError: Cannot understand source values
test_task_imsmooth.py:1316: in test_commonbeam
    imsmooth(
../../../../casa6testenv/lib/python3.12/site-packages/casatasks/imsmooth.py:201: in __call__
    task_result = _imsmooth_t( _pc.document['imagename'], _pc.document['kernel'], _pc.document['major'], _pc.document['minor'], _pc.document['pa'], _pc.document['targetres'], _pc.document['kimage'], _pc.document['scale'], _pc.document['region'], _pc.document['box'], _pc.document['chans'], _pc.document['stokes'], _pc.document['mask'], _pc.document['outfile'], _pc.document['stretch'], _pc.document['overwrite'], _pc.document['beam'] )
                  ^^^^^^^^^^^^^^^^^^^^^^^^^^^^^^^^^^^^^^^^^^^^^^^^^^^^^^^^^^^^^^^^^^^^^^^^^^^^^^^^^^^^^^^^^^^^^^^^^^^^^^^^^^^^^^^^^^^^^^^^^^^^^^^^^^^^^^^^^^^^^^^^^^^^^^^^^^^^^^^^^^^^^^^^^^^^^^^^^^^^^^^^^^^^^^^^^^^^^^^^^^^^^^^^^^^^^^^^^^^^^^^^^^^^^^^^^^^^^^^^^^^^^^^^^^^^^^^^^^^^^^^^^^^^^^^^^^^^^^^^^^^^^^^^^^^^^^^^^^^^^^^^^^^^^^^^^^^^^^^^^^^^^^^^^^^^^^^^^^^^^^^^^^^^^^^^^^^^^^^^^^^^^^^^^^^^^^^^^^^^^^^^^^^^^^^^^^^^^^^^^^^^^^^^^^^^^^^^^
../../../../casa6testenv/lib/python3.12/site-packages/casatasks/private/callabletask.py:31: in wrapper
    retval = func(*args, **kwargs)
(14 more lines...)
Collapse Failed test_task_imsmooth imsmooth_test.test_multibeam
Test Tasks macOS 15 Py3.12 < 1 sec
AssertionError: False is not true
test_task_imsmooth.py:98: in tearDown
    self.assertTrue(len(_tb.showcache()) == 0)
E   AssertionError: False is not true
Collapse Failed test_task_imsmooth imsmooth_test.test_conserve_flux
Test Tasks macOS 15 Py3.12 < 1 sec
AssertionError: False is not true
test_task_imsmooth.py:98: in tearDown
    self.assertTrue(len(_tb.showcache()) == 0)
E   AssertionError: False is not true
Collapse Failed test_task_imsmooth imsmooth_test.test_beam
Test Tasks macOS 15 Py3.12 < 1 sec
RuntimeError: Cannot understand source values
test_task_imsmooth.py:1238: in test_beam
    x = run_imsmooth(
test_task_imsmooth.py:57: in run_imsmooth
    return imsmooth(
../../../../casa6testenv/lib/python3.12/site-packages/casatasks/imsmooth.py:201: in __call__
    task_result = _imsmooth_t( _pc.document['imagename'], _pc.document['kernel'], _pc.document['major'], _pc.document['minor'], _pc.document['pa'], _pc.document['targetres'], _pc.document['kimage'], _pc.document['scale'], _pc.document['region'], _pc.document['box'], _pc.document['chans'], _pc.document['stokes'], _pc.document['mask'], _pc.document['outfile'], _pc.document['stretch'], _pc.document['overwrite'], _pc.document['beam'] )
                  ^^^^^^^^^^^^^^^^^^^^^^^^^^^^^^^^^^^^^^^^^^^^^^^^^^^^^^^^^^^^^^^^^^^^^^^^^^^^^^^^^^^^^^^^^^^^^^^^^^^^^^^^^^^^^^^^^^^^^^^^^^^^^^^^^^^^^^^^^^^^^^^^^^^^^^^^^^^^^^^^^^^^^^^^^^^^^^^^^^^^^^^^^^^^^^^^^^^^^^^^^^^^^^^^^^^^^^^^^^^^^^^^^^^^^^^^^^^^^^^^^^^^^^^^^^^^^^^^^^^^^^^^^^^^^^^^^^^^^^^^^^^^^^^^^^^^^^^^^^^^^^^^^^^^^^^^^^^^^^^^^^^^^^^^^^^^^^^^^^^^^^^^^^^^^^^^^^^^^^^^^^^^^^^^^^^^^^^^^^^^^^^^^^^^^^^^^^^^^^^^^^^^^^^^^^^^^^^^^
(16 more lines...)
Collapse Failed test_task_imsmooth imsmooth_test.test_input
Test Tasks macOS 15 Py3.12 < 1 sec
RuntimeError: Exception: Major axis must have angular units (pix is not)..
... thrown by void casacore::GaussianBeam::setMajorMinor(const Quantity &, const Quantity &) at File: ../../scimath/Mathematics/GaussianBeam.cc, line: 152
test_task_imsmooth.py:344: in test_input
    results = imsmooth( tiny, major='2pix', minor='1pix', pa="deg", outfile=outfile)
              ^^^^^^^^^^^^^^^^^^^^^^^^^^^^^^^^^^^^^^^^^^^^^^^^^^^^^^^^^^^^^^^^^^^^^^
../../../../casa6testenv/lib/python3.12/site-packages/casatasks/imsmooth.py:201: in __call__
    task_result = _imsmooth_t( _pc.document['imagename'], _pc.document['kernel'], _pc.document['major'], _pc.document['minor'], _pc.document['pa'], _pc.document['targetres'], _pc.document['kimage'], _pc.document['scale'], _pc.document['region'], _pc.document['box'], _pc.document['chans'], _pc.document['stokes'], _pc.document['mask'], _pc.document['outfile'], _pc.document['stretch'], _pc.document['overwrite'], _pc.document['beam'] )
                  ^^^^^^^^^^^^^^^^^^^^^^^^^^^^^^^^^^^^^^^^^^^^^^^^^^^^^^^^^^^^^^^^^^^^^^^^^^^^^^^^^^^^^^^^^^^^^^^^^^^^^^^^^^^^^^^^^^^^^^^^^^^^^^^^^^^^^^^^^^^^^^^^^^^^^^^^^^^^^^^^^^^^^^^^^^^^^^^^^^^^^^^^^^^^^^^^^^^^^^^^^^^^^^^^^^^^^^^^^^^^^^^^^^^^^^^^^^^^^^^^^^^^^^^^^^^^^^^^^^^^^^^^^^^^^^^^^^^^^^^^^^^^^^^^^^^^^^^^^^^^^^^^^^^^^^^^^^^^^^^^^^^^^^^^^^^^^^^^^^^^^^^^^^^^^^^^^^^^^^^^^^^^^^^^^^^^^^^^^^^^^^^^^^^^^^^^^^^^^^^^^^^^^^^^^^^^^^^^^
(17 more lines...)
Collapse Failed test_task_imsmooth imsmooth_test.test_copying_of_input_mask
Test Tasks Many Linux 2.28 Py3.12 < 1 sec
AssertionError: False is not true
test_task_imsmooth.py:98: in tearDown
    self.assertTrue(len(_tb.showcache()) == 0)
E   AssertionError: False is not true
Collapse Failed test_task_imsmooth imsmooth_test.test_region
Test Tasks Many Linux 2.28 Py3.12 < 1 sec
AssertionError: False is not true
test_task_imsmooth.py:98: in tearDown
    self.assertTrue(len(_tb.showcache()) == 0)
E   AssertionError: False is not true
Collapse Failed test_task_imsmooth imsmooth_test.test_beam
Test Tasks Many Linux 2.28 Py3.12 < 1 sec
RuntimeError: Cannot understand source values
test_task_imsmooth.py:1238: in test_beam
    x = run_imsmooth(
test_task_imsmooth.py:57: in run_imsmooth
    return imsmooth(
../../../../venv/lib/python3.12/site-packages/casatasks/imsmooth.py:201: in __call__
    task_result = _imsmooth_t( _pc.document['imagename'], _pc.document['kernel'], _pc.document['major'], _pc.document['minor'], _pc.document['pa'], _pc.document['targetres'], _pc.document['kimage'], _pc.document['scale'], _pc.document['region'], _pc.document['box'], _pc.document['chans'], _pc.document['stokes'], _pc.document['mask'], _pc.document['outfile'], _pc.document['stretch'], _pc.document['overwrite'], _pc.document['beam'] )
                  ^^^^^^^^^^^^^^^^^^^^^^^^^^^^^^^^^^^^^^^^^^^^^^^^^^^^^^^^^^^^^^^^^^^^^^^^^^^^^^^^^^^^^^^^^^^^^^^^^^^^^^^^^^^^^^^^^^^^^^^^^^^^^^^^^^^^^^^^^^^^^^^^^^^^^^^^^^^^^^^^^^^^^^^^^^^^^^^^^^^^^^^^^^^^^^^^^^^^^^^^^^^^^^^^^^^^^^^^^^^^^^^^^^^^^^^^^^^^^^^^^^^^^^^^^^^^^^^^^^^^^^^^^^^^^^^^^^^^^^^^^^^^^^^^^^^^^^^^^^^^^^^^^^^^^^^^^^^^^^^^^^^^^^^^^^^^^^^^^^^^^^^^^^^^^^^^^^^^^^^^^^^^^^^^^^^^^^^^^^^^^^^^^^^^^^^^^^^^^^^^^^^^^^^^^^^^^^^^^
(16 more lines...)
Collapse Failed test_task_imsmooth imsmooth_test.test_conserve_flux
Test Tasks Many Linux 2.28 Py3.12 < 1 sec
AssertionError: False is not true
test_task_imsmooth.py:98: in tearDown
    self.assertTrue(len(_tb.showcache()) == 0)
E   AssertionError: False is not true
Collapse Failed test_task_imsmooth imsmooth_test.test_stretch
Test Tasks Many Linux 2.28 Py3.12 < 1 sec
AssertionError: False is not true
test_task_imsmooth.py:98: in tearDown
    self.assertTrue(len(_tb.showcache()) == 0)
E   AssertionError: False is not true
Collapse Failed test_task_imsmooth imsmooth_test.test_history
Test Tasks Many Linux 2.28 Py3.12 < 1 sec
AssertionError: False is not true
test_task_imsmooth.py:98: in tearDown
    self.assertTrue(len(_tb.showcache()) == 0)
E   AssertionError: False is not true
Collapse Failed test_task_imsmooth imsmooth_test.test_commonbeam
Test Tasks Many Linux 2.28 Py3.12 < 1 sec
RuntimeError: Cannot understand source values
test_task_imsmooth.py:1316: in test_commonbeam
    imsmooth(
../../../../venv/lib/python3.12/site-packages/casatasks/imsmooth.py:201: in __call__
    task_result = _imsmooth_t( _pc.document['imagename'], _pc.document['kernel'], _pc.document['major'], _pc.document['minor'], _pc.document['pa'], _pc.document['targetres'], _pc.document['kimage'], _pc.document['scale'], _pc.document['region'], _pc.document['box'], _pc.document['chans'], _pc.document['stokes'], _pc.document['mask'], _pc.document['outfile'], _pc.document['stretch'], _pc.document['overwrite'], _pc.document['beam'] )
                  ^^^^^^^^^^^^^^^^^^^^^^^^^^^^^^^^^^^^^^^^^^^^^^^^^^^^^^^^^^^^^^^^^^^^^^^^^^^^^^^^^^^^^^^^^^^^^^^^^^^^^^^^^^^^^^^^^^^^^^^^^^^^^^^^^^^^^^^^^^^^^^^^^^^^^^^^^^^^^^^^^^^^^^^^^^^^^^^^^^^^^^^^^^^^^^^^^^^^^^^^^^^^^^^^^^^^^^^^^^^^^^^^^^^^^^^^^^^^^^^^^^^^^^^^^^^^^^^^^^^^^^^^^^^^^^^^^^^^^^^^^^^^^^^^^^^^^^^^^^^^^^^^^^^^^^^^^^^^^^^^^^^^^^^^^^^^^^^^^^^^^^^^^^^^^^^^^^^^^^^^^^^^^^^^^^^^^^^^^^^^^^^^^^^^^^^^^^^^^^^^^^^^^^^^^^^^^^^^^
../../../../venv/lib/python3.12/site-packages/casatasks/private/callabletask.py:31: in wrapper
    retval = func(*args, **kwargs)
(14 more lines...)
Collapse Failed test_task_imsmooth imsmooth_test.test_multibeam
Test Tasks Many Linux 2.28 Py3.12 < 1 sec
AssertionError: False is not true
test_task_imsmooth.py:98: in tearDown
    self.assertTrue(len(_tb.showcache()) == 0)
E   AssertionError: False is not true
Collapse Failed test_task_imsmooth imsmooth_test.test_targetres
Test Tasks Many Linux 2.28 Py3.12 < 1 sec
AttributeError: 'bool' object has no attribute 'shape'
test_task_imsmooth.py:1060: in test_targetres
    run_imsmooth(
test_task_imsmooth.py:57: in run_imsmooth
    return imsmooth(
../../../../venv/lib/python3.12/site-packages/casatasks/imsmooth.py:201: in __call__
    task_result = _imsmooth_t( _pc.document['imagename'], _pc.document['kernel'], _pc.document['major'], _pc.document['minor'], _pc.document['pa'], _pc.document['targetres'], _pc.document['kimage'], _pc.document['scale'], _pc.document['region'], _pc.document['box'], _pc.document['chans'], _pc.document['stokes'], _pc.document['mask'], _pc.document['outfile'], _pc.document['stretch'], _pc.document['overwrite'], _pc.document['beam'] )
                  ^^^^^^^^^^^^^^^^^^^^^^^^^^^^^^^^^^^^^^^^^^^^^^^^^^^^^^^^^^^^^^^^^^^^^^^^^^^^^^^^^^^^^^^^^^^^^^^^^^^^^^^^^^^^^^^^^^^^^^^^^^^^^^^^^^^^^^^^^^^^^^^^^^^^^^^^^^^^^^^^^^^^^^^^^^^^^^^^^^^^^^^^^^^^^^^^^^^^^^^^^^^^^^^^^^^^^^^^^^^^^^^^^^^^^^^^^^^^^^^^^^^^^^^^^^^^^^^^^^^^^^^^^^^^^^^^^^^^^^^^^^^^^^^^^^^^^^^^^^^^^^^^^^^^^^^^^^^^^^^^^^^^^^^^^^^^^^^^^^^^^^^^^^^^^^^^^^^^^^^^^^^^^^^^^^^^^^^^^^^^^^^^^^^^^^^^^^^^^^^^^^^^^^^^^^^^^^^^^
(7 more lines...)
Collapse Failed test_task_imsmooth imsmooth_test.test_input
Test Tasks Many Linux 2.28 Py3.12 < 1 sec
RuntimeError: Exception: Major axis must have angular units (pix is not)..
... thrown by void casacore::GaussianBeam::setMajorMinor(const Quantity&, const Quantity&) at File: /source/casa6/casatools/casacore/scimath/Mathematics/GaussianBeam.cc, line: 148
test_task_imsmooth.py:344: in test_input
    results = imsmooth( tiny, major='2pix', minor='1pix', pa="deg", outfile=outfile)
              ^^^^^^^^^^^^^^^^^^^^^^^^^^^^^^^^^^^^^^^^^^^^^^^^^^^^^^^^^^^^^^^^^^^^^^
../../../../venv/lib/python3.12/site-packages/casatasks/imsmooth.py:201: in __call__
    task_result = _imsmooth_t( _pc.document['imagename'], _pc.document['kernel'], _pc.document['major'], _pc.document['minor'], _pc.document['pa'], _pc.document['targetres'], _pc.document['kimage'], _pc.document['scale'], _pc.document['region'], _pc.document['box'], _pc.document['chans'], _pc.document['stokes'], _pc.document['mask'], _pc.document['outfile'], _pc.document['stretch'], _pc.document['overwrite'], _pc.document['beam'] )
                  ^^^^^^^^^^^^^^^^^^^^^^^^^^^^^^^^^^^^^^^^^^^^^^^^^^^^^^^^^^^^^^^^^^^^^^^^^^^^^^^^^^^^^^^^^^^^^^^^^^^^^^^^^^^^^^^^^^^^^^^^^^^^^^^^^^^^^^^^^^^^^^^^^^^^^^^^^^^^^^^^^^^^^^^^^^^^^^^^^^^^^^^^^^^^^^^^^^^^^^^^^^^^^^^^^^^^^^^^^^^^^^^^^^^^^^^^^^^^^^^^^^^^^^^^^^^^^^^^^^^^^^^^^^^^^^^^^^^^^^^^^^^^^^^^^^^^^^^^^^^^^^^^^^^^^^^^^^^^^^^^^^^^^^^^^^^^^^^^^^^^^^^^^^^^^^^^^^^^^^^^^^^^^^^^^^^^^^^^^^^^^^^^^^^^^^^^^^^^^^^^^^^^^^^^^^^^^^^^^
(17 more lines...)
Collapse Failed test_task_imsmooth imsmooth_test.test_smooth
Test Tasks Many Linux 2.28 Py3.12 2 secs
AssertionError: False is not true
test_task_imsmooth.py:98: in tearDown
    self.assertTrue(len(_tb.showcache()) == 0)
E   AssertionError: False is not true
Collapse Failed test_task_imsmooth imsmooth_test.test_image_kernel
Test Tasks Many Linux 2.28 Py3.12 < 1 sec
AssertionError: False is not true
test_task_imsmooth.py:98: in tearDown
    self.assertTrue(len(_tb.showcache()) == 0)
E   AssertionError: False is not true
Collapse Failed test_task_imsmooth imsmooth_test.test_overwrite
Test Tasks Many Linux 2.28 Py3.12 < 1 sec
AssertionError: False is not true
test_task_imsmooth.py:98: in tearDown
    self.assertTrue(len(_tb.showcache()) == 0)
E   AssertionError: False is not true