Build: #3 failed
Job: Test Tasks macOS 15 Py3.12 failed
Job result summary
- Completed
- Duration
- 6 minutes
- Agent
- cbt-macos15-test-m4-1
- Revision
-
fca4920fd5894af7a8bc45e3d5a8675122e76335
- Total tests
- 13
- Failing since
- #1 (Manual run by CASA adm account – )
- Fixed in
- #4 (Manual run by CASA adm account)
Configuration changes
Tests
- 13 tests in total
- 13 tests failed
- 3 seconds taken in total.
| Status | Test | Failing since | Duration | |
|---|---|---|---|---|
|
test_task_imsmooth
imsmooth_test.test_beam
|
Failing since build #1 (Manual run by CASA adm account) | < 1 sec | ||
RuntimeError: Cannot understand source values
test_task_imsmooth.py:1238: in test_beam
x = run_imsmooth(
test_task_imsmooth.py:57: in run_imsmooth
return imsmooth(
../../../../casa6testenv/lib/python3.12/site-packages/casatasks/imsmooth.py:201: in __call__
task_result = _imsmooth_t( _pc.document['imagename'], _pc.document['kernel'], _pc.document['major'], _pc.document['minor'], _pc.document['pa'], _pc.document['targetres'], _pc.document['kimage'], _pc.document['scale'], _pc.document['region'], _pc.document['box'], _pc.document['chans'], _pc.document['stokes'], _pc.document['mask'], _pc.document['outfile'], _pc.document['stretch'], _pc.document['overwrite'], _pc.document['beam'] )
^^^^^^^^^^^^^^^^^^^^^^^^^^^^^^^^^^^^^^^^^^^^^^^^^^^^^^^^^^^^^^^^^^^^^^^^^^^^^^^^^^^^^^^^^^^^^^^^^^^^^^^^^^^^^^^^^^^^^^^^^^^^^^^^^^^^^^^^^^^^^^^^^^^^^^^^^^^^^^^^^^^^^^^^^^^^^^^^^^^^^^^^^^^^^^^^^^^^^^^^^^^^^^^^^^^^^^^^^^^^^^^^^^^^^^^^^^^^^^^^^^^^^^^^^^^^^^^^^^^^^^^^^^^^^^^^^^^^^^^^^^^^^^^^^^^^^^^^^^^^^^^^^^^^^^^^^^^^^^^^^^^^^^^^^^^^^^^^^^^^^^^^^^^^^^^^^^^^^^^^^^^^^^^^^^^^^^^^^^^^^^^^^^^^^^^^^^^^^^^^^^^^^^^^^^^^^^^^^
(16 more lines...)
|
||||
|
test_task_imsmooth
imsmooth_test.test_commonbeam
|
Failing since build #1 (Manual run by CASA adm account) | < 1 sec | ||
RuntimeError: Cannot understand source values
test_task_imsmooth.py:1316: in test_commonbeam
imsmooth(
../../../../casa6testenv/lib/python3.12/site-packages/casatasks/imsmooth.py:201: in __call__
task_result = _imsmooth_t( _pc.document['imagename'], _pc.document['kernel'], _pc.document['major'], _pc.document['minor'], _pc.document['pa'], _pc.document['targetres'], _pc.document['kimage'], _pc.document['scale'], _pc.document['region'], _pc.document['box'], _pc.document['chans'], _pc.document['stokes'], _pc.document['mask'], _pc.document['outfile'], _pc.document['stretch'], _pc.document['overwrite'], _pc.document['beam'] )
^^^^^^^^^^^^^^^^^^^^^^^^^^^^^^^^^^^^^^^^^^^^^^^^^^^^^^^^^^^^^^^^^^^^^^^^^^^^^^^^^^^^^^^^^^^^^^^^^^^^^^^^^^^^^^^^^^^^^^^^^^^^^^^^^^^^^^^^^^^^^^^^^^^^^^^^^^^^^^^^^^^^^^^^^^^^^^^^^^^^^^^^^^^^^^^^^^^^^^^^^^^^^^^^^^^^^^^^^^^^^^^^^^^^^^^^^^^^^^^^^^^^^^^^^^^^^^^^^^^^^^^^^^^^^^^^^^^^^^^^^^^^^^^^^^^^^^^^^^^^^^^^^^^^^^^^^^^^^^^^^^^^^^^^^^^^^^^^^^^^^^^^^^^^^^^^^^^^^^^^^^^^^^^^^^^^^^^^^^^^^^^^^^^^^^^^^^^^^^^^^^^^^^^^^^^^^^^^^
../../../../casa6testenv/lib/python3.12/site-packages/casatasks/private/callabletask.py:31: in wrapper
retval = func(*args, **kwargs)
(14 more lines...)
|
||||
|
test_task_imsmooth
imsmooth_test.test_conserve_flux
|
Failing since build #1 (Manual run by CASA adm account) | < 1 sec | ||
AssertionError: False is not true
test_task_imsmooth.py:98: in tearDown
self.assertTrue(len(_tb.showcache()) == 0)
E AssertionError: False is not true
|
||||
|
test_task_imsmooth
imsmooth_test.test_copying_of_input_mask
|
Failing since build #1 (Manual run by CASA adm account) | < 1 sec | ||
AssertionError: False is not true
test_task_imsmooth.py:98: in tearDown
self.assertTrue(len(_tb.showcache()) == 0)
E AssertionError: False is not true
|
||||
|
test_task_imsmooth
imsmooth_test.test_history
|
Failing since build #1 (Manual run by CASA adm account) | < 1 sec | ||
AssertionError: False is not true
test_task_imsmooth.py:98: in tearDown
self.assertTrue(len(_tb.showcache()) == 0)
E AssertionError: False is not true
|
||||
|
test_task_imsmooth
imsmooth_test.test_image_kernel
|
Failing since build #1 (Manual run by CASA adm account) | < 1 sec | ||
AssertionError: False is not true
test_task_imsmooth.py:98: in tearDown
self.assertTrue(len(_tb.showcache()) == 0)
E AssertionError: False is not true
|
||||
|
test_task_imsmooth
imsmooth_test.test_input
|
Failing since build #1 (Manual run by CASA adm account) | < 1 sec | ||
RuntimeError: Exception: Major axis must have angular units (pix is not)..
... thrown by void casacore::GaussianBeam::setMajorMinor(const Quantity &, const Quantity &) at File: ../../scimath/Mathematics/GaussianBeam.cc, line: 152
test_task_imsmooth.py:344: in test_input
results = imsmooth( tiny, major='2pix', minor='1pix', pa="deg", outfile=outfile)
^^^^^^^^^^^^^^^^^^^^^^^^^^^^^^^^^^^^^^^^^^^^^^^^^^^^^^^^^^^^^^^^^^^^^^
../../../../casa6testenv/lib/python3.12/site-packages/casatasks/imsmooth.py:201: in __call__
task_result = _imsmooth_t( _pc.document['imagename'], _pc.document['kernel'], _pc.document['major'], _pc.document['minor'], _pc.document['pa'], _pc.document['targetres'], _pc.document['kimage'], _pc.document['scale'], _pc.document['region'], _pc.document['box'], _pc.document['chans'], _pc.document['stokes'], _pc.document['mask'], _pc.document['outfile'], _pc.document['stretch'], _pc.document['overwrite'], _pc.document['beam'] )
^^^^^^^^^^^^^^^^^^^^^^^^^^^^^^^^^^^^^^^^^^^^^^^^^^^^^^^^^^^^^^^^^^^^^^^^^^^^^^^^^^^^^^^^^^^^^^^^^^^^^^^^^^^^^^^^^^^^^^^^^^^^^^^^^^^^^^^^^^^^^^^^^^^^^^^^^^^^^^^^^^^^^^^^^^^^^^^^^^^^^^^^^^^^^^^^^^^^^^^^^^^^^^^^^^^^^^^^^^^^^^^^^^^^^^^^^^^^^^^^^^^^^^^^^^^^^^^^^^^^^^^^^^^^^^^^^^^^^^^^^^^^^^^^^^^^^^^^^^^^^^^^^^^^^^^^^^^^^^^^^^^^^^^^^^^^^^^^^^^^^^^^^^^^^^^^^^^^^^^^^^^^^^^^^^^^^^^^^^^^^^^^^^^^^^^^^^^^^^^^^^^^^^^^^^^^^^^^^
(17 more lines...)
|
||||
|
test_task_imsmooth
imsmooth_test.test_multibeam
|
Failing since build #1 (Manual run by CASA adm account) | < 1 sec | ||
AssertionError: False is not true
test_task_imsmooth.py:98: in tearDown
self.assertTrue(len(_tb.showcache()) == 0)
E AssertionError: False is not true
|
||||
|
test_task_imsmooth
imsmooth_test.test_overwrite
|
Failing since build #1 (Manual run by CASA adm account) | < 1 sec | ||
AssertionError: False is not true
test_task_imsmooth.py:98: in tearDown
self.assertTrue(len(_tb.showcache()) == 0)
E AssertionError: False is not true
|
||||
|
test_task_imsmooth
imsmooth_test.test_region
|
Failing since build #1 (Manual run by CASA adm account) | < 1 sec | ||
AssertionError: False is not true
test_task_imsmooth.py:98: in tearDown
self.assertTrue(len(_tb.showcache()) == 0)
E AssertionError: False is not true
|
||||
|
test_task_imsmooth
imsmooth_test.test_smooth
|
Failing since build #1 (Manual run by CASA adm account) | < 1 sec | ||
AssertionError: False is not true
test_task_imsmooth.py:98: in tearDown
self.assertTrue(len(_tb.showcache()) == 0)
E AssertionError: False is not true
|
||||
|
test_task_imsmooth
imsmooth_test.test_stretch
|
Failing since build #1 (Manual run by CASA adm account) | < 1 sec | ||
AssertionError: False is not true
test_task_imsmooth.py:98: in tearDown
self.assertTrue(len(_tb.showcache()) == 0)
E AssertionError: False is not true
|
||||
|
test_task_imsmooth
imsmooth_test.test_targetres
|
Failing since build #1 (Manual run by CASA adm account) | < 1 sec | ||
AttributeError: 'bool' object has no attribute 'shape'
test_task_imsmooth.py:1060: in test_targetres
run_imsmooth(
test_task_imsmooth.py:57: in run_imsmooth
return imsmooth(
../../../../casa6testenv/lib/python3.12/site-packages/casatasks/imsmooth.py:201: in __call__
task_result = _imsmooth_t( _pc.document['imagename'], _pc.document['kernel'], _pc.document['major'], _pc.document['minor'], _pc.document['pa'], _pc.document['targetres'], _pc.document['kimage'], _pc.document['scale'], _pc.document['region'], _pc.document['box'], _pc.document['chans'], _pc.document['stokes'], _pc.document['mask'], _pc.document['outfile'], _pc.document['stretch'], _pc.document['overwrite'], _pc.document['beam'] )
^^^^^^^^^^^^^^^^^^^^^^^^^^^^^^^^^^^^^^^^^^^^^^^^^^^^^^^^^^^^^^^^^^^^^^^^^^^^^^^^^^^^^^^^^^^^^^^^^^^^^^^^^^^^^^^^^^^^^^^^^^^^^^^^^^^^^^^^^^^^^^^^^^^^^^^^^^^^^^^^^^^^^^^^^^^^^^^^^^^^^^^^^^^^^^^^^^^^^^^^^^^^^^^^^^^^^^^^^^^^^^^^^^^^^^^^^^^^^^^^^^^^^^^^^^^^^^^^^^^^^^^^^^^^^^^^^^^^^^^^^^^^^^^^^^^^^^^^^^^^^^^^^^^^^^^^^^^^^^^^^^^^^^^^^^^^^^^^^^^^^^^^^^^^^^^^^^^^^^^^^^^^^^^^^^^^^^^^^^^^^^^^^^^^^^^^^^^^^^^^^^^^^^^^^^^^^^^^^
(7 more lines...)
|
||||
Error summary
The build generated some errors. See the full build log for more details.
error: Your local changes to the following files would be overwritten by merge:
nrao/VLA/CalModels/3C138_K.im/table.dat
nrao/VLA/CalModels/3C138_K.im/table.lock
Please commit your changes or stash them before you merge.
Aborting
2026-10-02 03:12:06 WARN imsmooth::::casa The OUTFILE parameter tests will cause errors to occur, do not be alarmed
2026-10-02 03:12:06 WARN imsmooth::image::commonbeam (file /private/var/folders/60/83wxljbx2vlfbx_hy0yfv8rc0000gn/T/build-via-sdist-oda871h3/casatools-6.7.7.8a14803.dev2/src/tools/image/image_cmpt.cc, line 824) This image only has one beam, so just returning that
2026-10-02 03:12:06 SEVERE imsmooth::ImageInputProcessor::_process Replaceable flag is false and there is already a file or directory named input_test1 so the output image will not be written
2026-10-02 03:12:06 SEVERE imsmooth::image::_convolve2d (file /private/var/folders/60/83wxljbx2vlfbx_hy0yfv8rc0000gn/T/build-via-sdist-oda871h3/casatools-6.7.7.8a14803.dev2/src/tools/image/image_cmpt.cc, line 1212) Exception Reported: 2026-10-02 03:12:06 SEVERE imsmooth::ImageInputProcessor::_process Replaceable flag is false and there is already a file or directory named input_test1 so the output image will not be written
2026-10-02 03:12:06 SEVERE imsmooth::::casa Task imsmooth raised an exception of class RuntimeError with the following message: 2026-10-02 03:12:06 SEVERE imsmooth::ImageInputProcessor::_process Replaceable flag is false and there is already a file or directory named input_test1 so the output image will not be written
2026-10-02 03:12:06 WARN imsmooth::image::commonbeam (file /private/var/folders/60/83wxljbx2vlfbx_hy0yfv8rc0000gn/T/build-via-sdist-oda871h3/casatools-6.7.7.8a14803.dev2/src/tools/image/image_cmpt.cc, line 824) This image only has one beam, so just returning that
2026-10-02 03:12:06 WARN imsmooth::::casa The KERNEL parameter tests will cause errors to occur, do not be alarmed
2026-10-02 03:12:06 WARN imsmooth::image::commonbeam (file /private/var/folders/60/83wxljbx2vlfbx_hy0yfv8rc0000gn/T/build-via-sdist-oda871h3/casatools-6.7.7.8a14803.dev2/src/tools/image/image_cmpt.cc, line 824) This image only has one beam, so just returning that
2026-10-02 03:12:06 WARN imsmooth::::casa The MAJOR parameter tests will cause errors to occur, do not be alarmed
2026-10-02 03:12:06 WARN imsmooth::image::commonbeam (file /private/var/folders/60/83wxljbx2vlfbx_hy0yfv8rc0000gn/T/build-via-sdist-oda871h3/casatools-6.7.7.8a14803.dev2/src/tools/image/image_cmpt.cc, line 824) This image only has one beam, so just returning that
2026-10-02 03:12:07 WARN imsmooth::image::commonbeam (file /private/var/folders/60/83wxljbx2vlfbx_hy0yfv8rc0000gn/T/build-via-sdist-oda871h3/casatools-6.7.7.8a14803.dev2/src/tools/image/image_cmpt.cc, line 824) This image only has one beam, so just returning that
2026-10-02 03:12:07 SEVERE imsmooth::image::deconvolvefrombeam (file /private/var/folders/60/83wxljbx2vlfbx_hy0yfv8rc0000gn/T/build-via-sdist-oda871h3/casatools-6.7.7.8a14803.dev2/src/tools/image/image_cmpt.cc, line 1663) Exception Reported: Exception: Major axis must have angular units (pix is not)..
2026-10-02 03:12:07 SEVERE imsmooth::image::deconvolvefrombeam (file /private/var/folders/60/83wxljbx2vlfbx_hy0yfv8rc0000gn/T/build-via-sdist-oda871h3/casatools-6.7.7.8a14803.dev2/src/tools/image/image_cmpt.cc, line 1663)+ ... thrown by void casacore::GaussianBeam::setMajorMinor(const Quantity &, const Quantity &) at File: ../../scimath/Mathematics/GaussianBeam.cc, line: 152
2026-10-02 03:12:07 SEVERE imsmooth::::casa Task imsmooth raised an exception of class RuntimeError with the following message: Exception: Major axis must have angular units (pix is not)..
2026-10-02 03:12:07 SEVERE imsmooth::::casa+ ... thrown by void casacore::GaussianBeam::setMajorMinor(const Quantity &, const Quantity &) at File: ../../scimath/Mathematics/GaussianBeam.cc, line: 152
2026-10-02 03:12:07 WARN imsmooth::image::commonbeam (file /private/var/folders/60/83wxljbx2vlfbx_hy0yfv8rc0000gn/T/build-via-sdist-oda871h3/casatools-6.7.7.8a14803.dev2/src/tools/image/image_cmpt.cc, line 824) This image only has one beam, so just returning that
2026-10-02 03:12:07 WARN imsmooth::image::commonbeam (file /private/var/folders/60/83wxljbx2vlfbx_hy0yfv8rc0000gn/T/build-via-sdist-oda871h3/casatools-6.7.7.8a14803.dev2/src/tools/image/image_cmpt.cc, line 824) This image only has one beam, so just returning that
2026-10-02 03:12:07 WARN imsmooth::image::commonbeam (file /private/var/folders/60/83wxljbx2vlfbx_hy0yfv8rc0000gn/T/build-via-sdist-oda871h3/casatools-6.7.7.8a14803.dev2/src/tools/image/image_cmpt.cc, line 824) This image only has one beam, so just returning that
2026-10-02 03:12:07 WARN imsmooth::image::commonbeam (file /private/var/folders/60/83wxljbx2vlfbx_hy0yfv8rc0000gn/T/build-via-sdist-oda871h3/casatools-6.7.7.8a14803.dev2/src/tools/image/image_cmpt.cc, line 824) This image only has one beam, so just returning that
2026-10-02 03:12:07 WARN imsmooth::image::commonbeam (file /private/var/folders/60/83wxljbx2vlfbx_hy0yfv8rc0000gn/T/build-via-sdist-oda871h3/casatools-6.7.7.8a14803.dev2/src/tools/image/image_cmpt.cc, line 824) This image only has one beam, so just returning that
2026-10-02 03:12:07 SEVERE imsmooth::ImageInputProcessor::_process Replaceable flag is false and there is already a file or directory named imsmooth_test_overwrite.im so the output image will not be written
2026-10-02 03:12:07 SEVERE imsmooth::image::_convolve2d (file /private/var/folders/60/83wxljbx2vlfbx_hy0yfv8rc0000gn/T/build-via-sdist-oda871h3/casatools-6.7.7.8a14803.dev2/src/tools/image/image_cmpt.cc, line 1212) Exception Reported: 2026-10-02 03:12:07 SEVERE imsmooth::ImageInputProcessor::_process Replaceable flag is false and there is already a file or directory named imsmooth_test_overwrite.im so the output image will not be written
2026-10-02 03:12:07 SEVERE imsmooth::::casa Task imsmooth raised an exception of class RuntimeError with the following message: 2026-10-02 03:12:07 SEVERE imsmooth::ImageInputProcessor::_process Replaceable flag is false and there is already a file or directory named imsmooth_test_overwrite.im so the output image will not be written
2026-10-02 03:12:08 WARN imsmooth::::casa The outfile paramter is empty, consequently the smoothed image will be
2026-10-02 03:12:08 WARN imsmooth::::casa+ saved on disk in file, imsmooth_results.im
2026-10-02 03:12:08 SEVERE image::_convolve2d (file /private/var/folders/60/83wxljbx2vlfbx_hy0yfv8rc0000gn/T/build-via-sdist-oda871h3/casatools-6.7.7.8a14803.dev2/src/tools/image/image_cmpt.cc, line 1212) Exception Reported: The input image shape ([200, 200, 1, 20]) and mask shape ([200, 200, 1, 1]) are different, and it was specified that the mask should not be extended, so the mask cannot be applied to the (sub)image. Specifying that the mask should be extended may resolve the issue at File: /Users/casaci/bamboohome/xml-data/build-dir/CASASPECS-DBC268-BPO15AP312/casainstall/include/casacpp/imageanalysis/ImageAnalysis/SubImageFactory.tcc, line: 306
2026-10-02 03:12:08 SEVERE imsmooth::::casa Task imsmooth raised an exception of class RuntimeError with the following message: The input image shape ([200, 200, 1, 20]) and mask shape ([200, 200, 1, 1]) are different, and it was specified that the mask should not be extended, so the mask cannot be applied to the (sub)image. Specifying that the mask should be extended may resolve the issue at File: /Users/casaci/bamboohome/xml-data/build-dir/CASASPECS-DBC268-BPO15AP312/casainstall/include/casacpp/imageanalysis/ImageAnalysis/SubImageFactory.tcc, line: 306
2026-10-02 03:12:08 WARN imsmooth::::casa The outfile paramter is empty, consequently the smoothed image will be
2026-10-02 03:12:08 WARN imsmooth::::casa+ saved on disk in file, imsmooth_results.im
2026-10-02 03:12:08 WARN Image2DConvolver::_dealWithRestoringBeam Convolving kernel has minor axis 2 arcsec which is less than the pixel diagonal length of 84.8528 arcsec. Thus, the kernel is poorly sampled, and so the output of this application may not be what you expect. You should consider increasing the kernel size or regridding the image to a smaller pixel size
2026-10-02 03:12:09 WARN imsmooth::image::commonbeam (file /private/var/folders/60/83wxljbx2vlfbx_hy0yfv8rc0000gn/T/build-via-sdist-oda871h3/casatools-6.7.7.8a14803.dev2/src/tools/image/image_cmpt.cc, line 824) This image only has one beam, so just returning that
2026-10-02 03:12:09 WARN imsmooth::image::commonbeam (file /private/var/folders/60/83wxljbx2vlfbx_hy0yfv8rc0000gn/T/build-via-sdist-oda871h3/casatools-6.7.7.8a14803.dev2/src/tools/image/image_cmpt.cc, line 824) This image only has one beam, so just returning that
2026-10-02 03:12:09 WARN imsmooth::::casa difference Gaussian beam is subpixel doing regridding before convolution
2026-10-02 03:12:09 SEVERE AppInfo::workDirectory(uInt) (file ../../casa/System/AppInfo.cc, line 106) No work directory with at least 101438731MB free can be found.
2026-10-02 03:12:09 SEVERE AppInfo::workDirectory(uInt) (file ../../casa/System/AppInfo.cc, line 106)+ Check aipsrc variable user.directories.work.
2026-10-02 03:12:09 SEVERE image::regrid Exception Reported: 2026-10-02 03:12:09 SEVERE AppInfo::workDirectory(uInt) (file ../../casa/System/AppInfo.cc, line 106) No work directory with at least 101438731MB free can be found.
2026-10-02 03:12:09 SEVERE image::regrid+ 2026-10-02 03:12:09 SEVERE AppInfo::workDirectory(uInt) (file ../../casa/System/AppInfo.cc, line 106)+ Check aipsrc variable user.directories.work.
2026-10-02 03:12:09 SEVERE imsmooth::::casa Task imsmooth raised an exception of class AttributeError with the following message: 'bool' object has no attribute 'shape'
a nosedir
a nosedir/test_task_imsmooth
a nosedir/summary_of_failed.log
a nosedir/xml
a nosedir/xml/test_task_imsmooth
a nosedir/xml/test_task_imsmooth/nose.xml
a nosedir/test_task_imsmooth/imsmooth_results.im
a nosedir/test_task_imsmooth/imsmooth_zz_out.im
a nosedir/test_task_imsmooth/imsmooth_convolve2.im
a nosedir/test_task_imsmooth/smooth.pointsrc.image
a nosedir/test_task_imsmooth/smooth_test1
a nosedir/test_task_imsmooth/conftest.py
a nosedir/test_task_imsmooth/input_test11
a nosedir/test_task_imsmooth/imsmooth_gxg_K.im
a nosedir/test_task_imsmooth/imsmooth_gxg_cm-2.im
a nosedir/test_task_imsmooth/imsmooth_mysub.im
a nosedir/test_task_imsmooth/casa-20261002-031154.log
a nosedir/test_task_imsmooth/imsmooth_convolve3.im
a nosedir/test_task_imsmooth/test_task_imsmooth.py
a nosedir/test_task_imsmooth/imsmooth_rgn.pointsrc.image
a nosedir/test_task_imsmooth/input_test2
a nosedir/test_task_imsmooth/input_test5
a nosedir/test_task_imsmooth/imsmooth_conv.im
a nosedir/test_task_imsmooth/imsmooth_smooth
a nosedir/test_task_imsmooth/imsmooth_zz.im
a nosedir/test_task_imsmooth/subi2.im
a nosedir/test_task_imsmooth/imsmooth_convolve2d_multibeam.im
a nosedir/test_task_imsmooth/subi3.im
a nosedir/test_task_imsmooth/rgn_test5
a nosedir/test_task_imsmooth/imsmooth_input_overwrite
a nosedir/test_task_imsmooth/rgn_test2
a nosedir/test_task_imsmooth/rgn_test3
a nosedir/test_task_imsmooth/g192_a2.image
a nosedir/test_task_imsmooth/imsmooth_tres1J
a nosedir/test_task_imsmooth/subi0.im
a nosedir/test_task_imsmooth/test_image2dconvolver_multibeam.im
a nosedir/test_task_imsmooth/imsmooth_point_c_bessel.im
a nosedir/test_task_imsmooth/subi4.im
a nosedir/test_task_imsmooth/imsmooth_targetres.fits
a nosedir/test_task_imsmooth/input_test1b
a nosedir/test_task_imsmooth/smooth_test2
a nosedir/test_task_imsmooth/imsmooth_tmp.im
a nosedir/test_task_imsmooth/imsmooth_tres1x.im
a nosedir/test_task_imsmooth/subi1.im
a nosedir/test_task_imsmooth/imsmooth_tbeam1.im
a nosedir/test_task_imsmooth/imsmooth_orig.im
a nosedir/test_task_imsmooth/short_summary.log
a nosedir/test_task_imsmooth/input_test6
a nosedir/test_task_imsmooth/input_test1
a nosedir/test_task_imsmooth/imsmooth_convolve4.im
a nosedir/test_task_imsmooth/imsmooth_cb1.im
a nosedir/test_task_imsmooth/imsmooth_convolve0.im
a nosedir/test_task_imsmooth/tiny.im
a nosedir/test_task_imsmooth/imsmooth_maskim
a nosedir/test_task_imsmooth/imsmooth_convolve1.im
a nosedir/test_task_imsmooth/rgn_test1
a nosedir/test_task_imsmooth/imsmooth_tres1.im
a nosedir/test_task_imsmooth/imsmooth_test_overwrite.im
a nosedir/test_task_imsmooth/g192_a2.image-2.rgn
a nosedir/test_task_imsmooth/imsmooth_conv.im/mask0
a nosedir/test_task_imsmooth/imsmooth_mysub.im/mask0
a nosedir/test_task_imsmooth/imsmooth_results.im/mask0
nrao/VLA/CalModels/3C138_K.im/table.dat
nrao/VLA/CalModels/3C138_K.im/table.lock
Please commit your changes or stash them before you merge.
Aborting
2026-10-02 03:12:06 WARN imsmooth::::casa The OUTFILE parameter tests will cause errors to occur, do not be alarmed
2026-10-02 03:12:06 WARN imsmooth::image::commonbeam (file /private/var/folders/60/83wxljbx2vlfbx_hy0yfv8rc0000gn/T/build-via-sdist-oda871h3/casatools-6.7.7.8a14803.dev2/src/tools/image/image_cmpt.cc, line 824) This image only has one beam, so just returning that
2026-10-02 03:12:06 SEVERE imsmooth::ImageInputProcessor::_process Replaceable flag is false and there is already a file or directory named input_test1 so the output image will not be written
2026-10-02 03:12:06 SEVERE imsmooth::image::_convolve2d (file /private/var/folders/60/83wxljbx2vlfbx_hy0yfv8rc0000gn/T/build-via-sdist-oda871h3/casatools-6.7.7.8a14803.dev2/src/tools/image/image_cmpt.cc, line 1212) Exception Reported: 2026-10-02 03:12:06 SEVERE imsmooth::ImageInputProcessor::_process Replaceable flag is false and there is already a file or directory named input_test1 so the output image will not be written
2026-10-02 03:12:06 SEVERE imsmooth::::casa Task imsmooth raised an exception of class RuntimeError with the following message: 2026-10-02 03:12:06 SEVERE imsmooth::ImageInputProcessor::_process Replaceable flag is false and there is already a file or directory named input_test1 so the output image will not be written
2026-10-02 03:12:06 WARN imsmooth::image::commonbeam (file /private/var/folders/60/83wxljbx2vlfbx_hy0yfv8rc0000gn/T/build-via-sdist-oda871h3/casatools-6.7.7.8a14803.dev2/src/tools/image/image_cmpt.cc, line 824) This image only has one beam, so just returning that
2026-10-02 03:12:06 WARN imsmooth::::casa The KERNEL parameter tests will cause errors to occur, do not be alarmed
2026-10-02 03:12:06 WARN imsmooth::image::commonbeam (file /private/var/folders/60/83wxljbx2vlfbx_hy0yfv8rc0000gn/T/build-via-sdist-oda871h3/casatools-6.7.7.8a14803.dev2/src/tools/image/image_cmpt.cc, line 824) This image only has one beam, so just returning that
2026-10-02 03:12:06 WARN imsmooth::::casa The MAJOR parameter tests will cause errors to occur, do not be alarmed
2026-10-02 03:12:06 WARN imsmooth::image::commonbeam (file /private/var/folders/60/83wxljbx2vlfbx_hy0yfv8rc0000gn/T/build-via-sdist-oda871h3/casatools-6.7.7.8a14803.dev2/src/tools/image/image_cmpt.cc, line 824) This image only has one beam, so just returning that
2026-10-02 03:12:07 WARN imsmooth::image::commonbeam (file /private/var/folders/60/83wxljbx2vlfbx_hy0yfv8rc0000gn/T/build-via-sdist-oda871h3/casatools-6.7.7.8a14803.dev2/src/tools/image/image_cmpt.cc, line 824) This image only has one beam, so just returning that
2026-10-02 03:12:07 SEVERE imsmooth::image::deconvolvefrombeam (file /private/var/folders/60/83wxljbx2vlfbx_hy0yfv8rc0000gn/T/build-via-sdist-oda871h3/casatools-6.7.7.8a14803.dev2/src/tools/image/image_cmpt.cc, line 1663) Exception Reported: Exception: Major axis must have angular units (pix is not)..
2026-10-02 03:12:07 SEVERE imsmooth::image::deconvolvefrombeam (file /private/var/folders/60/83wxljbx2vlfbx_hy0yfv8rc0000gn/T/build-via-sdist-oda871h3/casatools-6.7.7.8a14803.dev2/src/tools/image/image_cmpt.cc, line 1663)+ ... thrown by void casacore::GaussianBeam::setMajorMinor(const Quantity &, const Quantity &) at File: ../../scimath/Mathematics/GaussianBeam.cc, line: 152
2026-10-02 03:12:07 SEVERE imsmooth::::casa Task imsmooth raised an exception of class RuntimeError with the following message: Exception: Major axis must have angular units (pix is not)..
2026-10-02 03:12:07 SEVERE imsmooth::::casa+ ... thrown by void casacore::GaussianBeam::setMajorMinor(const Quantity &, const Quantity &) at File: ../../scimath/Mathematics/GaussianBeam.cc, line: 152
2026-10-02 03:12:07 WARN imsmooth::image::commonbeam (file /private/var/folders/60/83wxljbx2vlfbx_hy0yfv8rc0000gn/T/build-via-sdist-oda871h3/casatools-6.7.7.8a14803.dev2/src/tools/image/image_cmpt.cc, line 824) This image only has one beam, so just returning that
2026-10-02 03:12:07 WARN imsmooth::image::commonbeam (file /private/var/folders/60/83wxljbx2vlfbx_hy0yfv8rc0000gn/T/build-via-sdist-oda871h3/casatools-6.7.7.8a14803.dev2/src/tools/image/image_cmpt.cc, line 824) This image only has one beam, so just returning that
2026-10-02 03:12:07 WARN imsmooth::image::commonbeam (file /private/var/folders/60/83wxljbx2vlfbx_hy0yfv8rc0000gn/T/build-via-sdist-oda871h3/casatools-6.7.7.8a14803.dev2/src/tools/image/image_cmpt.cc, line 824) This image only has one beam, so just returning that
2026-10-02 03:12:07 WARN imsmooth::image::commonbeam (file /private/var/folders/60/83wxljbx2vlfbx_hy0yfv8rc0000gn/T/build-via-sdist-oda871h3/casatools-6.7.7.8a14803.dev2/src/tools/image/image_cmpt.cc, line 824) This image only has one beam, so just returning that
2026-10-02 03:12:07 WARN imsmooth::image::commonbeam (file /private/var/folders/60/83wxljbx2vlfbx_hy0yfv8rc0000gn/T/build-via-sdist-oda871h3/casatools-6.7.7.8a14803.dev2/src/tools/image/image_cmpt.cc, line 824) This image only has one beam, so just returning that
2026-10-02 03:12:07 SEVERE imsmooth::ImageInputProcessor::_process Replaceable flag is false and there is already a file or directory named imsmooth_test_overwrite.im so the output image will not be written
2026-10-02 03:12:07 SEVERE imsmooth::image::_convolve2d (file /private/var/folders/60/83wxljbx2vlfbx_hy0yfv8rc0000gn/T/build-via-sdist-oda871h3/casatools-6.7.7.8a14803.dev2/src/tools/image/image_cmpt.cc, line 1212) Exception Reported: 2026-10-02 03:12:07 SEVERE imsmooth::ImageInputProcessor::_process Replaceable flag is false and there is already a file or directory named imsmooth_test_overwrite.im so the output image will not be written
2026-10-02 03:12:07 SEVERE imsmooth::::casa Task imsmooth raised an exception of class RuntimeError with the following message: 2026-10-02 03:12:07 SEVERE imsmooth::ImageInputProcessor::_process Replaceable flag is false and there is already a file or directory named imsmooth_test_overwrite.im so the output image will not be written
2026-10-02 03:12:08 WARN imsmooth::::casa The outfile paramter is empty, consequently the smoothed image will be
2026-10-02 03:12:08 WARN imsmooth::::casa+ saved on disk in file, imsmooth_results.im
2026-10-02 03:12:08 SEVERE image::_convolve2d (file /private/var/folders/60/83wxljbx2vlfbx_hy0yfv8rc0000gn/T/build-via-sdist-oda871h3/casatools-6.7.7.8a14803.dev2/src/tools/image/image_cmpt.cc, line 1212) Exception Reported: The input image shape ([200, 200, 1, 20]) and mask shape ([200, 200, 1, 1]) are different, and it was specified that the mask should not be extended, so the mask cannot be applied to the (sub)image. Specifying that the mask should be extended may resolve the issue at File: /Users/casaci/bamboohome/xml-data/build-dir/CASASPECS-DBC268-BPO15AP312/casainstall/include/casacpp/imageanalysis/ImageAnalysis/SubImageFactory.tcc, line: 306
2026-10-02 03:12:08 SEVERE imsmooth::::casa Task imsmooth raised an exception of class RuntimeError with the following message: The input image shape ([200, 200, 1, 20]) and mask shape ([200, 200, 1, 1]) are different, and it was specified that the mask should not be extended, so the mask cannot be applied to the (sub)image. Specifying that the mask should be extended may resolve the issue at File: /Users/casaci/bamboohome/xml-data/build-dir/CASASPECS-DBC268-BPO15AP312/casainstall/include/casacpp/imageanalysis/ImageAnalysis/SubImageFactory.tcc, line: 306
2026-10-02 03:12:08 WARN imsmooth::::casa The outfile paramter is empty, consequently the smoothed image will be
2026-10-02 03:12:08 WARN imsmooth::::casa+ saved on disk in file, imsmooth_results.im
2026-10-02 03:12:08 WARN Image2DConvolver::_dealWithRestoringBeam Convolving kernel has minor axis 2 arcsec which is less than the pixel diagonal length of 84.8528 arcsec. Thus, the kernel is poorly sampled, and so the output of this application may not be what you expect. You should consider increasing the kernel size or regridding the image to a smaller pixel size
2026-10-02 03:12:09 WARN imsmooth::image::commonbeam (file /private/var/folders/60/83wxljbx2vlfbx_hy0yfv8rc0000gn/T/build-via-sdist-oda871h3/casatools-6.7.7.8a14803.dev2/src/tools/image/image_cmpt.cc, line 824) This image only has one beam, so just returning that
2026-10-02 03:12:09 WARN imsmooth::image::commonbeam (file /private/var/folders/60/83wxljbx2vlfbx_hy0yfv8rc0000gn/T/build-via-sdist-oda871h3/casatools-6.7.7.8a14803.dev2/src/tools/image/image_cmpt.cc, line 824) This image only has one beam, so just returning that
2026-10-02 03:12:09 WARN imsmooth::::casa difference Gaussian beam is subpixel doing regridding before convolution
2026-10-02 03:12:09 SEVERE AppInfo::workDirectory(uInt) (file ../../casa/System/AppInfo.cc, line 106) No work directory with at least 101438731MB free can be found.
2026-10-02 03:12:09 SEVERE AppInfo::workDirectory(uInt) (file ../../casa/System/AppInfo.cc, line 106)+ Check aipsrc variable user.directories.work.
2026-10-02 03:12:09 SEVERE image::regrid Exception Reported: 2026-10-02 03:12:09 SEVERE AppInfo::workDirectory(uInt) (file ../../casa/System/AppInfo.cc, line 106) No work directory with at least 101438731MB free can be found.
2026-10-02 03:12:09 SEVERE image::regrid+ 2026-10-02 03:12:09 SEVERE AppInfo::workDirectory(uInt) (file ../../casa/System/AppInfo.cc, line 106)+ Check aipsrc variable user.directories.work.
2026-10-02 03:12:09 SEVERE imsmooth::::casa Task imsmooth raised an exception of class AttributeError with the following message: 'bool' object has no attribute 'shape'
a nosedir
a nosedir/test_task_imsmooth
a nosedir/summary_of_failed.log
a nosedir/xml
a nosedir/xml/test_task_imsmooth
a nosedir/xml/test_task_imsmooth/nose.xml
a nosedir/test_task_imsmooth/imsmooth_results.im
a nosedir/test_task_imsmooth/imsmooth_zz_out.im
a nosedir/test_task_imsmooth/imsmooth_convolve2.im
a nosedir/test_task_imsmooth/smooth.pointsrc.image
a nosedir/test_task_imsmooth/smooth_test1
a nosedir/test_task_imsmooth/conftest.py
a nosedir/test_task_imsmooth/input_test11
a nosedir/test_task_imsmooth/imsmooth_gxg_K.im
a nosedir/test_task_imsmooth/imsmooth_gxg_cm-2.im
a nosedir/test_task_imsmooth/imsmooth_mysub.im
a nosedir/test_task_imsmooth/casa-20261002-031154.log
a nosedir/test_task_imsmooth/imsmooth_convolve3.im
a nosedir/test_task_imsmooth/test_task_imsmooth.py
a nosedir/test_task_imsmooth/imsmooth_rgn.pointsrc.image
a nosedir/test_task_imsmooth/input_test2
a nosedir/test_task_imsmooth/input_test5
a nosedir/test_task_imsmooth/imsmooth_conv.im
a nosedir/test_task_imsmooth/imsmooth_smooth
a nosedir/test_task_imsmooth/imsmooth_zz.im
a nosedir/test_task_imsmooth/subi2.im
a nosedir/test_task_imsmooth/imsmooth_convolve2d_multibeam.im
a nosedir/test_task_imsmooth/subi3.im
a nosedir/test_task_imsmooth/rgn_test5
a nosedir/test_task_imsmooth/imsmooth_input_overwrite
a nosedir/test_task_imsmooth/rgn_test2
a nosedir/test_task_imsmooth/rgn_test3
a nosedir/test_task_imsmooth/g192_a2.image
a nosedir/test_task_imsmooth/imsmooth_tres1J
a nosedir/test_task_imsmooth/subi0.im
a nosedir/test_task_imsmooth/test_image2dconvolver_multibeam.im
a nosedir/test_task_imsmooth/imsmooth_point_c_bessel.im
a nosedir/test_task_imsmooth/subi4.im
a nosedir/test_task_imsmooth/imsmooth_targetres.fits
a nosedir/test_task_imsmooth/input_test1b
a nosedir/test_task_imsmooth/smooth_test2
a nosedir/test_task_imsmooth/imsmooth_tmp.im
a nosedir/test_task_imsmooth/imsmooth_tres1x.im
a nosedir/test_task_imsmooth/subi1.im
a nosedir/test_task_imsmooth/imsmooth_tbeam1.im
a nosedir/test_task_imsmooth/imsmooth_orig.im
a nosedir/test_task_imsmooth/short_summary.log
a nosedir/test_task_imsmooth/input_test6
a nosedir/test_task_imsmooth/input_test1
a nosedir/test_task_imsmooth/imsmooth_convolve4.im
a nosedir/test_task_imsmooth/imsmooth_cb1.im
a nosedir/test_task_imsmooth/imsmooth_convolve0.im
a nosedir/test_task_imsmooth/tiny.im
a nosedir/test_task_imsmooth/imsmooth_maskim
a nosedir/test_task_imsmooth/imsmooth_convolve1.im
a nosedir/test_task_imsmooth/rgn_test1
a nosedir/test_task_imsmooth/imsmooth_tres1.im
a nosedir/test_task_imsmooth/imsmooth_test_overwrite.im
a nosedir/test_task_imsmooth/g192_a2.image-2.rgn
a nosedir/test_task_imsmooth/imsmooth_conv.im/mask0
a nosedir/test_task_imsmooth/imsmooth_mysub.im/mask0
a nosedir/test_task_imsmooth/imsmooth_results.im/mask0