Build: #1 failed Manual run by CASA adm account

Test results

  • 1,424 tests in total
  • 26 tests failed
  • 26 failures are new
  • 10 tests were quarantined / skipped
  • 29 minutes taken in total.
New test failures 26
Status Test View job Duration
Collapse Failed test_task_imsmooth imsmooth_test.test_targetres
Test Tasks macOS 15 Py3.12 < 1 sec
AttributeError: 'bool' object has no attribute 'shape'
test_task_imsmooth.py:1060: in test_targetres
    run_imsmooth(
test_task_imsmooth.py:57: in run_imsmooth
    return imsmooth(
../../../../casa6testenv/lib/python3.12/site-packages/casatasks/imsmooth.py:201: in __call__
    task_result = _imsmooth_t( _pc.document['imagename'], _pc.document['kernel'], _pc.document['major'], _pc.document['minor'], _pc.document['pa'], _pc.document['targetres'], _pc.document['kimage'], _pc.document['scale'], _pc.document['region'], _pc.document['box'], _pc.document['chans'], _pc.document['stokes'], _pc.document['mask'], _pc.document['outfile'], _pc.document['stretch'], _pc.document['overwrite'], _pc.document['beam'] )
                  ^^^^^^^^^^^^^^^^^^^^^^^^^^^^^^^^^^^^^^^^^^^^^^^^^^^^^^^^^^^^^^^^^^^^^^^^^^^^^^^^^^^^^^^^^^^^^^^^^^^^^^^^^^^^^^^^^^^^^^^^^^^^^^^^^^^^^^^^^^^^^^^^^^^^^^^^^^^^^^^^^^^^^^^^^^^^^^^^^^^^^^^^^^^^^^^^^^^^^^^^^^^^^^^^^^^^^^^^^^^^^^^^^^^^^^^^^^^^^^^^^^^^^^^^^^^^^^^^^^^^^^^^^^^^^^^^^^^^^^^^^^^^^^^^^^^^^^^^^^^^^^^^^^^^^^^^^^^^^^^^^^^^^^^^^^^^^^^^^^^^^^^^^^^^^^^^^^^^^^^^^^^^^^^^^^^^^^^^^^^^^^^^^^^^^^^^^^^^^^^^^^^^^^^^^^^^^^^^^
(7 more lines...)
Collapse Failed test_task_imsmooth imsmooth_test.test_overwrite
Test Tasks macOS 15 Py3.12 < 1 sec
AssertionError: False is not true
test_task_imsmooth.py:98: in tearDown
    self.assertTrue(len(_tb.showcache()) == 0)
E   AssertionError: False is not true
Collapse Failed test_task_imsmooth imsmooth_test.test_copying_of_input_mask
Test Tasks macOS 15 Py3.12 < 1 sec
AssertionError: False is not true
test_task_imsmooth.py:98: in tearDown
    self.assertTrue(len(_tb.showcache()) == 0)
E   AssertionError: False is not true
Collapse Failed test_task_imsmooth imsmooth_test.test_smooth
Test Tasks macOS 15 Py3.12 1 sec
AssertionError: False is not true
test_task_imsmooth.py:98: in tearDown
    self.assertTrue(len(_tb.showcache()) == 0)
E   AssertionError: False is not true
Collapse Failed test_task_imsmooth imsmooth_test.test_image_kernel
Test Tasks macOS 15 Py3.12 < 1 sec
AssertionError: False is not true
test_task_imsmooth.py:98: in tearDown
    self.assertTrue(len(_tb.showcache()) == 0)
E   AssertionError: False is not true
Collapse Failed test_task_imsmooth imsmooth_test.test_history
Test Tasks macOS 15 Py3.12 < 1 sec
AssertionError: False is not true
test_task_imsmooth.py:98: in tearDown
    self.assertTrue(len(_tb.showcache()) == 0)
E   AssertionError: False is not true
Collapse Failed test_task_imsmooth imsmooth_test.test_region
Test Tasks macOS 15 Py3.12 < 1 sec
AssertionError: False is not true
test_task_imsmooth.py:98: in tearDown
    self.assertTrue(len(_tb.showcache()) == 0)
E   AssertionError: False is not true
Collapse Failed test_task_imsmooth imsmooth_test.test_stretch
Test Tasks macOS 15 Py3.12 < 1 sec
AssertionError: False is not true
test_task_imsmooth.py:98: in tearDown
    self.assertTrue(len(_tb.showcache()) == 0)
E   AssertionError: False is not true
Collapse Failed test_task_imsmooth imsmooth_test.test_commonbeam
Test Tasks macOS 15 Py3.12 < 1 sec
RuntimeError: Cannot understand source values
test_task_imsmooth.py:1316: in test_commonbeam
    imsmooth(
../../../../casa6testenv/lib/python3.12/site-packages/casatasks/imsmooth.py:201: in __call__
    task_result = _imsmooth_t( _pc.document['imagename'], _pc.document['kernel'], _pc.document['major'], _pc.document['minor'], _pc.document['pa'], _pc.document['targetres'], _pc.document['kimage'], _pc.document['scale'], _pc.document['region'], _pc.document['box'], _pc.document['chans'], _pc.document['stokes'], _pc.document['mask'], _pc.document['outfile'], _pc.document['stretch'], _pc.document['overwrite'], _pc.document['beam'] )
                  ^^^^^^^^^^^^^^^^^^^^^^^^^^^^^^^^^^^^^^^^^^^^^^^^^^^^^^^^^^^^^^^^^^^^^^^^^^^^^^^^^^^^^^^^^^^^^^^^^^^^^^^^^^^^^^^^^^^^^^^^^^^^^^^^^^^^^^^^^^^^^^^^^^^^^^^^^^^^^^^^^^^^^^^^^^^^^^^^^^^^^^^^^^^^^^^^^^^^^^^^^^^^^^^^^^^^^^^^^^^^^^^^^^^^^^^^^^^^^^^^^^^^^^^^^^^^^^^^^^^^^^^^^^^^^^^^^^^^^^^^^^^^^^^^^^^^^^^^^^^^^^^^^^^^^^^^^^^^^^^^^^^^^^^^^^^^^^^^^^^^^^^^^^^^^^^^^^^^^^^^^^^^^^^^^^^^^^^^^^^^^^^^^^^^^^^^^^^^^^^^^^^^^^^^^^^^^^^^^
../../../../casa6testenv/lib/python3.12/site-packages/casatasks/private/callabletask.py:31: in wrapper
    retval = func(*args, **kwargs)
(14 more lines...)
Collapse Failed test_task_imsmooth imsmooth_test.test_multibeam
Test Tasks macOS 15 Py3.12 < 1 sec
AssertionError: False is not true
test_task_imsmooth.py:98: in tearDown
    self.assertTrue(len(_tb.showcache()) == 0)
E   AssertionError: False is not true
Collapse Failed test_task_imsmooth imsmooth_test.test_conserve_flux
Test Tasks macOS 15 Py3.12 < 1 sec
AssertionError: False is not true
test_task_imsmooth.py:98: in tearDown
    self.assertTrue(len(_tb.showcache()) == 0)
E   AssertionError: False is not true
Collapse Failed test_task_imsmooth imsmooth_test.test_beam
Test Tasks macOS 15 Py3.12 < 1 sec
RuntimeError: Cannot understand source values
test_task_imsmooth.py:1238: in test_beam
    x = run_imsmooth(
test_task_imsmooth.py:57: in run_imsmooth
    return imsmooth(
../../../../casa6testenv/lib/python3.12/site-packages/casatasks/imsmooth.py:201: in __call__
    task_result = _imsmooth_t( _pc.document['imagename'], _pc.document['kernel'], _pc.document['major'], _pc.document['minor'], _pc.document['pa'], _pc.document['targetres'], _pc.document['kimage'], _pc.document['scale'], _pc.document['region'], _pc.document['box'], _pc.document['chans'], _pc.document['stokes'], _pc.document['mask'], _pc.document['outfile'], _pc.document['stretch'], _pc.document['overwrite'], _pc.document['beam'] )
                  ^^^^^^^^^^^^^^^^^^^^^^^^^^^^^^^^^^^^^^^^^^^^^^^^^^^^^^^^^^^^^^^^^^^^^^^^^^^^^^^^^^^^^^^^^^^^^^^^^^^^^^^^^^^^^^^^^^^^^^^^^^^^^^^^^^^^^^^^^^^^^^^^^^^^^^^^^^^^^^^^^^^^^^^^^^^^^^^^^^^^^^^^^^^^^^^^^^^^^^^^^^^^^^^^^^^^^^^^^^^^^^^^^^^^^^^^^^^^^^^^^^^^^^^^^^^^^^^^^^^^^^^^^^^^^^^^^^^^^^^^^^^^^^^^^^^^^^^^^^^^^^^^^^^^^^^^^^^^^^^^^^^^^^^^^^^^^^^^^^^^^^^^^^^^^^^^^^^^^^^^^^^^^^^^^^^^^^^^^^^^^^^^^^^^^^^^^^^^^^^^^^^^^^^^^^^^^^^^^
(16 more lines...)
Collapse Failed test_task_imsmooth imsmooth_test.test_input
Test Tasks macOS 15 Py3.12 < 1 sec
RuntimeError: Exception: Major axis must have angular units (pix is not)..
... thrown by void casacore::GaussianBeam::setMajorMinor(const Quantity &, const Quantity &) at File: ../../scimath/Mathematics/GaussianBeam.cc, line: 152
test_task_imsmooth.py:344: in test_input
    results = imsmooth( tiny, major='2pix', minor='1pix', pa="deg", outfile=outfile)
              ^^^^^^^^^^^^^^^^^^^^^^^^^^^^^^^^^^^^^^^^^^^^^^^^^^^^^^^^^^^^^^^^^^^^^^
../../../../casa6testenv/lib/python3.12/site-packages/casatasks/imsmooth.py:201: in __call__
    task_result = _imsmooth_t( _pc.document['imagename'], _pc.document['kernel'], _pc.document['major'], _pc.document['minor'], _pc.document['pa'], _pc.document['targetres'], _pc.document['kimage'], _pc.document['scale'], _pc.document['region'], _pc.document['box'], _pc.document['chans'], _pc.document['stokes'], _pc.document['mask'], _pc.document['outfile'], _pc.document['stretch'], _pc.document['overwrite'], _pc.document['beam'] )
                  ^^^^^^^^^^^^^^^^^^^^^^^^^^^^^^^^^^^^^^^^^^^^^^^^^^^^^^^^^^^^^^^^^^^^^^^^^^^^^^^^^^^^^^^^^^^^^^^^^^^^^^^^^^^^^^^^^^^^^^^^^^^^^^^^^^^^^^^^^^^^^^^^^^^^^^^^^^^^^^^^^^^^^^^^^^^^^^^^^^^^^^^^^^^^^^^^^^^^^^^^^^^^^^^^^^^^^^^^^^^^^^^^^^^^^^^^^^^^^^^^^^^^^^^^^^^^^^^^^^^^^^^^^^^^^^^^^^^^^^^^^^^^^^^^^^^^^^^^^^^^^^^^^^^^^^^^^^^^^^^^^^^^^^^^^^^^^^^^^^^^^^^^^^^^^^^^^^^^^^^^^^^^^^^^^^^^^^^^^^^^^^^^^^^^^^^^^^^^^^^^^^^^^^^^^^^^^^^^^
(17 more lines...)
Collapse Failed test_task_imsmooth imsmooth_test.test_copying_of_input_mask
Test Tasks Many Linux 2.28 Py3.12 < 1 sec
AssertionError: False is not true
test_task_imsmooth.py:98: in tearDown
    self.assertTrue(len(_tb.showcache()) == 0)
E   AssertionError: False is not true
Collapse Failed test_task_imsmooth imsmooth_test.test_region
Test Tasks Many Linux 2.28 Py3.12 < 1 sec
AssertionError: False is not true
test_task_imsmooth.py:98: in tearDown
    self.assertTrue(len(_tb.showcache()) == 0)
E   AssertionError: False is not true
Collapse Failed test_task_imsmooth imsmooth_test.test_beam
Test Tasks Many Linux 2.28 Py3.12 < 1 sec
RuntimeError: Cannot understand source values
test_task_imsmooth.py:1238: in test_beam
    x = run_imsmooth(
test_task_imsmooth.py:57: in run_imsmooth
    return imsmooth(
../../../../venv/lib/python3.12/site-packages/casatasks/imsmooth.py:201: in __call__
    task_result = _imsmooth_t( _pc.document['imagename'], _pc.document['kernel'], _pc.document['major'], _pc.document['minor'], _pc.document['pa'], _pc.document['targetres'], _pc.document['kimage'], _pc.document['scale'], _pc.document['region'], _pc.document['box'], _pc.document['chans'], _pc.document['stokes'], _pc.document['mask'], _pc.document['outfile'], _pc.document['stretch'], _pc.document['overwrite'], _pc.document['beam'] )
                  ^^^^^^^^^^^^^^^^^^^^^^^^^^^^^^^^^^^^^^^^^^^^^^^^^^^^^^^^^^^^^^^^^^^^^^^^^^^^^^^^^^^^^^^^^^^^^^^^^^^^^^^^^^^^^^^^^^^^^^^^^^^^^^^^^^^^^^^^^^^^^^^^^^^^^^^^^^^^^^^^^^^^^^^^^^^^^^^^^^^^^^^^^^^^^^^^^^^^^^^^^^^^^^^^^^^^^^^^^^^^^^^^^^^^^^^^^^^^^^^^^^^^^^^^^^^^^^^^^^^^^^^^^^^^^^^^^^^^^^^^^^^^^^^^^^^^^^^^^^^^^^^^^^^^^^^^^^^^^^^^^^^^^^^^^^^^^^^^^^^^^^^^^^^^^^^^^^^^^^^^^^^^^^^^^^^^^^^^^^^^^^^^^^^^^^^^^^^^^^^^^^^^^^^^^^^^^^^^^
(16 more lines...)
Collapse Failed test_task_imsmooth imsmooth_test.test_conserve_flux
Test Tasks Many Linux 2.28 Py3.12 < 1 sec
AssertionError: False is not true
test_task_imsmooth.py:98: in tearDown
    self.assertTrue(len(_tb.showcache()) == 0)
E   AssertionError: False is not true
Collapse Failed test_task_imsmooth imsmooth_test.test_stretch
Test Tasks Many Linux 2.28 Py3.12 < 1 sec
AssertionError: False is not true
test_task_imsmooth.py:98: in tearDown
    self.assertTrue(len(_tb.showcache()) == 0)
E   AssertionError: False is not true
Collapse Failed test_task_imsmooth imsmooth_test.test_history
Test Tasks Many Linux 2.28 Py3.12 < 1 sec
AssertionError: False is not true
test_task_imsmooth.py:98: in tearDown
    self.assertTrue(len(_tb.showcache()) == 0)
E   AssertionError: False is not true
Collapse Failed test_task_imsmooth imsmooth_test.test_commonbeam
Test Tasks Many Linux 2.28 Py3.12 < 1 sec
RuntimeError: Cannot understand source values
test_task_imsmooth.py:1316: in test_commonbeam
    imsmooth(
../../../../venv/lib/python3.12/site-packages/casatasks/imsmooth.py:201: in __call__
    task_result = _imsmooth_t( _pc.document['imagename'], _pc.document['kernel'], _pc.document['major'], _pc.document['minor'], _pc.document['pa'], _pc.document['targetres'], _pc.document['kimage'], _pc.document['scale'], _pc.document['region'], _pc.document['box'], _pc.document['chans'], _pc.document['stokes'], _pc.document['mask'], _pc.document['outfile'], _pc.document['stretch'], _pc.document['overwrite'], _pc.document['beam'] )
                  ^^^^^^^^^^^^^^^^^^^^^^^^^^^^^^^^^^^^^^^^^^^^^^^^^^^^^^^^^^^^^^^^^^^^^^^^^^^^^^^^^^^^^^^^^^^^^^^^^^^^^^^^^^^^^^^^^^^^^^^^^^^^^^^^^^^^^^^^^^^^^^^^^^^^^^^^^^^^^^^^^^^^^^^^^^^^^^^^^^^^^^^^^^^^^^^^^^^^^^^^^^^^^^^^^^^^^^^^^^^^^^^^^^^^^^^^^^^^^^^^^^^^^^^^^^^^^^^^^^^^^^^^^^^^^^^^^^^^^^^^^^^^^^^^^^^^^^^^^^^^^^^^^^^^^^^^^^^^^^^^^^^^^^^^^^^^^^^^^^^^^^^^^^^^^^^^^^^^^^^^^^^^^^^^^^^^^^^^^^^^^^^^^^^^^^^^^^^^^^^^^^^^^^^^^^^^^^^^^
../../../../venv/lib/python3.12/site-packages/casatasks/private/callabletask.py:31: in wrapper
    retval = func(*args, **kwargs)
(14 more lines...)
Collapse Failed test_task_imsmooth imsmooth_test.test_multibeam
Test Tasks Many Linux 2.28 Py3.12 < 1 sec
AssertionError: False is not true
test_task_imsmooth.py:98: in tearDown
    self.assertTrue(len(_tb.showcache()) == 0)
E   AssertionError: False is not true
Collapse Failed test_task_imsmooth imsmooth_test.test_targetres
Test Tasks Many Linux 2.28 Py3.12 < 1 sec
AttributeError: 'bool' object has no attribute 'shape'
test_task_imsmooth.py:1060: in test_targetres
    run_imsmooth(
test_task_imsmooth.py:57: in run_imsmooth
    return imsmooth(
../../../../venv/lib/python3.12/site-packages/casatasks/imsmooth.py:201: in __call__
    task_result = _imsmooth_t( _pc.document['imagename'], _pc.document['kernel'], _pc.document['major'], _pc.document['minor'], _pc.document['pa'], _pc.document['targetres'], _pc.document['kimage'], _pc.document['scale'], _pc.document['region'], _pc.document['box'], _pc.document['chans'], _pc.document['stokes'], _pc.document['mask'], _pc.document['outfile'], _pc.document['stretch'], _pc.document['overwrite'], _pc.document['beam'] )
                  ^^^^^^^^^^^^^^^^^^^^^^^^^^^^^^^^^^^^^^^^^^^^^^^^^^^^^^^^^^^^^^^^^^^^^^^^^^^^^^^^^^^^^^^^^^^^^^^^^^^^^^^^^^^^^^^^^^^^^^^^^^^^^^^^^^^^^^^^^^^^^^^^^^^^^^^^^^^^^^^^^^^^^^^^^^^^^^^^^^^^^^^^^^^^^^^^^^^^^^^^^^^^^^^^^^^^^^^^^^^^^^^^^^^^^^^^^^^^^^^^^^^^^^^^^^^^^^^^^^^^^^^^^^^^^^^^^^^^^^^^^^^^^^^^^^^^^^^^^^^^^^^^^^^^^^^^^^^^^^^^^^^^^^^^^^^^^^^^^^^^^^^^^^^^^^^^^^^^^^^^^^^^^^^^^^^^^^^^^^^^^^^^^^^^^^^^^^^^^^^^^^^^^^^^^^^^^^^^^
(7 more lines...)
Collapse Failed test_task_imsmooth imsmooth_test.test_input
Test Tasks Many Linux 2.28 Py3.12 < 1 sec
RuntimeError: Exception: Major axis must have angular units (pix is not)..
... thrown by void casacore::GaussianBeam::setMajorMinor(const Quantity&, const Quantity&) at File: /source/casa6/casatools/casacore/scimath/Mathematics/GaussianBeam.cc, line: 148
test_task_imsmooth.py:344: in test_input
    results = imsmooth( tiny, major='2pix', minor='1pix', pa="deg", outfile=outfile)
              ^^^^^^^^^^^^^^^^^^^^^^^^^^^^^^^^^^^^^^^^^^^^^^^^^^^^^^^^^^^^^^^^^^^^^^
../../../../venv/lib/python3.12/site-packages/casatasks/imsmooth.py:201: in __call__
    task_result = _imsmooth_t( _pc.document['imagename'], _pc.document['kernel'], _pc.document['major'], _pc.document['minor'], _pc.document['pa'], _pc.document['targetres'], _pc.document['kimage'], _pc.document['scale'], _pc.document['region'], _pc.document['box'], _pc.document['chans'], _pc.document['stokes'], _pc.document['mask'], _pc.document['outfile'], _pc.document['stretch'], _pc.document['overwrite'], _pc.document['beam'] )
                  ^^^^^^^^^^^^^^^^^^^^^^^^^^^^^^^^^^^^^^^^^^^^^^^^^^^^^^^^^^^^^^^^^^^^^^^^^^^^^^^^^^^^^^^^^^^^^^^^^^^^^^^^^^^^^^^^^^^^^^^^^^^^^^^^^^^^^^^^^^^^^^^^^^^^^^^^^^^^^^^^^^^^^^^^^^^^^^^^^^^^^^^^^^^^^^^^^^^^^^^^^^^^^^^^^^^^^^^^^^^^^^^^^^^^^^^^^^^^^^^^^^^^^^^^^^^^^^^^^^^^^^^^^^^^^^^^^^^^^^^^^^^^^^^^^^^^^^^^^^^^^^^^^^^^^^^^^^^^^^^^^^^^^^^^^^^^^^^^^^^^^^^^^^^^^^^^^^^^^^^^^^^^^^^^^^^^^^^^^^^^^^^^^^^^^^^^^^^^^^^^^^^^^^^^^^^^^^^^^
(17 more lines...)
Collapse Failed test_task_imsmooth imsmooth_test.test_smooth
Test Tasks Many Linux 2.28 Py3.12 2 secs
AssertionError: False is not true
test_task_imsmooth.py:98: in tearDown
    self.assertTrue(len(_tb.showcache()) == 0)
E   AssertionError: False is not true
Collapse Failed test_task_imsmooth imsmooth_test.test_image_kernel
Test Tasks Many Linux 2.28 Py3.12 < 1 sec
AssertionError: False is not true
test_task_imsmooth.py:98: in tearDown
    self.assertTrue(len(_tb.showcache()) == 0)
E   AssertionError: False is not true
Collapse Failed test_task_imsmooth imsmooth_test.test_overwrite
Test Tasks Many Linux 2.28 Py3.12 < 1 sec
AssertionError: False is not true
test_task_imsmooth.py:98: in tearDown
    self.assertTrue(len(_tb.showcache()) == 0)
E   AssertionError: False is not true
Skipped tests 10
Status Test Failing since View job
Skipped test_tool_sdm SdmFrommsTest.test12
Test Tools Many Linux 2.28 Py3.12
Skipped test_tool_sdm SdmFrommsTest.test10
Test Tools Many Linux 2.28 Py3.12
Skipped test_tool_sdm SdmFrommsTest.test10
Test Tools macOS 15 Py3.12
Skipped test_tool_sdm SdmFrommsTest.test12
Test Tools macOS 15 Py3.12
Skipped test_tool_sdm_toms asdm_import7.test7_lazy3
Test Tools Many Linux 2.28 Py3.12
Skipped test_tool_sdm_toms asdm_import7.test7_skiprows1
Test Tools Many Linux 2.28 Py3.12
Skipped test_tool_sdm_toms asdm_import7.test7_lazy3
Test Tools macOS 15 Py3.12
Skipped test_tool_sdm_toms asdm_import7.test7_skiprows1
Test Tools macOS 15 Py3.12
Skipped test_tool_simulator sm_settrop_test.test_smsettrop
Test Tools Many Linux 2.28 Py3.12
Skipped test_tool_simulator sm_settrop_test.test_smsettrop
Test Tools macOS 15 Py3.12