Build: #1 failed

Job: Test Tasks macOS 15 Py3.12 failed

Test results

  • 13 tests in total
  • 13 tests failed
  • 13 failures are new
  • 3 seconds taken in total.

Build 1 has the following 13 errors: 13 new failure(s) occurred since the previous build.

New test failures 13
Status Test Duration
Collapse Failed test_task_imsmooth imsmooth_test.test_beam
< 1 sec
RuntimeError: Cannot understand source values
test_task_imsmooth.py:1238: in test_beam
    x = run_imsmooth(
test_task_imsmooth.py:57: in run_imsmooth
    return imsmooth(
../../../../casa6testenv/lib/python3.12/site-packages/casatasks/imsmooth.py:201: in __call__
    task_result = _imsmooth_t( _pc.document['imagename'], _pc.document['kernel'], _pc.document['major'], _pc.document['minor'], _pc.document['pa'], _pc.document['targetres'], _pc.document['kimage'], _pc.document['scale'], _pc.document['region'], _pc.document['box'], _pc.document['chans'], _pc.document['stokes'], _pc.document['mask'], _pc.document['outfile'], _pc.document['stretch'], _pc.document['overwrite'], _pc.document['beam'] )
                  ^^^^^^^^^^^^^^^^^^^^^^^^^^^^^^^^^^^^^^^^^^^^^^^^^^^^^^^^^^^^^^^^^^^^^^^^^^^^^^^^^^^^^^^^^^^^^^^^^^^^^^^^^^^^^^^^^^^^^^^^^^^^^^^^^^^^^^^^^^^^^^^^^^^^^^^^^^^^^^^^^^^^^^^^^^^^^^^^^^^^^^^^^^^^^^^^^^^^^^^^^^^^^^^^^^^^^^^^^^^^^^^^^^^^^^^^^^^^^^^^^^^^^^^^^^^^^^^^^^^^^^^^^^^^^^^^^^^^^^^^^^^^^^^^^^^^^^^^^^^^^^^^^^^^^^^^^^^^^^^^^^^^^^^^^^^^^^^^^^^^^^^^^^^^^^^^^^^^^^^^^^^^^^^^^^^^^^^^^^^^^^^^^^^^^^^^^^^^^^^^^^^^^^^^^^^^^^^^^
(16 more lines...)
Collapse Failed test_task_imsmooth imsmooth_test.test_commonbeam
< 1 sec
RuntimeError: Cannot understand source values
test_task_imsmooth.py:1316: in test_commonbeam
    imsmooth(
../../../../casa6testenv/lib/python3.12/site-packages/casatasks/imsmooth.py:201: in __call__
    task_result = _imsmooth_t( _pc.document['imagename'], _pc.document['kernel'], _pc.document['major'], _pc.document['minor'], _pc.document['pa'], _pc.document['targetres'], _pc.document['kimage'], _pc.document['scale'], _pc.document['region'], _pc.document['box'], _pc.document['chans'], _pc.document['stokes'], _pc.document['mask'], _pc.document['outfile'], _pc.document['stretch'], _pc.document['overwrite'], _pc.document['beam'] )
                  ^^^^^^^^^^^^^^^^^^^^^^^^^^^^^^^^^^^^^^^^^^^^^^^^^^^^^^^^^^^^^^^^^^^^^^^^^^^^^^^^^^^^^^^^^^^^^^^^^^^^^^^^^^^^^^^^^^^^^^^^^^^^^^^^^^^^^^^^^^^^^^^^^^^^^^^^^^^^^^^^^^^^^^^^^^^^^^^^^^^^^^^^^^^^^^^^^^^^^^^^^^^^^^^^^^^^^^^^^^^^^^^^^^^^^^^^^^^^^^^^^^^^^^^^^^^^^^^^^^^^^^^^^^^^^^^^^^^^^^^^^^^^^^^^^^^^^^^^^^^^^^^^^^^^^^^^^^^^^^^^^^^^^^^^^^^^^^^^^^^^^^^^^^^^^^^^^^^^^^^^^^^^^^^^^^^^^^^^^^^^^^^^^^^^^^^^^^^^^^^^^^^^^^^^^^^^^^^^^
../../../../casa6testenv/lib/python3.12/site-packages/casatasks/private/callabletask.py:31: in wrapper
    retval = func(*args, **kwargs)
(14 more lines...)
Collapse Failed test_task_imsmooth imsmooth_test.test_conserve_flux
< 1 sec
AssertionError: False is not true
test_task_imsmooth.py:98: in tearDown
    self.assertTrue(len(_tb.showcache()) == 0)
E   AssertionError: False is not true
Collapse Failed test_task_imsmooth imsmooth_test.test_copying_of_input_mask
< 1 sec
AssertionError: False is not true
test_task_imsmooth.py:98: in tearDown
    self.assertTrue(len(_tb.showcache()) == 0)
E   AssertionError: False is not true
Collapse Failed test_task_imsmooth imsmooth_test.test_history
< 1 sec
AssertionError: False is not true
test_task_imsmooth.py:98: in tearDown
    self.assertTrue(len(_tb.showcache()) == 0)
E   AssertionError: False is not true
Collapse Failed test_task_imsmooth imsmooth_test.test_image_kernel
< 1 sec
AssertionError: False is not true
test_task_imsmooth.py:98: in tearDown
    self.assertTrue(len(_tb.showcache()) == 0)
E   AssertionError: False is not true
Collapse Failed test_task_imsmooth imsmooth_test.test_input
< 1 sec
RuntimeError: Exception: Major axis must have angular units (pix is not)..
... thrown by void casacore::GaussianBeam::setMajorMinor(const Quantity &, const Quantity &) at File: ../../scimath/Mathematics/GaussianBeam.cc, line: 152
test_task_imsmooth.py:344: in test_input
    results = imsmooth( tiny, major='2pix', minor='1pix', pa="deg", outfile=outfile)
              ^^^^^^^^^^^^^^^^^^^^^^^^^^^^^^^^^^^^^^^^^^^^^^^^^^^^^^^^^^^^^^^^^^^^^^
../../../../casa6testenv/lib/python3.12/site-packages/casatasks/imsmooth.py:201: in __call__
    task_result = _imsmooth_t( _pc.document['imagename'], _pc.document['kernel'], _pc.document['major'], _pc.document['minor'], _pc.document['pa'], _pc.document['targetres'], _pc.document['kimage'], _pc.document['scale'], _pc.document['region'], _pc.document['box'], _pc.document['chans'], _pc.document['stokes'], _pc.document['mask'], _pc.document['outfile'], _pc.document['stretch'], _pc.document['overwrite'], _pc.document['beam'] )
                  ^^^^^^^^^^^^^^^^^^^^^^^^^^^^^^^^^^^^^^^^^^^^^^^^^^^^^^^^^^^^^^^^^^^^^^^^^^^^^^^^^^^^^^^^^^^^^^^^^^^^^^^^^^^^^^^^^^^^^^^^^^^^^^^^^^^^^^^^^^^^^^^^^^^^^^^^^^^^^^^^^^^^^^^^^^^^^^^^^^^^^^^^^^^^^^^^^^^^^^^^^^^^^^^^^^^^^^^^^^^^^^^^^^^^^^^^^^^^^^^^^^^^^^^^^^^^^^^^^^^^^^^^^^^^^^^^^^^^^^^^^^^^^^^^^^^^^^^^^^^^^^^^^^^^^^^^^^^^^^^^^^^^^^^^^^^^^^^^^^^^^^^^^^^^^^^^^^^^^^^^^^^^^^^^^^^^^^^^^^^^^^^^^^^^^^^^^^^^^^^^^^^^^^^^^^^^^^^^^
(17 more lines...)
Collapse Failed test_task_imsmooth imsmooth_test.test_multibeam
< 1 sec
AssertionError: False is not true
test_task_imsmooth.py:98: in tearDown
    self.assertTrue(len(_tb.showcache()) == 0)
E   AssertionError: False is not true
Collapse Failed test_task_imsmooth imsmooth_test.test_overwrite
< 1 sec
AssertionError: False is not true
test_task_imsmooth.py:98: in tearDown
    self.assertTrue(len(_tb.showcache()) == 0)
E   AssertionError: False is not true
Collapse Failed test_task_imsmooth imsmooth_test.test_region
< 1 sec
AssertionError: False is not true
test_task_imsmooth.py:98: in tearDown
    self.assertTrue(len(_tb.showcache()) == 0)
E   AssertionError: False is not true
Collapse Failed test_task_imsmooth imsmooth_test.test_smooth
1 sec
AssertionError: False is not true
test_task_imsmooth.py:98: in tearDown
    self.assertTrue(len(_tb.showcache()) == 0)
E   AssertionError: False is not true
Collapse Failed test_task_imsmooth imsmooth_test.test_stretch
< 1 sec
AssertionError: False is not true
test_task_imsmooth.py:98: in tearDown
    self.assertTrue(len(_tb.showcache()) == 0)
E   AssertionError: False is not true
Collapse Failed test_task_imsmooth imsmooth_test.test_targetres
< 1 sec
AttributeError: 'bool' object has no attribute 'shape'
test_task_imsmooth.py:1060: in test_targetres
    run_imsmooth(
test_task_imsmooth.py:57: in run_imsmooth
    return imsmooth(
../../../../casa6testenv/lib/python3.12/site-packages/casatasks/imsmooth.py:201: in __call__
    task_result = _imsmooth_t( _pc.document['imagename'], _pc.document['kernel'], _pc.document['major'], _pc.document['minor'], _pc.document['pa'], _pc.document['targetres'], _pc.document['kimage'], _pc.document['scale'], _pc.document['region'], _pc.document['box'], _pc.document['chans'], _pc.document['stokes'], _pc.document['mask'], _pc.document['outfile'], _pc.document['stretch'], _pc.document['overwrite'], _pc.document['beam'] )
                  ^^^^^^^^^^^^^^^^^^^^^^^^^^^^^^^^^^^^^^^^^^^^^^^^^^^^^^^^^^^^^^^^^^^^^^^^^^^^^^^^^^^^^^^^^^^^^^^^^^^^^^^^^^^^^^^^^^^^^^^^^^^^^^^^^^^^^^^^^^^^^^^^^^^^^^^^^^^^^^^^^^^^^^^^^^^^^^^^^^^^^^^^^^^^^^^^^^^^^^^^^^^^^^^^^^^^^^^^^^^^^^^^^^^^^^^^^^^^^^^^^^^^^^^^^^^^^^^^^^^^^^^^^^^^^^^^^^^^^^^^^^^^^^^^^^^^^^^^^^^^^^^^^^^^^^^^^^^^^^^^^^^^^^^^^^^^^^^^^^^^^^^^^^^^^^^^^^^^^^^^^^^^^^^^^^^^^^^^^^^^^^^^^^^^^^^^^^^^^^^^^^^^^^^^^^^^^^^^^
(7 more lines...)