Build: #1 failed
Job: Test Tasks Many Linux 2.28 Py3.12 failed
Job result summary
- Completed
- Duration
- 2 minutes
- Agent
- casaci-4.cv.nrao.edu test agent8
- Revision
-
fca4920fd5894af7a8bc45e3d5a8675122e76335
- Total tests
- 13
- Fixed in
- #4 (Manual run by CASA adm account)
Tests
- 13 tests in total
- 13 tests failed
- 13 failures are new
- 4 seconds taken in total.
| Status | Test | Duration | |
|---|---|---|---|
| Collapse |
test_task_imsmooth
imsmooth_test.test_beam
|
< 1 sec | |
RuntimeError: Cannot understand source values
test_task_imsmooth.py:1238: in test_beam
x = run_imsmooth(
test_task_imsmooth.py:57: in run_imsmooth
return imsmooth(
../../../../venv/lib/python3.12/site-packages/casatasks/imsmooth.py:201: in __call__
task_result = _imsmooth_t( _pc.document['imagename'], _pc.document['kernel'], _pc.document['major'], _pc.document['minor'], _pc.document['pa'], _pc.document['targetres'], _pc.document['kimage'], _pc.document['scale'], _pc.document['region'], _pc.document['box'], _pc.document['chans'], _pc.document['stokes'], _pc.document['mask'], _pc.document['outfile'], _pc.document['stretch'], _pc.document['overwrite'], _pc.document['beam'] )
^^^^^^^^^^^^^^^^^^^^^^^^^^^^^^^^^^^^^^^^^^^^^^^^^^^^^^^^^^^^^^^^^^^^^^^^^^^^^^^^^^^^^^^^^^^^^^^^^^^^^^^^^^^^^^^^^^^^^^^^^^^^^^^^^^^^^^^^^^^^^^^^^^^^^^^^^^^^^^^^^^^^^^^^^^^^^^^^^^^^^^^^^^^^^^^^^^^^^^^^^^^^^^^^^^^^^^^^^^^^^^^^^^^^^^^^^^^^^^^^^^^^^^^^^^^^^^^^^^^^^^^^^^^^^^^^^^^^^^^^^^^^^^^^^^^^^^^^^^^^^^^^^^^^^^^^^^^^^^^^^^^^^^^^^^^^^^^^^^^^^^^^^^^^^^^^^^^^^^^^^^^^^^^^^^^^^^^^^^^^^^^^^^^^^^^^^^^^^^^^^^^^^^^^^^^^^^^^^
(16 more lines...)
|
|||
| Collapse |
test_task_imsmooth
imsmooth_test.test_commonbeam
|
< 1 sec | |
RuntimeError: Cannot understand source values
test_task_imsmooth.py:1316: in test_commonbeam
imsmooth(
../../../../venv/lib/python3.12/site-packages/casatasks/imsmooth.py:201: in __call__
task_result = _imsmooth_t( _pc.document['imagename'], _pc.document['kernel'], _pc.document['major'], _pc.document['minor'], _pc.document['pa'], _pc.document['targetres'], _pc.document['kimage'], _pc.document['scale'], _pc.document['region'], _pc.document['box'], _pc.document['chans'], _pc.document['stokes'], _pc.document['mask'], _pc.document['outfile'], _pc.document['stretch'], _pc.document['overwrite'], _pc.document['beam'] )
^^^^^^^^^^^^^^^^^^^^^^^^^^^^^^^^^^^^^^^^^^^^^^^^^^^^^^^^^^^^^^^^^^^^^^^^^^^^^^^^^^^^^^^^^^^^^^^^^^^^^^^^^^^^^^^^^^^^^^^^^^^^^^^^^^^^^^^^^^^^^^^^^^^^^^^^^^^^^^^^^^^^^^^^^^^^^^^^^^^^^^^^^^^^^^^^^^^^^^^^^^^^^^^^^^^^^^^^^^^^^^^^^^^^^^^^^^^^^^^^^^^^^^^^^^^^^^^^^^^^^^^^^^^^^^^^^^^^^^^^^^^^^^^^^^^^^^^^^^^^^^^^^^^^^^^^^^^^^^^^^^^^^^^^^^^^^^^^^^^^^^^^^^^^^^^^^^^^^^^^^^^^^^^^^^^^^^^^^^^^^^^^^^^^^^^^^^^^^^^^^^^^^^^^^^^^^^^^^
../../../../venv/lib/python3.12/site-packages/casatasks/private/callabletask.py:31: in wrapper
retval = func(*args, **kwargs)
(14 more lines...)
|
|||
| Collapse |
test_task_imsmooth
imsmooth_test.test_conserve_flux
|
< 1 sec | |
AssertionError: False is not true
test_task_imsmooth.py:98: in tearDown
self.assertTrue(len(_tb.showcache()) == 0)
E AssertionError: False is not true
|
|||
| Collapse |
test_task_imsmooth
imsmooth_test.test_copying_of_input_mask
|
< 1 sec | |
AssertionError: False is not true
test_task_imsmooth.py:98: in tearDown
self.assertTrue(len(_tb.showcache()) == 0)
E AssertionError: False is not true
|
|||
| Collapse |
test_task_imsmooth
imsmooth_test.test_history
|
< 1 sec | |
AssertionError: False is not true
test_task_imsmooth.py:98: in tearDown
self.assertTrue(len(_tb.showcache()) == 0)
E AssertionError: False is not true
|
|||
| Collapse |
test_task_imsmooth
imsmooth_test.test_image_kernel
|
< 1 sec | |
AssertionError: False is not true
test_task_imsmooth.py:98: in tearDown
self.assertTrue(len(_tb.showcache()) == 0)
E AssertionError: False is not true
|
|||
| Collapse |
test_task_imsmooth
imsmooth_test.test_input
|
< 1 sec | |
RuntimeError: Exception: Major axis must have angular units (pix is not)..
... thrown by void casacore::GaussianBeam::setMajorMinor(const Quantity&, const Quantity&) at File: /source/casa6/casatools/casacore/scimath/Mathematics/GaussianBeam.cc, line: 148
test_task_imsmooth.py:344: in test_input
results = imsmooth( tiny, major='2pix', minor='1pix', pa="deg", outfile=outfile)
^^^^^^^^^^^^^^^^^^^^^^^^^^^^^^^^^^^^^^^^^^^^^^^^^^^^^^^^^^^^^^^^^^^^^^
../../../../venv/lib/python3.12/site-packages/casatasks/imsmooth.py:201: in __call__
task_result = _imsmooth_t( _pc.document['imagename'], _pc.document['kernel'], _pc.document['major'], _pc.document['minor'], _pc.document['pa'], _pc.document['targetres'], _pc.document['kimage'], _pc.document['scale'], _pc.document['region'], _pc.document['box'], _pc.document['chans'], _pc.document['stokes'], _pc.document['mask'], _pc.document['outfile'], _pc.document['stretch'], _pc.document['overwrite'], _pc.document['beam'] )
^^^^^^^^^^^^^^^^^^^^^^^^^^^^^^^^^^^^^^^^^^^^^^^^^^^^^^^^^^^^^^^^^^^^^^^^^^^^^^^^^^^^^^^^^^^^^^^^^^^^^^^^^^^^^^^^^^^^^^^^^^^^^^^^^^^^^^^^^^^^^^^^^^^^^^^^^^^^^^^^^^^^^^^^^^^^^^^^^^^^^^^^^^^^^^^^^^^^^^^^^^^^^^^^^^^^^^^^^^^^^^^^^^^^^^^^^^^^^^^^^^^^^^^^^^^^^^^^^^^^^^^^^^^^^^^^^^^^^^^^^^^^^^^^^^^^^^^^^^^^^^^^^^^^^^^^^^^^^^^^^^^^^^^^^^^^^^^^^^^^^^^^^^^^^^^^^^^^^^^^^^^^^^^^^^^^^^^^^^^^^^^^^^^^^^^^^^^^^^^^^^^^^^^^^^^^^^^^^
(17 more lines...)
|
|||
| Collapse |
test_task_imsmooth
imsmooth_test.test_multibeam
|
< 1 sec | |
AssertionError: False is not true
test_task_imsmooth.py:98: in tearDown
self.assertTrue(len(_tb.showcache()) == 0)
E AssertionError: False is not true
|
|||
| Collapse |
test_task_imsmooth
imsmooth_test.test_overwrite
|
< 1 sec | |
AssertionError: False is not true
test_task_imsmooth.py:98: in tearDown
self.assertTrue(len(_tb.showcache()) == 0)
E AssertionError: False is not true
|
|||
| Collapse |
test_task_imsmooth
imsmooth_test.test_region
|
< 1 sec | |
AssertionError: False is not true
test_task_imsmooth.py:98: in tearDown
self.assertTrue(len(_tb.showcache()) == 0)
E AssertionError: False is not true
|
|||
| Collapse |
test_task_imsmooth
imsmooth_test.test_smooth
|
2 secs | |
AssertionError: False is not true
test_task_imsmooth.py:98: in tearDown
self.assertTrue(len(_tb.showcache()) == 0)
E AssertionError: False is not true
|
|||
| Collapse |
test_task_imsmooth
imsmooth_test.test_stretch
|
< 1 sec | |
AssertionError: False is not true
test_task_imsmooth.py:98: in tearDown
self.assertTrue(len(_tb.showcache()) == 0)
E AssertionError: False is not true
|
|||
| Collapse |
test_task_imsmooth
imsmooth_test.test_targetres
|
< 1 sec | |
AttributeError: 'bool' object has no attribute 'shape'
test_task_imsmooth.py:1060: in test_targetres
run_imsmooth(
test_task_imsmooth.py:57: in run_imsmooth
return imsmooth(
../../../../venv/lib/python3.12/site-packages/casatasks/imsmooth.py:201: in __call__
task_result = _imsmooth_t( _pc.document['imagename'], _pc.document['kernel'], _pc.document['major'], _pc.document['minor'], _pc.document['pa'], _pc.document['targetres'], _pc.document['kimage'], _pc.document['scale'], _pc.document['region'], _pc.document['box'], _pc.document['chans'], _pc.document['stokes'], _pc.document['mask'], _pc.document['outfile'], _pc.document['stretch'], _pc.document['overwrite'], _pc.document['beam'] )
^^^^^^^^^^^^^^^^^^^^^^^^^^^^^^^^^^^^^^^^^^^^^^^^^^^^^^^^^^^^^^^^^^^^^^^^^^^^^^^^^^^^^^^^^^^^^^^^^^^^^^^^^^^^^^^^^^^^^^^^^^^^^^^^^^^^^^^^^^^^^^^^^^^^^^^^^^^^^^^^^^^^^^^^^^^^^^^^^^^^^^^^^^^^^^^^^^^^^^^^^^^^^^^^^^^^^^^^^^^^^^^^^^^^^^^^^^^^^^^^^^^^^^^^^^^^^^^^^^^^^^^^^^^^^^^^^^^^^^^^^^^^^^^^^^^^^^^^^^^^^^^^^^^^^^^^^^^^^^^^^^^^^^^^^^^^^^^^^^^^^^^^^^^^^^^^^^^^^^^^^^^^^^^^^^^^^^^^^^^^^^^^^^^^^^^^^^^^^^^^^^^^^^^^^^^^^^^^^
(7 more lines...)
|
|||
Error summary
The build generated some errors. See the full build log for more details.
/opt/ci_workspace/casa/bamboo/agent8/temp/CASASPECS-DEVTESTPY312158-TTM228PY312-1-ScriptBuildTask-9579118165607809419.sh: line 2: cd: /opt/casa/data/casa-data-req: No such file or directory
Error response from daemon: No such container: wheel-container-test_159678465
Error response from daemon: No such container: wheel-container-test_159678465
% Total % Received % Xferd Average Speed Time Time Time Current
Dload Upload Total Spent Left Speed
0 0 0 0 0 0 0 0 --:--:-- --:--:-- --:--:-- 0
100 6002k 100 6002k 0 0 80.3M 0 --:--:-- --:--:-- --:--:-- 80.3M
Switched to a new branch 'CAS-14803'
Updated 0 paths from f67e31d4f3
Updated 0 paths from f67e31d4f3
Updated 0 paths from 3aa39f022e
Error response from daemon: No such container: wheel-container-test_159678465
Error response from daemon: No such container: wheel-container-test_159678465
% Total % Received % Xferd Average Speed Time Time Time Current
Dload Upload Total Spent Left Speed
0 0 0 0 0 0 0 0 --:--:-- --:--:-- --:--:-- 0
100 6002k 100 6002k 0 0 80.3M 0 --:--:-- --:--:-- --:--:-- 80.3M
Switched to a new branch 'CAS-14803'
Updated 0 paths from f67e31d4f3
Updated 0 paths from f67e31d4f3
Updated 0 paths from 3aa39f022e