Build: #4 failed Manual run by CASA adm account

Test results

  • 1,424 tests in total
  • 2 tests failed
  • 2 tests were fixed
  • 10 tests were quarantined / skipped
  • 40 minutes taken in total.
Existing test failures 2
Status Test Failing since View job Duration
AssertionError: False is not true
test_casaconfig.py:176: in test_casaconfig_measures_available
    self.assertTrue(any(elem in self.get_meas_avail() for elem in [measuresdata_today, measuresdata_yesterday]))
E   AssertionError: False is not true
AssertionError: False is not true
test_casaconfig.py:176: in test_casaconfig_measures_available
    self.assertTrue(any(elem in self.get_meas_avail() for elem in [measuresdata_today, measuresdata_yesterday]))
E   AssertionError: False is not true
Fixed tests 2
Status Test Failing since View job Duration
Successful test_casaconfig casaconfig_test.test_casaconfig_measures_update
Failing since build #3 (Manual run by CASA adm account) Test Tasks Many Linux 2.28 Py3.12 5 secs
Successful test_casaconfig casaconfig_test.test_casaconfig_measures_update
Failing since build #3 (Manual run by CASA adm account) Test Tasks macOS 15 Py3.12 7 secs
Skipped tests 10
Status Test Failing since View job
Skipped test_tool_sdm SdmFrommsTest.test10
Test Tools Many Linux 2.28 Py3.12
Skipped test_tool_sdm SdmFrommsTest.test12
Test Tools Many Linux 2.28 Py3.12
Skipped test_tool_sdm SdmFrommsTest.test10
Test Tools macOS 15 Py3.12
Skipped test_tool_sdm SdmFrommsTest.test12
Test Tools macOS 15 Py3.12
Skipped test_tool_sdm_toms asdm_import7.test7_lazy3
Test Tools Many Linux 2.28 Py3.12
Skipped test_tool_sdm_toms asdm_import7.test7_skiprows1
Test Tools Many Linux 2.28 Py3.12
Skipped test_tool_sdm_toms asdm_import7.test7_skiprows1
Test Tools macOS 15 Py3.12
Skipped test_tool_sdm_toms asdm_import7.test7_lazy3
Test Tools macOS 15 Py3.12
Skipped test_tool_simulator sm_settrop_test.test_smsettrop
Test Tools Many Linux 2.28 Py3.12
Skipped test_tool_simulator sm_settrop_test.test_smsettrop
Test Tools macOS 15 Py3.12