Build: #8 failed

Job: Test Tasks Many Linux 2.28 Remove Casatasks import failed

Job result summary

Completed
Duration
150 minutes
Agent
cbt-el7-1.cv.nrao.edu (2)
Total tests
341
Failing since
#7 (Manual run by Akeem Wells – )

Tests

  • 341 tests in total
  • 1 test failed
  • 17 tests were quarantined / skipped
  • 145 minutes taken in total.
Existing test failures 1
Status Test Failing since Duration
AssertionError: False is not true
Traceback (most recent call last):
  File "/home/casatest/casa6/casatasks/tests/casashell_tests/test_task_tclean_casashell.py", line 4339, in test_widefield_mvc_squint_awp2
    self.assertTrue(self.check_final(report))
AssertionError: False is not true

Error summary

The build generated some errors. See the full build log for more details.

Error response from daemon: No such container: wheel-container-test
Error response from daemon: No such container: wheel-container-test
cat: /home/casatest/.casa/toolrc.py: No such file or directory
Switched to a new branch 'CAS-14882'

[notice] A new release of pip is available: 24.0 -> 26.2.1
[notice] To update, run: pip3 install --upgrade pip