Build: #7 failed

Job: Test Tasks Many Linux 2.28 Remove Casatasks import failed

Job result summary

Completed
Duration
402 minutes
Agent
cbt-el7-6.cv.nrao.edu (2)
Total tests
3681

Tests

  • 3,681 tests in total
  • 1 test failed
  • 1 failure is new
  • 143 tests were quarantined / skipped
  • 370 minutes taken in total.
New test failures 1
Status Test Duration
Collapse Failed test_widefield test_widefield_mvc_squint_awp2
21 mins
AssertionError: False is not true
Traceback (most recent call last):
  File "/home/casatest/casa6/casatasks/tests/casashell_tests/test_task_tclean_casashell.py", line 4339, in test_widefield_mvc_squint_awp2
    self.assertTrue(self.check_final(report))
AssertionError: False is not true

Error summary

The build generated some errors. See the full build log for more details.

Error response from daemon: No such container: wheel-container-test
Error response from daemon: No such container: wheel-container-test
From https://open-bitbucket.nrao.edu/scm/casa/casa-data
   db4589d..cd0c501  master     -> origin/master
Downloading geodetic/IERSpredict/table.dat (3.3 KB)
Downloading geodetic/IERSpredict/table.f0 (296 KB)
Downloading geodetic/IERSpredict/table.lock (325 B)
cat: /home/casatest/.casa/toolrc.py: No such file or directory
Switched to a new branch 'CAS-14882'

[notice] A new release of pip is available: 24.0 -> 26.2.1
[notice] To update, run: pip3 install --upgrade pip