Tools and Tasks tests for Python 3.12

Build: #288 failed

Job: Test Tools Many Linux 2.34 Rocky 9.5 Py3.12 was successful

Build log

The build generated 53,669 lines of output.   The output is too long and has been truncated to the last 1,000 lines. Download or view full build log.

05-Oct-2026 20:39:38 2026-10-06 00:39:39        INFO        BJonesPoly::updateCalTable()         Storing calibration in table bpoly
05-Oct-2026 20:39:39 2026-10-06 00:39:39        INFO        BJonesPoly::selfSolveOne()         THIS IS THE NEW MULTI-SPW-FLEXIBLE VERSION
05-Oct-2026 20:39:39 2026-10-06 00:39:39        INFO        BJonesPoly::selfSolveOne()         Fitting bandpass amplitude and phase polynomials.
05-Oct-2026 20:39:39 2026-10-06 00:39:39        INFO        BJonesPoly::selfSolveOne()         Polynomial degree for amplitude is 5
05-Oct-2026 20:39:39 2026-10-06 00:39:39        INFO        BJonesPoly::selfSolveOne()         Polynomial degree for phase is 7
05-Oct-2026 20:39:39 2026-10-06 00:39:39        INFO        BJonesPoly::selfSolveOne()         Spectral grid for fit will have 63 points spaced by 24.4141 kHz.
05-Oct-2026 20:39:39 2026-10-06 00:39:39        INFO        BJonesPoly::selfSolveOne()         Polynomial solution will be valid over frequency range: 1.41267e+09-1.41418e+09 Hz.
05-Oct-2026 20:39:39 2026-10-06 00:39:39        INFO        BJonesPoly::selfSolveOne()         Total bandwidth: 1538.09 kHz.
05-Oct-2026 20:39:39 2026-10-06 00:39:39        INFO        BJonesPoly::selfSolveOne()         Found data for 351 baselines among 27 antennas.
05-Oct-2026 20:39:39 2026-10-06 00:39:39        INFO        BJonesPoly::selfSolveOne()         Fitting amplitude polynomial.
05-Oct-2026 20:39:39 2026-10-06 00:39:39        INFO        BJonesPoly::selfSolveOne()         Per-baseline RMS log(Amp) statistics: (min/mean/max) = 0.0750931/0.0978998/0.125897
05-Oct-2026 20:39:39 2026-10-06 00:39:39        INFO        BJonesPoly::selfSolveOne()         Fitting phase polynomial.
05-Oct-2026 20:39:39 2026-10-06 00:39:39        INFO        BJonesPoly::selfSolveOne()         Per baseline RMS phase (deg) statistics: (min/mean/max) = 2.72932/3.98787/5.33715
05-Oct-2026 20:39:39 2026-10-06 00:39:39        INFO        BJonesPoly::selfSolveOne()         Fitting amplitude polynomial.
05-Oct-2026 20:39:39 2026-10-06 00:39:39        INFO        BJonesPoly::selfSolveOne()         Per-baseline RMS log(Amp) statistics: (min/mean/max) = 0.0658572/0.0972125/0.140794
05-Oct-2026 20:39:39 2026-10-06 00:39:39        INFO        BJonesPoly::selfSolveOne()         Fitting phase polynomial.
05-Oct-2026 20:39:39 2026-10-06 00:39:39        INFO        BJonesPoly::selfSolveOne()         Per baseline RMS phase (deg) statistics: (min/mean/max) = 2.97943/3.97841/5.72903
05-Oct-2026 20:39:39 2026-10-06 00:39:39        INFO        BJonesPoly::selfSolveOne()         Normalizing antenna-based solutions.
05-Oct-2026 20:39:39 2026-10-06 00:39:39        INFO        BJonesPoly::updateCalTable()         Storing calibration in table bpoly
05-Oct-2026 20:39:39 2026-10-06 00:39:39        INFO        Calibrater::solve          Found good BPOLY solutions in 7 slots.
05-Oct-2026 20:39:39 2026-10-06 00:39:39        INFO        calibrater::solve        Finished solving.
05-Oct-2026 20:39:39 2026-10-06 00:39:39        WARN        calibrater::setvi(bool,bool)        Forcing use of NEW VisibilityIterator.
05-Oct-2026 20:39:39 test_tool_calibrater.py::calibrater_test::test_solveBandpass
05-Oct-2026 20:39:39 Check that solve band poly creates the output table
05-Oct-2026 20:39:39 PASSED
05-Oct-2026 20:39:39
05-Oct-2026 20:39:39 2026-10-06 00:39:39        WARN        calibrater::setvi(bool,bool)        Forcing use of OLD VisibilityIterator.
05-Oct-2026 20:39:39 2026-10-06 00:39:39        INFO        calibrater::open        ****Using OLD VI-driven calibrater tool****
05-Oct-2026 20:39:39 2026-10-06 00:39:39        INFO        calibrater::open        Opening MS: ngc5921.ms for calibration.
05-Oct-2026 20:39:39 2026-10-06 00:39:39        INFO                Clearing all model records in MS header.
05-Oct-2026 20:39:39 2026-10-06 00:39:39        INFO        VisSetUtil::addScrCols        Adding MODEL_DATA and CORRECTED_DATA column(s).
05-Oct-2026 20:39:39 2026-10-06 00:39:39        INFO        VisSetUtil::initScrCols        Initializing MODEL_DATA to (unity).
05-Oct-2026 20:39:39 2026-10-06 00:39:39        INFO        VisSetUtil::initScrCols        Initialized 22653 rows.
05-Oct-2026 20:39:39 2026-10-06 00:39:39        INFO        Calibrater::        Initializing nominal selection to the whole MS.
05-Oct-2026 20:39:39 2026-10-06 00:39:39        INFO        calibrater::setsolvegainspline        Beginning setsolvegainspline--(MSSelection version)-------
05-Oct-2026 20:39:39 2026-10-06 00:39:39        INFO        Calibrater::setsolvegainspline        Arranging to SOLVE:
05-Oct-2026 20:39:39 2026-10-06 00:39:39        INFO        Calibrater::setsolvegainspline        .   GSPLINE: table=gainspline append=false solint=inf refantmode='flex' refant='none' minsnr=0 apmode=AMP solnorm=false
05-Oct-2026 20:39:39 2026-10-06 00:39:39        INFO        calibrater::solve        Beginning solve-----------------------------
05-Oct-2026 20:39:39 2026-10-06 00:39:39        INFO        Calibrater::solve        The following calibration terms are arranged for apply:
05-Oct-2026 20:39:39 2026-10-06 00:39:39        INFO        Calibrater::solve        .   (None)
05-Oct-2026 20:39:39 2026-10-06 00:39:39        INFO        Calibrater::solve        The following calibration term is arranged for solve:
05-Oct-2026 20:39:39 2026-10-06 00:39:39        INFO        Calibrater::solve        .   GSPLINE: table=gainspline append=false solint=inf refantmode='flex' refant='none' minsnr=0 apmode=AMP solnorm=false
05-Oct-2026 20:39:39 2026-10-06 00:39:39        INFO        GJonesSpline::solve()         Fitting time-dependent cubic splines.
05-Oct-2026 20:39:39 2026-10-06 00:39:39        INFO        GJonesSpline::solve()         Solving for phase splines with splinetime= 10800
05-Oct-2026 20:39:39 2026-10-06 00:39:39        INFO        GJonesSpline::solve()         Solving for amplitude splines with splinetime= 10800
05-Oct-2026 20:39:39 2026-10-06 00:39:39        INFO        GJonesSpline::solve()         Accumulating data for:  field= 1331+30500002_0, spw= 0, nchan= 63
05-Oct-2026 20:39:39 2026-10-06 00:39:39        INFO        GJonesSpline::solve()         Accumulating data for:  field= 1445+09900002_0, spw= 0, nchan= 63
05-Oct-2026 20:39:39 2026-10-06 00:39:40        INFO        GJonesSpline::solve()         Accumulating data for:  field= N5921_2, spw= 0, nchan= 63
05-Oct-2026 20:39:39 2026-10-06 00:39:40        INFO        GJonesSpline::solve()         Number of timestamps in data = 60
05-Oct-2026 20:39:39 2026-10-06 00:39:40        INFO        GJonesSpline::getKnots()         Gridded splinetime = 5280 sec.
05-Oct-2026 20:39:39 2026-10-06 00:39:40        INFO        GJonesSpline::solve()         Number of cubic spline control points = 4
05-Oct-2026 20:39:39 2026-10-06 00:39:40        INFO        GJonesSpline::solve()         Number of cubic spline knots = 8
05-Oct-2026 20:39:39 2026-10-06 00:39:40        INFO        GJonesSpline::solve()         Number of cubic spline segments = 1
05-Oct-2026 20:39:39 2026-10-06 00:39:40        INFO        GJonesSpline::solve()         Fitting amplitude spline.
05-Oct-2026 20:39:39 test_tool_calibrater.py::calibrater_test::test_solveGainspline  DPBTRF ;problem leading minor           23
05-Oct-2026 20:39:39 DPBTRF ;problem leading minor           23
05-Oct-2026 20:39:39 2026-10-06 00:39:40        INFO        GJonesSpline::solve()         Searching for and correcting phase-wraps on each baseline.
05-Oct-2026 20:39:39 2026-10-06 00:39:40        INFO        GJonesSpline::solve()         Fitting phase spline.
05-Oct-2026 20:39:39 DPBTRF ;problem leading minor           22
05-Oct-2026 20:39:39 DPBTRF ;problem leading minor           22
05-Oct-2026 20:39:39 2026-10-06 00:39:40        INFO        GJonesSpline::updateCalTable         Storing solutions in table gainspline
05-Oct-2026 20:39:39 2026-10-06 00:39:40        INFO        calibrater::solve        Finished solving.
05-Oct-2026 20:39:39 2026-10-06 00:39:40        WARN        calibrater::setvi(bool,bool)        Forcing use of NEW VisibilityIterator.
05-Oct-2026 20:39:39
05-Oct-2026 20:39:39 Check that solve gain spline creates the output table 
05-Oct-2026 20:39:39 PASSED
05-Oct-2026 20:39:39
05-Oct-2026 20:39:39 2026-10-06 00:39:40        INFO        calibrater::open        ****Using NEW VI2-driven calibrater tool****
05-Oct-2026 20:39:39 2026-10-06 00:39:40        INFO        calibrater::open        Opening MS: gaincaltest2.ms for calibration.
05-Oct-2026 20:39:39 2026-10-06 00:39:40        INFO                Clearing all model records in MS header.
05-Oct-2026 20:39:39 2026-10-06 00:39:40        INFO        VisSetUtil::addScrCols        Adding MODEL_DATA and CORRECTED_DATA column(s).
05-Oct-2026 20:39:40 2026-10-06 00:39:40        INFO        VisSetUtil::initScrCols        Initializing MODEL_DATA to (unity).
05-Oct-2026 20:39:40 2026-10-06 00:39:40        INFO        VisSetUtil::initScrCols        Initialized 328860 rows.
05-Oct-2026 20:39:40 2026-10-06 00:39:40        INFO        Calibrater::        Initializing nominal selection to the whole MS.
05-Oct-2026 20:39:40 2026-10-06 00:39:40        INFO        calibrater::specifycal        Beginning specifycal-----------------------
05-Oct-2026 20:39:40 2026-10-06 00:39:40        INFO                Creating G Jones table from specified parameters.
05-Oct-2026 20:39:40 2026-10-06 00:39:40        INFO                Generating 'G' corrections.
05-Oct-2026 20:39:40 2026-10-06 00:39:40        INFO                Specified parameter(s) (per spw and pol) repeated on all antennas.
05-Oct-2026 20:39:40 2026-10-06 00:39:40        INFO                Specified parameter(s) (per spw and antenna) repeated on all polarizations.
05-Oct-2026 20:39:40 2026-10-06 00:39:40        INFO                spwId=1 antId=<all> polId=<all> parameter= 3   (ip0,ip1 = [0, 0, 0],[1, 0, 9])
05-Oct-2026 20:39:40 2026-10-06 00:39:40        INFO                Writing solutions to table: testcalout.cal
05-Oct-2026 20:39:40 2026-10-06 00:39:41        WARN        calibrater::setvi(bool,bool)        Already using NEW VisibilityIterator.
05-Oct-2026 20:39:40 test_tool_calibrater.py::calibrater_test::test_specifyCal
05-Oct-2026 20:39:40 Check that specifycal can set values for specific spws and antennas
05-Oct-2026 20:39:40 PASSED
05-Oct-2026 20:39:40
05-Oct-2026 20:39:40 2026-10-06 00:39:41        WARN        calibrater::setvi(bool,bool)        Forcing use of OLD VisibilityIterator.
05-Oct-2026 20:39:40 2026-10-06 00:39:41        INFO        calibrater::open        ****Using OLD VI-driven calibrater tool****
05-Oct-2026 20:39:40 2026-10-06 00:39:41        INFO        calibrater::open        Opening MS: gaincaltest2.ms for calibration.
05-Oct-2026 20:39:40 2026-10-06 00:39:41        INFO                Clearing all model records in MS header.
05-Oct-2026 20:39:40 2026-10-06 00:39:41        INFO        VisSetUtil::addScrCols        Adding MODEL_DATA and CORRECTED_DATA column(s).
05-Oct-2026 20:39:41 2026-10-06 00:39:41        INFO        VisSetUtil::initScrCols        Initializing MODEL_DATA to (unity).
05-Oct-2026 20:39:41 2026-10-06 00:39:41        INFO        VisSetUtil::initScrCols        Initialized 328860 rows.
05-Oct-2026 20:39:41 2026-10-06 00:39:41        INFO        Calibrater::        Initializing nominal selection to the whole MS.
05-Oct-2026 20:39:41 2026-10-06 00:39:41        INFO        calibrater::setapply        Beginning setapply--(MSSelection version)-------
05-Oct-2026 20:39:41 2026-10-06 00:39:41        INFO        Calibrater::setapply(type, applypar)        Arranging to APPLY:
05-Oct-2026 20:39:41 2026-10-06 00:39:42        INFO        Calibrater::setapply(type, applypar)        .   G Jones: table=gaincaltest2.ms.G0 select= interp=linear spwmap=[-1] calWt=false
05-Oct-2026 20:39:41 2026-10-06 00:39:42        INFO        calibrater::setsolve        Beginning setsolve--(MSSelection version)-------
05-Oct-2026 20:39:41 2026-10-06 00:39:42        INFO        Calibrater::setsolve        Arranging to SOLVE:
05-Oct-2026 20:39:41 2026-10-06 00:39:42        INFO        Calibrater::setsolve        .   Mf Mueller: table=output.ms append=false solint=inf,none refantmode='flex' refant='none' minsnr=0 apmode=AP solnorm=false
05-Oct-2026 20:39:41 2026-10-06 00:39:42        INFO        Calibrater::state        The following calibration terms are arranged for apply:
05-Oct-2026 20:39:41 2026-10-06 00:39:42        INFO        Calibrater::state        .   G Jones: table=gaincaltest2.ms.G0 select= interp=linear spwmap=[-1] calWt=false
05-Oct-2026 20:39:41 2026-10-06 00:39:42        INFO        Calibrater::state        The following calibration term is arranged for solve:
05-Oct-2026 20:39:41 2026-10-06 00:39:42        INFO        Calibrater::state        .   Mf Mueller: table=output.ms append=false solint=inf,none refantmode='flex' refant='none' minsnr=0 apmode=AP solnorm=false
05-Oct-2026 20:39:41 2026-10-06 00:39:42        INFO        calibrater::solve        Beginning solve-----------------------------
05-Oct-2026 20:39:41 2026-10-06 00:39:42        INFO        Calibrater::solve        The following calibration terms are arranged for apply:
05-Oct-2026 20:39:41 2026-10-06 00:39:42        INFO        Calibrater::solve        .   G Jones: table=gaincaltest2.ms.G0 select= interp=linear spwmap=[-1] calWt=false
05-Oct-2026 20:39:41 2026-10-06 00:39:42        INFO        Calibrater::solve        The following calibration term is arranged for solve:
05-Oct-2026 20:39:41 2026-10-06 00:39:42        INFO        Calibrater::solve        .   Mf Mueller: table=output.ms append=false solint=inf,none refantmode='flex' refant='none' minsnr=0 apmode=AP solnorm=false
05-Oct-2026 20:39:41 2026-10-06 00:39:42        INFO                Solving for Mf Mueller
05-Oct-2026 20:39:41 2026-10-06 00:39:42        INFO                For solint = inf, found 84 solution intervals.
05-Oct-2026 20:39:42 2026-10-06 00:39:42        INFO                  Found good Mf Mueller solutions in 84 intervals.
05-Oct-2026 20:39:42 2026-10-06 00:39:42        INFO                Writing solutions to table: output.ms
05-Oct-2026 20:39:42 2026-10-06 00:39:42        INFO        calibrater::solve        Finished solving.
05-Oct-2026 20:39:42 2026-10-06 00:39:42        WARN        calibrater::setvi(bool,bool)        Forcing use of NEW VisibilityIterator.
05-Oct-2026 20:39:42 test_tool_calibrater.py::calibrater_test::test_standardPath
05-Oct-2026 20:39:42 open setapply setsolve state solve close 
05-Oct-2026 20:39:42 PASSED
05-Oct-2026 20:39:42
05-Oct-2026 20:39:42 2026-10-06 00:39:43        INFO        calibrater::open        ****Using NEW VI2-driven calibrater tool****
05-Oct-2026 20:39:42 2026-10-06 00:39:43        INFO        calibrater::open        Opening MS: gaincaltest2.ms for calibration.
05-Oct-2026 20:39:42 2026-10-06 00:39:43        INFO                Clearing all model records in MS header.
05-Oct-2026 20:39:42 2026-10-06 00:39:43        INFO        VisSetUtil::addScrCols        Adding MODEL_DATA and CORRECTED_DATA column(s).
05-Oct-2026 20:39:43 2026-10-06 00:39:43        INFO        VisSetUtil::initScrCols        Initializing MODEL_DATA to (unity).
05-Oct-2026 20:39:43 2026-10-06 00:39:43        INFO        VisSetUtil::initScrCols        Initialized 328860 rows.
05-Oct-2026 20:39:43 2026-10-06 00:39:43        INFO        Calibrater::        Initializing nominal selection to the whole MS.
05-Oct-2026 20:39:43 2026-10-06 00:39:43        INFO        name::        No table opened.
05-Oct-2026 20:39:43 2026-10-06 00:39:43        INFO        showcache::        The Table Cache has the following 16 entries:
05-Oct-2026 20:39:43 2026-10-06 00:39:43        INFO        showcache::            0: "/home/casatest/casa6/casatestutils/nosedir/test_tool_calibrater/gaincaltest2.ms"
05-Oct-2026 20:39:43 2026-10-06 00:39:43        INFO        showcache::            1: "/home/casatest/casa6/casatestutils/nosedir/test_tool_calibrater/gaincaltest2.ms/ANTENNA"
05-Oct-2026 20:39:43 2026-10-06 00:39:43        INFO        showcache::            2: "/home/casatest/casa6/casatestutils/nosedir/test_tool_calibrater/gaincaltest2.ms/DATA_DESCRIPTION"
05-Oct-2026 20:39:43 2026-10-06 00:39:43        INFO        showcache::            3: "/home/casatest/casa6/casatestutils/nosedir/test_tool_calibrater/gaincaltest2.ms/FEED"
05-Oct-2026 20:39:43 2026-10-06 00:39:43        INFO        showcache::            4: "/home/casatest/casa6/casatestutils/nosedir/test_tool_calibrater/gaincaltest2.ms/FIELD"
05-Oct-2026 20:39:43 2026-10-06 00:39:43        INFO        showcache::            5: "/home/casatest/casa6/casatestutils/nosedir/test_tool_calibrater/gaincaltest2.ms/FLAG_CMD"
05-Oct-2026 20:39:43 2026-10-06 00:39:43        INFO        showcache::            6: "/home/casatest/casa6/casatestutils/nosedir/test_tool_calibrater/gaincaltest2.ms/HISTORY"
05-Oct-2026 20:39:43 2026-10-06 00:39:43        INFO        showcache::            7: "/home/casatest/casa6/casatestutils/nosedir/test_tool_calibrater/gaincaltest2.ms/OBSERVATION"
05-Oct-2026 20:39:43 2026-10-06 00:39:43        INFO        showcache::            8: "/home/casatest/casa6/casatestutils/nosedir/test_tool_calibrater/gaincaltest2.ms/POINTING"
05-Oct-2026 20:39:43 2026-10-06 00:39:43        INFO        showcache::            9: "/home/casatest/casa6/casatestutils/nosedir/test_tool_calibrater/gaincaltest2.ms/POLARIZATION"
05-Oct-2026 20:39:43 2026-10-06 00:39:43        INFO        showcache::            10: "/home/casatest/casa6/casatestutils/nosedir/test_tool_calibrater/gaincaltest2.ms/PROCESSOR"
05-Oct-2026 20:39:43 2026-10-06 00:39:43        INFO        showcache::            11: "/home/casatest/casa6/casatestutils/nosedir/test_tool_calibrater/gaincaltest2.ms/SOURCE"
05-Oct-2026 20:39:43 2026-10-06 00:39:43        INFO        showcache::            12: "/home/casatest/casa6/casatestutils/nosedir/test_tool_calibrater/gaincaltest2.ms/SPECTRAL_WINDOW"
05-Oct-2026 20:39:43 2026-10-06 00:39:43        INFO        showcache::            13: "/home/casatest/casa6/casatestutils/nosedir/test_tool_calibrater/gaincaltest2.ms/STATE"
05-Oct-2026 20:39:43 2026-10-06 00:39:43        INFO        showcache::            14: "/home/casatest/casa6/casatestutils/nosedir/test_tool_calibrater/gaincaltest2.ms/SYSCAL"
05-Oct-2026 20:39:43 2026-10-06 00:39:43        INFO        showcache::            15: "/home/casatest/casa6/casatestutils/nosedir/test_tool_calibrater/gaincaltest2.ms/WEATHER"
05-Oct-2026 20:39:43 2026-10-06 00:39:43        INFO        name::        No table opened.
05-Oct-2026 20:39:43 2026-10-06 00:39:43        INFO        showcache::        The Table Cache is empty.
05-Oct-2026 20:39:43 2026-10-06 00:39:43        WARN        calibrater::setvi(bool,bool)        Already using NEW VisibilityIterator.
05-Oct-2026 20:39:43 test_tool_calibrater.py::calibrater_test::test_takesMs
05-Oct-2026 20:39:43 Check that the calibrater tool can open and close an MS 
05-Oct-2026 20:39:43 PASSED
05-Oct-2026 20:39:43
05-Oct-2026 20:39:43 2026-10-06 00:39:43        INFO        calibrater::open        ****Using NEW VI2-driven calibrater tool****
05-Oct-2026 20:39:43 2026-10-06 00:39:43        INFO        calibrater::open        Opening MS: gaincaltest2.ms for calibration.
05-Oct-2026 20:39:43 2026-10-06 00:39:43        INFO                Clearing all model records in MS header.
05-Oct-2026 20:39:43 2026-10-06 00:39:43        INFO        VisSetUtil::addScrCols        Adding MODEL_DATA and CORRECTED_DATA column(s).
05-Oct-2026 20:39:44 2026-10-06 00:39:44        INFO        VisSetUtil::initScrCols        Initializing MODEL_DATA to (unity).
05-Oct-2026 20:39:44 2026-10-06 00:39:44        INFO        VisSetUtil::initScrCols        Initialized 328860 rows.
05-Oct-2026 20:39:44 2026-10-06 00:39:44        INFO        Calibrater::        Initializing nominal selection to the whole MS.
05-Oct-2026 20:39:44 2026-10-06 00:39:44        INFO        calibrater::setapply        Beginning setapply--(MSSelection version)-------
05-Oct-2026 20:39:44 2026-10-06 00:39:44        INFO        Calibrater::setapply(type, applypar)        Arranging to APPLY:
05-Oct-2026 20:39:44 2026-10-06 00:39:44        INFO        Calibrater::setapply(type, applypar)        .   G Jones: table=gaincaltest2.ms.G0 select= interp=linear spwmap=[-1] calWt=false
05-Oct-2026 20:39:44 2026-10-06 00:39:44        INFO        calibrater::correct        Beginning correct---------------------------
05-Oct-2026 20:39:44 2026-10-06 00:39:44        INFO        Calibrater::correct2 (VI2/VB2)        The following calibration terms are arranged for apply:
05-Oct-2026 20:39:44 2026-10-06 00:39:44        INFO        Calibrater::correct2 (VI2/VB2)        .   G Jones: table=gaincaltest2.ms.G0 select= interp=linear spwmap=[-1] calWt=false
05-Oct-2026 20:39:46 2026-10-06 00:39:46        INFO        calibrater::correct        Finished correcting.
05-Oct-2026 20:39:46 2026-10-06 00:39:46        WARN        calibrater::setvi(bool,bool)        Already using NEW VisibilityIterator.
05-Oct-2026 20:39:46 test_tool_calibrater.py::calibrater_test::test_writeToCorrected
05-Oct-2026 20:39:46 Check that the tool writes to the CORRECTED_DATA column 
05-Oct-2026 20:39:46 PASSED
05-Oct-2026 20:39:46
05-Oct-2026 20:39:46 - generated xml file: /home/casatest/casa6/casatestutils/nosedir/xml/test_tool_calibrater/nose.xml -
05-Oct-2026 20:39:46 ======================= 24 passed, 84 warnings in 49.43s =======================
05-Oct-2026 20:39:46 sys:1: DeprecationWarning: builtin type swigvarlink has no __module__ attribute
05-Oct-2026 20:39:46 ============================= test session starts ==============================
05-Oct-2026 20:39:46 platform linux -- Python 3.12.9, pytest-9.1.1, pluggy-1.6.0 -- /home/casatest/venv/bin/python3.12
05-Oct-2026 20:39:46 cachedir: .pytest_cache
05-Oct-2026 20:39:46 rootdir: /home/casatest/casa6/casatestutils/nosedir/test_tool_quanta
05-Oct-2026 20:39:46 configfile: pytest.ini
05-Oct-2026 20:39:46 collecting ... collected 9 items
05-Oct-2026 20:39:46
05-Oct-2026 20:39:46
05-Oct-2026 20:39:46 2026-10-06 00:39:47        SEVERE                Exception Reported: Error in QuantumHolder::fromString with input string "bogus": Illegal input units or format
05-Oct-2026 20:39:46 2026-10-06 00:39:47        SEVERE        +         in converting quantity
05-Oct-2026 20:39:46 test_tool_quanta.py::quanta_convert_test::test_exceptions
05-Oct-2026 20:39:46 Test various exception cases
05-Oct-2026 20:39:46 PASSED
05-Oct-2026 20:39:46
05-Oct-2026 20:39:46 test_tool_quanta.py::quanta_convert_test::test_valid
05-Oct-2026 20:39:46 Test specifying the quantity as a scalar
05-Oct-2026 20:39:46 PASSED
05-Oct-2026 20:39:46
05-Oct-2026 20:39:46 test_tool_quanta.py::quanta_convert_test::test_value_as_string
05-Oct-2026 20:39:46 Test specifying value as a string
05-Oct-2026 20:39:46 PASSED
05-Oct-2026 20:39:46
05-Oct-2026 20:39:46 2026-10-06 00:39:47        SEVERE                Error in QuantumHolder::fromString with input string "blah": Illegal input units or format
05-Oct-2026 20:39:46 2026-10-06 00:39:47        SEVERE        +         in converting quantity
05-Oct-2026 20:39:46 2026-10-06 00:39:47        SEVERE                Exception Reported: Error in QuantumHolder::fromString with input string "blah": Illegal input units or format
05-Oct-2026 20:39:46 2026-10-06 00:39:47        SEVERE        +         in converting quantity
05-Oct-2026 20:39:46 2026-10-06 00:39:47        SEVERE                Error in QuantumHolder::fromString with input string "blah": Illegal input units or format
05-Oct-2026 20:39:46 2026-10-06 00:39:47        SEVERE        +         in converting quantity
05-Oct-2026 20:39:46 2026-10-06 00:39:47        SEVERE                Exception Reported: Error in QuantumHolder::fromString with input string "blah": Illegal input units or format
05-Oct-2026 20:39:46 2026-10-06 00:39:47        SEVERE        +         in converting quantity
05-Oct-2026 20:39:46 2026-10-06 00:39:47        SEVERE                Exception Reported: Unit::check Illegal unit string 'zz'
05-Oct-2026 20:39:46 2026-10-06 00:39:47        SEVERE                Exception Reported: Unit::check Illegal unit string 'zz'
05-Oct-2026 20:39:46 test_tool_quanta.py::quanta_quantity_test::test_exceptions
05-Oct-2026 20:39:46 Test various exception cases
05-Oct-2026 20:39:46 PASSED
05-Oct-2026 20:39:46
05-Oct-2026 20:39:46 test_tool_quanta.py::quanta_quantity_test::test_multidimensional_arra_value
05-Oct-2026 20:39:46 Test specifying the quantity as a multidimensional array
05-Oct-2026 20:39:46 PASSED
05-Oct-2026 20:39:46
05-Oct-2026 20:39:46 test_tool_quanta.py::quanta_quantity_test::test_scalar_value
05-Oct-2026 20:39:46 Test specifying the quantity as a scalar
05-Oct-2026 20:39:46 PASSED
05-Oct-2026 20:39:46
05-Oct-2026 20:39:46 test_tool_quanta.py::quanta_quantity_test::test_value_as_record
05-Oct-2026 20:39:46 Test value as record (eg already a quantity).
05-Oct-2026 20:39:46 This is essentially a reflection operator.
05-Oct-2026 20:39:46 PASSED
05-Oct-2026 20:39:46
05-Oct-2026 20:39:46 test_tool_quanta.py::quanta_quantity_test::test_value_as_string
05-Oct-2026 20:39:46 Test specifying value as a string
05-Oct-2026 20:39:46 PASSED
05-Oct-2026 20:39:46
05-Oct-2026 20:39:46 test_tool_quanta.py::quanta_quantity_test::test_vector_value
05-Oct-2026 20:39:46 Test specifying the quantity as a vector
05-Oct-2026 20:39:46 PASSED
05-Oct-2026 20:39:46
05-Oct-2026 20:39:46 - generated xml file: /home/casatest/casa6/casatestutils/nosedir/xml/test_tool_quanta/nose.xml -
05-Oct-2026 20:39:46 ======================== 9 passed, 84 warnings in 0.39s ========================
05-Oct-2026 20:39:46 sys:1: DeprecationWarning: builtin type swigvarlink has no __module__ attribute
05-Oct-2026 20:39:46 ============================= test session starts ==============================
05-Oct-2026 20:39:46 platform linux -- Python 3.12.9, pytest-9.1.1, pluggy-1.6.0 -- /home/casatest/venv/bin/python3.12
05-Oct-2026 20:39:46 cachedir: .pytest_cache
05-Oct-2026 20:39:46 rootdir: /home/casatest/casa6/casatestutils/nosedir/test_tool_image_regrid
05-Oct-2026 20:39:46 configfile: pytest.ini
05-Oct-2026 20:39:47 collecting ... collected 11 items
05-Oct-2026 20:39:47
05-Oct-2026 20:39:47
05-Oct-2026 20:39:47 2026-10-06 00:39:47        INFO        ImageFactory::createImage        Created Temp image  of shape [10, 10, 1, 1] with float valued pixels.
05-Oct-2026 20:39:47 2026-10-06 00:39:47        INFO        ImageMaskAttacher::makeMask        Created and initialized mask `mask0'
05-Oct-2026 20:39:47 2026-10-06 00:39:47        INFO        ImageRegrid::_checkAxes         The Stokes axis cannot be regridded - removing from list
05-Oct-2026 20:39:47 test_tool_image_regrid.py::ia_regrid_test::test_CAS_4262
05-Oct-2026 20:39:47 Test degenerate axes are not relabeled to template
05-Oct-2026 20:39:47 PASSED
05-Oct-2026 20:39:47
05-Oct-2026 20:39:47 2026-10-06 00:39:47        INFO        ImageFactory::createImage        Created Temp image  of shape [100, 100, 1, 1] with float valued pixels.
05-Oct-2026 20:39:47 2026-10-06 00:39:47        INFO        ImageMaskAttacher::makeMask        Created and initialized mask `mask0'
05-Oct-2026 20:39:47 2026-10-06 00:39:47        WARN        ImageRegridder::_doImagesOverlap        At least one of the images exceeds one degree on at one side, not checking for direction plane overlap.
05-Oct-2026 20:39:47 2026-10-06 00:39:47        INFO        SubImageFactory::createImage        Creating image 'moulou1' of shape [100, 100, 1, 1]
05-Oct-2026 20:39:47 2026-10-06 00:39:47        INFO        name::        No table opened.
05-Oct-2026 20:39:47 2026-10-06 00:39:47        INFO        showcache::        The Table Cache is empty.
05-Oct-2026 20:39:47 test_tool_image_regrid.py::ia_regrid_test::test_CAS_4315
05-Oct-2026 20:39:47 test ia.regrid does not leave image open after tool is closed
05-Oct-2026 20:39:47 PASSED
05-Oct-2026 20:39:47
05-Oct-2026 20:39:47 2026-10-06 00:39:47        INFO        CasacRegionManager::fromBCS        No directional region specified. Using full positional plane.
05-Oct-2026 20:39:47 2026-10-06 00:39:47        INFO        ImageMaskAttacher::makeMask        Created and initialized mask `mask0'
05-Oct-2026 20:39:47 2026-10-06 00:39:47        INFO        ImageMaskAttacher::makeMask        Created mask `mask0'
05-Oct-2026 20:39:47 2026-10-06 00:39:47        INFO        CasacRegionManager::fromBCS        No directional region specified. Using full positional plane.
05-Oct-2026 20:39:47 2026-10-06 00:39:47        INFO        ImageMaskAttacher::makeMask        Created and initialized mask `mask0'
05-Oct-2026 20:39:47 2026-10-06 00:39:47        INFO        SubImageFactory::createImage        Creating image 'junk' of shape [20, 20, 100]
05-Oct-2026 20:39:47 2026-10-06 00:39:47        INFO        ImageMaskAttacher::makeMask        Created mask `mask0'
05-Oct-2026 20:39:47 2026-10-06 00:39:47        INFO        name::        No table opened.
05-Oct-2026 20:39:47 2026-10-06 00:39:47        INFO        showcache::        The Table Cache is empty.
05-Oct-2026 20:39:47 test_tool_image_regrid.py::ia_regrid_test::test_asvelocity
05-Oct-2026 20:39:47 Test regrid by velocity 
05-Oct-2026 20:39:47 PASSED
05-Oct-2026 20:39:47
05-Oct-2026 20:39:47 2026-10-06 00:39:47        INFO        ImageMaskAttacher::makeMask        Created and initialized mask `mask0'
05-Oct-2026 20:39:47 2026-10-06 00:39:47        WARN        ImageRegridder::_doImagesOverlap        At least one of the images exceeds one degree on at one side, not checking for direction plane overlap.
05-Oct-2026 20:39:47 2026-10-06 00:39:47        WARN        image::open (file src/tools/image/image_cmpt.cc, line 4208)        Another image is already open, closing first
05-Oct-2026 20:39:47 2026-10-06 00:39:47        INFO        ImageMaskAttacher::makeMask        Created and initialized mask `mask0'
05-Oct-2026 20:39:47 2026-10-06 00:39:47        WARN        ImageRegridder::_doImagesOverlap        At least one of the images exceeds one degree on at one side, not checking for direction plane overlap.
05-Oct-2026 20:39:47 2026-10-06 00:39:47        INFO        ImageFactory::createImage        Created Temp image  of shape [100, 100] with Complex valued pixels.
05-Oct-2026 20:39:47 2026-10-06 00:39:47        INFO        ImageMaskAttacher::makeMask        Created and initialized mask `mask0'
05-Oct-2026 20:39:47 2026-10-06 00:39:47        WARN        ImageRegridder::_doImagesOverlap        At least one of the images exceeds one degree on at one side, not checking for direction plane overlap.
05-Oct-2026 20:39:47 2026-10-06 00:39:47        INFO        ImageFactory::createImage        Created Temp image  of shape [100, 100] with double valued pixels.
05-Oct-2026 20:39:47 2026-10-06 00:39:47        INFO        ImageMaskAttacher::makeMask        Created and initialized mask `mask0'
05-Oct-2026 20:39:47 2026-10-06 00:39:47        WARN        ImageRegridder::_doImagesOverlap        At least one of the images exceeds one degree on at one side, not checking for direction plane overlap.
05-Oct-2026 20:39:47 2026-10-06 00:39:47        WARN        image::open (file src/tools/image/image_cmpt.cc, line 4208)        Another image is already open, closing first
05-Oct-2026 20:39:47 2026-10-06 00:39:47        INFO        ImageFactory::createImage        Created Temp image  of shape [100, 100] with double valued pixels.
05-Oct-2026 20:39:47 2026-10-06 00:39:47        INFO        ImageMaskAttacher::makeMask        Created and initialized mask `mask0'
05-Oct-2026 20:39:47 2026-10-06 00:39:47        WARN        ImageRegridder::_doImagesOverlap        At least one of the images exceeds one degree on at one side, not checking for direction plane overlap.
05-Oct-2026 20:39:47 2026-10-06 00:39:47        INFO        ImageFactory::createImage        Created Temp image  of shape [100, 100] with DComplex valued pixels.
05-Oct-2026 20:39:47 2026-10-06 00:39:47        INFO        ImageMaskAttacher::makeMask        Created and initialized mask `mask0'
05-Oct-2026 20:39:47 2026-10-06 00:39:47        WARN        ImageRegridder::_doImagesOverlap        At least one of the images exceeds one degree on at one side, not checking for direction plane overlap.
05-Oct-2026 20:39:47 test_tool_image_regrid.py::ia_regrid_test::test_complex
05-Oct-2026 20:39:47 Test regridding a complex image, CAS-1390
05-Oct-2026 20:39:47 PASSED
05-Oct-2026 20:39:47
05-Oct-2026 20:39:47 2026-10-06 00:39:47        INFO        ImageFactory::createImage        Created Temp image  of shape [10, 10, 10] with float valued pixels.
05-Oct-2026 20:39:47 2026-10-06 00:39:47        SEVERE        image::regrid        Exception Reported: Exception: The output image has only 10 pixels along axis 0, so the maximum value of decimate should be 3.
05-Oct-2026 20:39:47 2026-10-06 00:39:47        SEVERE        image::regrid+        ... thrown by void casa::ImageRegridderBase<T>::setDecimate(casacore::Int) [with T = float; casacore::Int = int] at File: /source/casainstall/include/casacpp/imageanalysis/ImageAnalysis/ImageRegridderBase.tcc, line: 75
05-Oct-2026 20:39:47 2026-10-06 00:39:47        INFO        ImageMaskAttacher::makeMask        Created and initialized mask `mask0'
05-Oct-2026 20:39:47 2026-10-06 00:39:47        INFO        ImageMaskAttacher::makeMask        Created and initialized mask `mask0'
05-Oct-2026 20:39:47 test_tool_image_regrid.py::ia_regrid_test::test_decimate
05-Oct-2026 20:39:47 ia.regrid, test too high a value for decimate throws exception - CAS-5313
05-Oct-2026 20:39:47 PASSED
05-Oct-2026 20:39:47
05-Oct-2026 20:39:47 2026-10-06 00:39:47        INFO        ImageFactory::createImage        Created Paged image 'ia.fromshape.image1' of shape [32, 32, 32] with float valued pixels.
05-Oct-2026 20:39:47 2026-10-06 00:39:47        INFO        ImageMaskAttacher::makeMask        Created and initialized mask `mask0'
05-Oct-2026 20:39:47 2026-10-06 00:39:47        SEVERE        image::regrid        Exception Reported: (/source/casa6/casatools/casacore/coordinates/Coordinates/CoordinateSystem.cc : 925) Failed AlwaysAssert axisInCoordinateSystem < nPixelAxes()
05-Oct-2026 20:39:47 2026-10-06 00:39:47        WARN        ImageRegrid<T>::makeCoordinateSystem (file /source/casa6/casatools/casacore/casacore/images/Images/ImageRegrid.tcc, line 631)        Direction coordinate is not present  in the output coordinate system, so it cannot be regridded
05-Oct-2026 20:39:47 2026-10-06 00:39:47        WARN        ImageRegrid<T>::makeCoordinateSystem (file /source/casa6/casatools/casacore/casacore/images/Images/ImageRegrid.tcc, line 631)        Spectral coordinate is not present  in the output coordinate system, so it cannot be regridded
05-Oct-2026 20:39:47 2026-10-06 00:39:47        SEVERE        image::regrid        Exception Reported: Exception: The number of pixel axes in the output shape and Coordinate System must be the same. Shape has size 4. Output coordinate system has 3 axes.
05-Oct-2026 20:39:47 2026-10-06 00:39:47        SEVERE        image::regrid+        ... thrown by std::shared_ptr<casacore::ImageInterface<T> > casa::ImageRegridder<T>::_regrid() const [with T = float] at File: /source/casainstall/include/casacpp/imageanalysis/ImageAnalysis/ImageRegridder.tcc, line: 136
05-Oct-2026 20:39:47 2026-10-06 00:39:47        SEVERE        image::regrid        Exception Reported: Unknown interpolation method doggies
05-Oct-2026 20:39:47 2026-10-06 00:39:47        WARN        ImageRegrid<T>::makeCoordinateSystem (file /source/casa6/casatools/casacore/casacore/images/Images/ImageRegrid.tcc, line 631)        Direction coordinate is not present  in the output coordinate system, so it cannot be regridded
05-Oct-2026 20:39:47 2026-10-06 00:39:47        WARN        ImageRegrid<T>::makeCoordinateSystem (file /source/casa6/casatools/casacore/casacore/images/Images/ImageRegrid.tcc, line 631)        Spectral coordinate is not present  in the output coordinate system, so it cannot be regridded
05-Oct-2026 20:39:47 2026-10-06 00:39:47        INFO        ImageMaskAttacher::makeMask        Created and initialized mask `mask0'
05-Oct-2026 20:39:47 2026-10-06 00:39:47        WARN        ImageRegrid<T>::makeCoordinateSystem (file /source/casa6/casatools/casacore/casacore/images/Images/ImageRegrid.tcc, line 631)        Direction coordinate is not present  in the output coordinate system, so it cannot be regridded
05-Oct-2026 20:39:47 2026-10-06 00:39:47        INFO        ImageMaskAttacher::makeMask        Created and initialized mask `mask0'
05-Oct-2026 20:39:47 2026-10-06 00:39:47        WARN        ImageRegrid<T>::makeCoordinateSystem (file /source/casa6/casatools/casacore/casacore/images/Images/ImageRegrid.tcc, line 631)        Spectral coordinate is not present  in the output coordinate system, so it cannot be regridded
05-Oct-2026 20:39:47 2026-10-06 00:39:47        INFO        ImageMaskAttacher::makeMask        Created and initialized mask `mask0'
05-Oct-2026 20:39:47 2026-10-06 00:39:47        INFO        name::        No table opened.
05-Oct-2026 20:39:47 2026-10-06 00:39:47        INFO        showcache::        The Table Cache is empty.
05-Oct-2026 20:39:47 test_tool_image_regrid.py::ia_regrid_test::test_general
05-Oct-2026 20:39:47 ia.regrid general tests 
05-Oct-2026 20:39:47 PASSED
05-Oct-2026 20:39:47
05-Oct-2026 20:39:47 2026-10-06 00:39:47        INFO        ImageMaskAttacher::makeMask        Created and initialized mask `mask0'
05-Oct-2026 20:39:47 2026-10-06 00:39:47        INFO        ImageMaskAttacher::makeMask        Created mask `mask0'
05-Oct-2026 20:39:47 test_tool_image_regrid.py::ia_regrid_test::test_linear_overlap
05-Oct-2026 20:39:47 Test that overlapping linear coordinates works, CAS-5767
05-Oct-2026 20:39:47 PASSED
05-Oct-2026 20:39:47
05-Oct-2026 20:39:47 2026-10-06 00:39:47        INFO        ImageFactory::createImage        Created Temp image  of shape [100, 100, 20] with float valued pixels.
05-Oct-2026 20:39:47 2026-10-06 00:39:47        INFO        image::_casaQuantityFromVar         Will use values specified in major, minor, pa to set beam
05-Oct-2026 20:39:47 2026-10-06 00:39:47        INFO        BeamManipulator::set        This image currently has no beams of any kind. Since channel and/or polarization were specified, a set of per plane beams, each equal to the specified beam, will be created.
05-Oct-2026 20:39:47 2026-10-06 00:39:47        INFO        BeamManipulator::set        Beam parameters:  Major          : 20 arcsec
05-Oct-2026 20:39:47 2026-10-06 00:39:47        INFO        BeamManipulator::set+          Minor          : 20 arcsec
05-Oct-2026 20:39:47 2026-10-06 00:39:47        INFO        BeamManipulator::set+          Position Angle : 0 deg
05-Oct-2026 20:39:47 2026-10-06 00:39:47        INFO        image::_casaQuantityFromVar         Will use values specified in major, minor, pa to set beam
05-Oct-2026 20:39:47 2026-10-06 00:39:47        INFO        BeamManipulator::set        Beam parameters:  Major          : 30 arcsec
05-Oct-2026 20:39:47 2026-10-06 00:39:47        INFO        BeamManipulator::set+          Minor          : 30 arcsec
05-Oct-2026 20:39:47 2026-10-06 00:39:47        INFO        BeamManipulator::set+          Position Angle : 0 deg
05-Oct-2026 20:39:47 2026-10-06 00:39:47        SEVERE        image::regrid        Exception Reported: Exception: An image with multiple beams cannot be regridded along the spectral axis. You may wish to convolve all channels to a common resolution and retry.
05-Oct-2026 20:39:47 2026-10-06 00:39:47        SEVERE        image::regrid+        ... thrown by std::shared_ptr<casacore::ImageInterface<T> > casa::ImageRegridder<T>::regrid() const [with T = float] at File: /source/casainstall/include/casacpp/imageanalysis/ImageAnalysis/ImageRegridder.tcc, line: 83
05-Oct-2026 20:39:47 2026-10-06 00:39:47        SEVERE        image::regrid        Exception Reported: Exception: An image with multiple beams cannot be regridded along the spectral axis. You may wish to convolve all channels to a common resolution and retry.
05-Oct-2026 20:39:47 2026-10-06 00:39:47        SEVERE        image::regrid+        ... thrown by std::shared_ptr<casacore::ImageInterface<T> > casa::ImageRegridder<T>::regrid() const [with T = float] at File: /source/casainstall/include/casacpp/imageanalysis/ImageAnalysis/ImageRegridder.tcc, line: 97
05-Oct-2026 20:39:47 2026-10-06 00:39:47        INFO        ImageMaskAttacher::makeMask        Created and initialized mask `mask0'
05-Oct-2026 20:39:47 2026-10-06 00:39:47        WARN        ImageRegridder::_doImagesOverlap        At least one of the images exceeds one degree on at one side, not checking for direction plane overlap.
05-Oct-2026 20:39:47 2026-10-06 00:39:47        WARN        ImageRegrid::regrid        You are regridding an image whose beam is not well sampled by the pixel size.  Total flux can be lost when regridding such images, especially when the new pixel size is larger than the old pixel size. It is recommended to check the total flux of your input and output image, and if necessary rebin the input to have smaller pixels.
05-Oct-2026 20:39:47 test_tool_image_regrid.py::ia_regrid_test::test_multibeam
05-Oct-2026 20:39:47 test multibeams cannot be regridded
05-Oct-2026 20:39:47 PASSED
05-Oct-2026 20:39:47
05-Oct-2026 20:39:47 2026-10-06 00:39:47        INFO        ImageFactory::createImage        Created Temp image  of shape [20, 20, 20, 4] with float valued pixels.
05-Oct-2026 20:39:47 2026-10-06 00:39:48        INFO        ImageMaskAttacher::makeMask        Created and initialized mask `mask0'
05-Oct-2026 20:39:47 2026-10-06 00:39:48        INFO        ImageRegrid::_checkAxes         The Stokes axis cannot be regridded - removing from list
05-Oct-2026 20:39:47 2026-10-06 00:39:48        INFO        SubImageFactory::createImage        Creating image 'first' of shape [20, 20, 20, 4]
05-Oct-2026 20:39:47 2026-10-06 00:39:48        INFO        ImageMaskAttacher::makeMask        Created and initialized mask `mask0'
05-Oct-2026 20:39:47 2026-10-06 00:39:48        SEVERE        image::regrid        Exception Reported: Exception: There is no overlap between the (region chosen in) the input image and the output image with respect to the axes being regridded..
05-Oct-2026 20:39:47 2026-10-06 00:39:48        SEVERE        image::regrid+        ... thrown by std::shared_ptr<casacore::ImageInterface<T> > casa::ImageRegridder<T>::_regrid() const [with T = float] at File: /source/casainstall/include/casacpp/imageanalysis/ImageAnalysis/ImageRegridder.tcc, line: 151
05-Oct-2026 20:39:47 2026-10-06 00:39:48        INFO        ImageMaskAttacher::makeMask        Created and initialized mask `mask0'
05-Oct-2026 20:39:47 2026-10-06 00:39:48        INFO        SubImageFactory::createImage        Creating image 'fourth' of shape [20, 20, 20, 4]
05-Oct-2026 20:39:47 2026-10-06 00:39:48        INFO        ImageFactory::createImage        Created Temp image  of shape [200, 200, 20, 4] with float valued pixels.
05-Oct-2026 20:39:47 2026-10-06 00:39:48        INFO        ImageMaskAttacher::makeMask        Created and initialized mask `mask0'
05-Oct-2026 20:39:47 2026-10-06 00:39:48        WARN        ImageRegridder::_doImagesOverlap        At least one of the images exceeds one degree on at one side, not checking for direction plane overlap.
05-Oct-2026 20:39:47 2026-10-06 00:39:48        INFO        ImageRegrid::_checkAxes         The Stokes axis cannot be regridded - removing from list
05-Oct-2026 20:39:47 2026-10-06 00:39:48        INFO        SubImageFactory::createImage        Creating image 'third' of shape [200, 200, 20, 4]
05-Oct-2026 20:39:47 2026-10-06 00:39:48        INFO        ImageMaskAttacher::makeMask        Created mask `mask0'
05-Oct-2026 20:39:47 2026-10-06 00:39:48        INFO        ImageMaskAttacher::makeMask        Created and initialized mask `mask0'
05-Oct-2026 20:39:47 2026-10-06 00:39:48        WARN        ImageRegridder::_doImagesOverlap        At least one of the images exceeds one degree on at one side, not checking for direction plane overlap.
05-Oct-2026 20:39:47 2026-10-06 00:39:48        SEVERE        image::regrid        Exception Reported: Exception: There is no overlap between the (region chosen in) the input image and the output image with respect to the axes being regridded..
05-Oct-2026 20:39:47 2026-10-06 00:39:48        SEVERE        image::regrid+        ... thrown by std::shared_ptr<casacore::ImageInterface<T> > casa::ImageRegridder<T>::_regrid() const [with T = float] at File: /source/casainstall/include/casacpp/imageanalysis/ImageAnalysis/ImageRegridder.tcc, line: 151
05-Oct-2026 20:39:47 2026-10-06 00:39:48        INFO        ImageFactory::createImage        Created Temp image  of shape [20, 20, 1001, 4] with float valued pixels.
05-Oct-2026 20:39:47 2026-10-06 00:39:48        INFO        ImageMaskAttacher::makeMask        Created and initialized mask `mask0'
05-Oct-2026 20:39:47 2026-10-06 00:39:48        INFO        SubImageFactory::createImage        Creating image 'sixth' of shape [20, 20, 1001, 4]
05-Oct-2026 20:39:47 2026-10-06 00:39:48        INFO        ImageMaskAttacher::makeMask        Created mask `mask0'
05-Oct-2026 20:39:47 2026-10-06 00:39:48        INFO        ImageMaskAttacher::makeMask        Created and initialized mask `mask0'
05-Oct-2026 20:39:47 2026-10-06 00:39:48        SEVERE        image::regrid        Exception Reported: Exception: There is no overlap between the (region chosen in) the input image and the output image with respect to the axes being regridded..
05-Oct-2026 20:39:47 2026-10-06 00:39:48        SEVERE        image::regrid+        ... thrown by std::shared_ptr<casacore::ImageInterface<T> > casa::ImageRegridder<T>::_regrid() const [with T = float] at File: /source/casainstall/include/casacpp/imageanalysis/ImageAnalysis/ImageRegridder.tcc, line: 151
05-Oct-2026 20:39:47 test_tool_image_regrid.py::ia_regrid_test::test_overlap
05-Oct-2026 20:39:47 Test for notification if no overlap between input and output images
05-Oct-2026 20:39:47 PASSED
05-Oct-2026 20:39:47
05-Oct-2026 20:39:47 2026-10-06 00:39:48        INFO        ImageMaskAttacher::makeMask        Created and initialized mask `mask0'
05-Oct-2026 20:39:47 2026-10-06 00:39:48        WARN        ImageRegridder::_doImagesOverlap        At least one of the images exceeds one degree on at one side, not checking for direction plane overlap.
05-Oct-2026 20:39:47 2026-10-06 00:39:48        INFO        ImageRegrid::_checkAxes         The Stokes axis cannot be regridded - removing from list
05-Oct-2026 20:39:47 2026-10-06 00:39:48        WARN        ImageRegrid::regrid        You are regridding an image whose beam is not well sampled by the pixel size.  Total flux can be lost when regridding such images, especially when the new pixel size is larger than the old pixel size. It is recommended to check the total flux of your input and output image, and if necessary rebin the input to have smaller pixels.
05-Oct-2026 20:39:47 2026-10-06 00:39:48        INFO        SubImageFactory::createImage        Creating image 'gal_regrid_out.image' of shape [300, 300, 1, 46]
05-Oct-2026 20:39:47 2026-10-06 00:39:48        INFO        ImageMaskAttacher::makeMask        Created mask `mask0'
05-Oct-2026 20:39:47 2026-10-06 00:39:48        WARN        image::open (file src/tools/image/image_cmpt.cc, line 4208)        Another image is already open, closing first
05-Oct-2026 20:39:47 test_tool_image_regrid.py::ia_regrid_test::test_regrid_galactic
05-Oct-2026 20:39:47 Verify fix for CAS-5534
05-Oct-2026 20:39:47 PASSED
05-Oct-2026 20:39:47
05-Oct-2026 20:39:47 2026-10-06 00:39:48        INFO        ImageFactory::createImage        Created Paged image 'maskim' of shape [200, 200, 1, 1] with float valued pixels.
05-Oct-2026 20:39:47 2026-10-06 00:39:48        INFO        ImageFactory::createImage        Created Temp image  of shape [200, 200, 1, 20] with float valued pixels.
05-Oct-2026 20:39:47 2026-10-06 00:39:48        SEVERE        image::regrid        Exception Reported: The input image shape ([200, 200, 1, 20]) and mask shape ([200, 200, 1, 1]) are different, and it was specified that the mask should not be extended, so the mask cannot be applied to the (sub)image. Specifying that the mask should be extended may resolve the issue at File: /source/casainstall/include/casacpp/imageanalysis/ImageAnalysis/SubImageFactory.tcc, line: 306
05-Oct-2026 20:39:47 2026-10-06 00:39:48        INFO        CasacRegionManager::fromBCS        No directional region specified. Using full positional plane.
05-Oct-2026 20:39:47 2026-10-06 00:39:48        INFO        CasacRegionManager::fromBCS        Using polarizations ALL
05-Oct-2026 20:39:47 2026-10-06 00:39:48        INFO        ImageMaskAttacher::makeMask        Created and initialized mask `mask0'
05-Oct-2026 20:39:47 2026-10-06 00:39:48        WARN        ImageRegridder::_doImagesOverlap        At least one of the images exceeds one degree on at one side, not checking for direction plane overlap.
05-Oct-2026 20:39:47 2026-10-06 00:39:48        INFO        ImageRegrid::_checkAxes         The Stokes axis cannot be regridded - removing from list
05-Oct-2026 20:39:48 2026-10-06 00:39:48        INFO        ImageMaskAttacher::makeMask        Created mask `mask0'
05-Oct-2026 20:39:48 2026-10-06 00:39:48        SEVERE        image::regrid        Exception Reported: The input image shape ([200, 200, 1, 20]) and mask shape ([200, 200, 1, 1]) are different, and it was specified that the mask should not be extended, so the mask cannot be applied to the (sub)image. Specifying that the mask should be extended may resolve the issue at File: /source/casainstall/include/casacpp/imageanalysis/ImageAnalysis/SubImageFactory.tcc, line: 306
05-Oct-2026 20:39:48 2026-10-06 00:39:48        INFO        ImageMaskAttacher::makeMask        Created and initialized mask `mask0'
05-Oct-2026 20:39:48 2026-10-06 00:39:48        WARN        ImageRegridder::_doImagesOverlap        At least one of the images exceeds one degree on at one side, not checking for direction plane overlap.
05-Oct-2026 20:39:48 2026-10-06 00:39:48        INFO        ImageRegrid::_checkAxes         The Stokes axis cannot be regridded - removing from list
05-Oct-2026 20:39:48 2026-10-06 00:39:48        INFO        ImageMaskAttacher::makeMask        Created mask `mask0'
05-Oct-2026 20:39:48 2026-10-06 00:39:48        INFO        name::        No table opened.
05-Oct-2026 20:39:48 2026-10-06 00:39:48        INFO        showcache::        The Table Cache is empty.
05-Oct-2026 20:39:48 test_tool_image_regrid.py::ia_regrid_test::test_stretch
05-Oct-2026 20:39:48 ia.regrid(): Test stretch parameter
05-Oct-2026 20:39:48 2026-10-06 00:39:48        INFO        name::        No table opened.
05-Oct-2026 20:39:48 2026-10-06 00:39:48        INFO        showcache::        The Table Cache is empty.
05-Oct-2026 20:39:48 PASSED
05-Oct-2026 20:39:48
05-Oct-2026 20:39:48 - generated xml file: /home/casatest/casa6/casatestutils/nosedir/xml/test_tool_image_regrid/nose.xml -
05-Oct-2026 20:39:48 ======================= 11 passed, 84 warnings in 1.37s ========================
05-Oct-2026 20:39:48 sys:1: DeprecationWarning: builtin type swigvarlink has no __module__ attribute
05-Oct-2026 20:39:48 swig/python detected a memory leak of type 'casac::coordsys *', no destructor found.
05-Oct-2026 20:39:48
05-Oct-2026 20:39:48
05-Oct-2026 20:39:48 Setting Working Directory: /home/casatest/casa6/casatestutils/nosedir/test_tool_simulator/
05-Oct-2026 20:39:48 Test Directory: /home/casatest/casa6/casatestutils/nosedir/test_tool_simulator
05-Oct-2026 20:39:48
05-Oct-2026 20:39:48 Running Command: pytest --junitxml=/home/casatest/casa6/casatestutils/nosedir/xml/test_tool_simulator/nose.xml -s --disable-pytest-warnings --verbose -ra --tb=short /home/casatest/casa6/casatestutils/nosedir/test_tool_simulator/
05-Oct-2026 20:39:48
05-Oct-2026 20:39:48 Setting Working Directory: /home/casatest/casa6/casatestutils/nosedir/test_tool_ms_statwt/
05-Oct-2026 20:39:48 Test Directory: /home/casatest/casa6/casatestutils/nosedir/test_tool_ms_statwt
05-Oct-2026 20:39:48
05-Oct-2026 20:39:48 Running Command: pytest --junitxml=/home/casatest/casa6/casatestutils/nosedir/xml/test_tool_ms_statwt/nose.xml -s --disable-pytest-warnings --verbose -ra --tb=short /home/casatest/casa6/casatestutils/nosedir/test_tool_ms_statwt/
05-Oct-2026 20:39:48
05-Oct-2026 20:39:48 Setting Working Directory: /home/casatest/casa6/casatestutils/nosedir/test_tool_image_transpose/
05-Oct-2026 20:39:48 Test Directory: /home/casatest/casa6/casatestutils/nosedir/test_tool_image_transpose
05-Oct-2026 20:39:48
05-Oct-2026 20:39:48 Running Command: pytest --junitxml=/home/casatest/casa6/casatestutils/nosedir/xml/test_tool_image_transpose/nose.xml -s --disable-pytest-warnings --verbose -ra --tb=short /home/casatest/casa6/casatestutils/nosedir/test_tool_image_transpose/
05-Oct-2026 20:39:48
05-Oct-2026 20:39:48 Setting Working Directory: /home/casatest/casa6/casatestutils/nosedir/test_tool_image_collapse/
05-Oct-2026 20:39:48 Test Directory: /home/casatest/casa6/casatestutils/nosedir/test_tool_image_collapse
05-Oct-2026 20:39:48
05-Oct-2026 20:39:48 Running Command: pytest --junitxml=/home/casatest/casa6/casatestutils/nosedir/xml/test_tool_image_collapse/nose.xml -s --disable-pytest-warnings --verbose -ra --tb=short /home/casatest/casa6/casatestutils/nosedir/test_tool_image_collapse/
05-Oct-2026 20:39:48
05-Oct-2026 20:39:48 Setting Working Directory: /home/casatest/casa6/casatestutils/nosedir/test_tool_sdm/
05-Oct-2026 20:39:48 Test Directory: /home/casatest/casa6/casatestutils/nosedir/test_tool_sdm
05-Oct-2026 20:39:48
05-Oct-2026 20:39:48 Running Command: pytest --junitxml=/home/casatest/casa6/casatestutils/nosedir/xml/test_tool_sdm/nose.xml -s --disable-pytest-warnings --verbose -ra --tb=short /home/casatest/casa6/casatestutils/nosedir/test_tool_sdm/
05-Oct-2026 20:39:48
05-Oct-2026 20:39:48 Setting Working Directory: /home/casatest/casa6/casatestutils/nosedir/test_tool_msuvbinner/
05-Oct-2026 20:39:48 Test Directory: /home/casatest/casa6/casatestutils/nosedir/test_tool_msuvbinner
05-Oct-2026 20:39:48
05-Oct-2026 20:39:48 Running Command: pytest --junitxml=/home/casatest/casa6/casatestutils/nosedir/xml/test_tool_msuvbinner/nose.xml -s --disable-pytest-warnings --verbose -ra --tb=short /home/casatest/casa6/casatestutils/nosedir/test_tool_msuvbinner/
05-Oct-2026 20:39:48
05-Oct-2026 20:39:48 Setting Working Directory: /home/casatest/casa6/casatestutils/nosedir/test_tool_componentlist/
05-Oct-2026 20:39:48 Test Directory: /home/casatest/casa6/casatestutils/nosedir/test_tool_componentlist
05-Oct-2026 20:39:48
05-Oct-2026 20:39:48 Running Command: pytest --junitxml=/home/casatest/casa6/casatestutils/nosedir/xml/test_tool_componentlist/nose.xml -s --disable-pytest-warnings --verbose -ra --tb=short /home/casatest/casa6/casatestutils/nosedir/test_tool_componentlist/
05-Oct-2026 20:39:48
05-Oct-2026 20:39:48 Setting Working Directory: /home/casatest/casa6/casatestutils/nosedir/test_tool_image/
05-Oct-2026 20:39:48 Test Directory: /home/casatest/casa6/casatestutils/nosedir/test_tool_image
05-Oct-2026 20:39:48
05-Oct-2026 20:39:48 Running Command: pytest --junitxml=/home/casatest/casa6/casatestutils/nosedir/xml/test_tool_image/nose.xml -s --disable-pytest-warnings --verbose -ra --tb=short /home/casatest/casa6/casatestutils/nosedir/test_tool_image/
05-Oct-2026 20:39:48
05-Oct-2026 20:39:48 Setting Working Directory: /home/casatest/casa6/casatestutils/nosedir/test_tool_coordsys/
05-Oct-2026 20:39:48 Test Directory: /home/casatest/casa6/casatestutils/nosedir/test_tool_coordsys
05-Oct-2026 20:39:48
05-Oct-2026 20:39:48 Running Command: pytest --junitxml=/home/casatest/casa6/casatestutils/nosedir/xml/test_tool_coordsys/nose.xml -s --disable-pytest-warnings --verbose -ra --tb=short /home/casatest/casa6/casatestutils/nosedir/test_tool_coordsys/
05-Oct-2026 20:39:48
05-Oct-2026 20:39:48 Setting Working Directory: /home/casatest/casa6/casatestutils/nosedir/test_tool_linearmosaic/
05-Oct-2026 20:39:48 Test Directory: /home/casatest/casa6/casatestutils/nosedir/test_tool_linearmosaic
05-Oct-2026 20:39:48
05-Oct-2026 20:39:48 Running Command: pytest --junitxml=/home/casatest/casa6/casatestutils/nosedir/xml/test_tool_linearmosaic/nose.xml -s --disable-pytest-warnings --verbose -ra --tb=short /home/casatest/casa6/casatestutils/nosedir/test_tool_linearmosaic/
05-Oct-2026 20:39:48
05-Oct-2026 20:39:48 Setting Working Directory: /home/casatest/casa6/casatestutils/nosedir/test_tool_agentflagger/
05-Oct-2026 20:39:48 Test Directory: /home/casatest/casa6/casatestutils/nosedir/test_tool_agentflagger
05-Oct-2026 20:39:48
05-Oct-2026 20:39:48 Running Command: pytest --junitxml=/home/casatest/casa6/casatestutils/nosedir/xml/test_tool_agentflagger/nose.xml -s --disable-pytest-warnings --verbose -ra --tb=short /home/casatest/casa6/casatestutils/nosedir/test_tool_agentflagger/
05-Oct-2026 20:39:48
05-Oct-2026 20:39:48 Setting Working Directory: /home/casatest/casa6/casatestutils/nosedir/test_tool_image_deviation/
05-Oct-2026 20:39:48 Test Directory: /home/casatest/casa6/casatestutils/nosedir/test_tool_image_deviation
05-Oct-2026 20:39:48
05-Oct-2026 20:39:48 Running Command: pytest --junitxml=/home/casatest/casa6/casatestutils/nosedir/xml/test_tool_image_deviation/nose.xml -s --disable-pytest-warnings --verbose -ra --tb=short /home/casatest/casa6/casatestutils/nosedir/test_tool_image_deviation/
05-Oct-2026 20:39:48
05-Oct-2026 20:39:48 Setting Working Directory: /home/casatest/casa6/casatestutils/nosedir/test_tool_measures/
05-Oct-2026 20:39:48 Test Directory: /home/casatest/casa6/casatestutils/nosedir/test_tool_measures
05-Oct-2026 20:39:48
05-Oct-2026 20:39:48 Running Command: pytest --junitxml=/home/casatest/casa6/casatestutils/nosedir/xml/test_tool_measures/nose.xml -s --disable-pytest-warnings --verbose -ra --tb=short /home/casatest/casa6/casatestutils/nosedir/test_tool_measures/
05-Oct-2026 20:39:48
05-Oct-2026 20:39:48 Setting Working Directory: /home/casatest/casa6/casatestutils/nosedir/test_tool_image_statistics/
05-Oct-2026 20:39:48 Test Directory: /home/casatest/casa6/casatestutils/nosedir/test_tool_image_statistics
05-Oct-2026 20:39:48
05-Oct-2026 20:39:48 Running Command: pytest --junitxml=/home/casatest/casa6/casatestutils/nosedir/xml/test_tool_image_statistics/nose.xml -s --disable-pytest-warnings --verbose -ra --tb=short /home/casatest/casa6/casatestutils/nosedir/test_tool_image_statistics/
05-Oct-2026 20:39:48
05-Oct-2026 20:39:48 Setting Working Directory: /home/casatest/casa6/casatestutils/nosedir/test_tool_table/
05-Oct-2026 20:39:48 Test Directory: /home/casatest/casa6/casatestutils/nosedir/test_tool_table
05-Oct-2026 20:39:48
05-Oct-2026 20:39:48 Running Command: pytest --junitxml=/home/casatest/casa6/casatestutils/nosedir/xml/test_tool_table/nose.xml -s --disable-pytest-warnings --verbose -ra --tb=short /home/casatest/casa6/casatestutils/nosedir/test_tool_table/
05-Oct-2026 20:39:48
05-Oct-2026 20:39:48 Setting Working Directory: /home/casatest/casa6/casatestutils/nosedir/test_tool_calibrater/
05-Oct-2026 20:39:48 Test Directory: /home/casatest/casa6/casatestutils/nosedir/test_tool_calibrater
05-Oct-2026 20:39:48
05-Oct-2026 20:39:48 Running Command: pytest --junitxml=/home/casatest/casa6/casatestutils/nosedir/xml/test_tool_calibrater/nose.xml -s --disable-pytest-warnings --verbose -ra --tb=short /home/casatest/casa6/casatestutils/nosedir/test_tool_calibrater/
05-Oct-2026 20:39:48
05-Oct-2026 20:39:48 Setting Working Directory: /home/casatest/casa6/casatestutils/nosedir/test_tool_quanta/
05-Oct-2026 20:39:48 Test Directory: /home/casatest/casa6/casatestutils/nosedir/test_tool_quanta
05-Oct-2026 20:39:48
05-Oct-2026 20:39:48 Running Command: pytest --junitxml=/home/casatest/casa6/casatestutils/nosedir/xml/test_tool_quanta/nose.xml -s --disable-pytest-warnings --verbose -ra --tb=short /home/casatest/casa6/casatestutils/nosedir/test_tool_quanta/
05-Oct-2026 20:39:48
05-Oct-2026 20:39:48 Setting Working Directory: /home/casatest/casa6/casatestutils/nosedir/test_tool_image_regrid/
05-Oct-2026 20:39:48 Test Directory: /home/casatest/casa6/casatestutils/nosedir/test_tool_image_regrid
05-Oct-2026 20:39:48
05-Oct-2026 20:39:48 Running Command: pytest --junitxml=/home/casatest/casa6/casatestutils/nosedir/xml/test_tool_image_regrid/nose.xml -s --disable-pytest-warnings --verbose -ra --tb=short /home/casatest/casa6/casatestutils/nosedir/test_tool_image_regrid/
05-Oct-2026 20:39:48 total 84016
05-Oct-2026 20:39:48 -rw-r--r-- 1 casaci 15001   161014 Oct  6 00:30 casatestutils-6.7.7.12-py3-none-any.whl
05-Oct-2026 20:39:48 -rw-r--r-- 1 casaci 15001 85700381 Oct  6 00:30 casatools-6.7.7.12-cp312-cp312-manylinux_2_34_x86_64.whl
05-Oct-2026 20:39:48 -rw-r--r-- 1 casaci root      4340 Oct  6 00:39 test_tool_agentflagger.xml
05-Oct-2026 20:39:48 -rw-r--r-- 1 casaci root      1006 Oct  6 00:39 test_tool_calanalysis.xml
05-Oct-2026 20:39:48 -rw-r--r-- 1 casaci root      2656 Oct  6 00:39 test_tool_calibrater.xml
05-Oct-2026 20:39:48 -rw-r--r-- 1 casaci root       687 Oct  6 00:39 test_tool_componentlist.xml
05-Oct-2026 20:39:48 -rw-r--r-- 1 casaci root      7467 Oct  6 00:39 test_tool_coordsys.xml
05-Oct-2026 20:39:48 -rw-r--r-- 1 casaci root     12935 Oct  6 00:39 test_tool_image.xml
05-Oct-2026 20:39:48 -rw-r--r-- 1 casaci root      2220 Oct  6 00:39 test_tool_image_collapse.xml
05-Oct-2026 20:39:48 -rw-r--r-- 1 casaci root      1048 Oct  6 00:39 test_tool_image_deviation.xml
05-Oct-2026 20:39:48 -rw-r--r-- 1 casaci root      2574 Oct  6 00:39 test_tool_image_fitprofile.xml
05-Oct-2026 20:39:48 -rw-r--r-- 1 casaci root      1178 Oct  6 00:39 test_tool_image_pbcor.xml
05-Oct-2026 20:39:48 -rw-r--r-- 1 casaci root       883 Oct  6 00:39 test_tool_image_pv.xml
05-Oct-2026 20:39:48 -rw-r--r-- 1 casaci root      1006 Oct  6 00:39 test_tool_image_rebin.xml
05-Oct-2026 20:39:48 -rw-r--r-- 1 casaci root      1336 Oct  6 00:39 test_tool_image_regrid.xml
05-Oct-2026 20:39:48 -rw-r--r-- 1 casaci root      1640 Oct  6 00:39 test_tool_image_statistics.xml
05-Oct-2026 20:39:48 -rw-r--r-- 1 casaci root       765 Oct  6 00:39 test_tool_image_subimage.xml
05-Oct-2026 20:39:48 -rw-r--r-- 1 casaci root       890 Oct  6 00:39 test_tool_image_transpose.xml
05-Oct-2026 20:39:48 -rw-r--r-- 1 casaci root      1966 Oct  6 00:39 test_tool_imagepol.xml
05-Oct-2026 20:39:48 -rw-r--r-- 1 casaci root       838 Oct  6 00:39 test_tool_linearmosaic.xml
05-Oct-2026 20:39:48 -rw-r--r-- 1 casaci root       669 Oct  6 00:39 test_tool_logsink.xml
05-Oct-2026 20:39:48 -rw-r--r-- 1 casaci root       549 Oct  6 00:39 test_tool_measures.xml
05-Oct-2026 20:39:48 -rw-r--r-- 1 casaci root      5224 Oct  6 00:39 test_tool_ms.xml
05-Oct-2026 20:39:48 -rw-r--r-- 1 casaci root       367 Oct  6 00:39 test_tool_ms_createmultims.xml
05-Oct-2026 20:39:48 -rw-r--r-- 1 casaci root      2096 Oct  6 00:39 test_tool_ms_statwt.xml
05-Oct-2026 20:39:48 -rw-r--r-- 1 casaci root      8633 Oct  6 00:39 test_tool_msmetadata.xml
05-Oct-2026 20:39:48 -rw-r--r-- 1 casaci root       359 Oct  6 00:39 test_tool_msuvbinner.xml
05-Oct-2026 20:39:48 -rw-r--r-- 1 casaci root      1171 Oct  6 00:39 test_tool_quanta.xml
05-Oct-2026 20:39:48 -rw-r--r-- 1 casaci root      3975 Oct  6 00:39 test_tool_regionmanager.xml
05-Oct-2026 20:39:48 -rw-r--r-- 1 casaci root      2071 Oct  6 00:39 test_tool_sdm.xml
05-Oct-2026 20:39:48 -rw-r--r-- 1 casaci root      2190 Oct  6 00:39 test_tool_sdm_toms.xml
05-Oct-2026 20:39:48 -rw-r--r-- 1 casaci root       670 Oct  6 00:39 test_tool_simulator.xml
05-Oct-2026 20:39:48 -rw-r--r-- 1 casaci root      1716 Oct  6 00:39 test_tool_synthesisutils.xml
05-Oct-2026 20:39:48 -rw-r--r-- 1 casaci root      1462 Oct  6 00:39 test_tool_table.xml
05-Oct-2026 20:39:48 -rw-r--r-- 1 casaci root      1717 Oct  6 00:39 test_tool_vpmanager.xml
05-Oct-2026 20:39:48 Finished task 'Test wheel' with result: Success
05-Oct-2026 20:39:48
Substituting variable: ${bamboo.planRepository.branchName} with master
05-Oct-2026 20:39:48
Substituting variable: ${bamboo.python_version} with 3.12
05-Oct-2026 20:39:48
Substituting variable: ${bamboo.agentId} with 153550850
05-Oct-2026 20:39:48
Substituting variable: ${bamboo.agentId} with 153550850
05-Oct-2026 20:39:48
Substituting variable: ${bamboo.agentId} with 153550850
05-Oct-2026 20:39:48
Substituting variable: ${bamboo.agentId} with 153550850
05-Oct-2026 20:39:48 Starting task 'Tar work directory' of type 'com.atlassian.bamboo.plugins.scripttask:task.builder.script'
05-Oct-2026 20:39:48
Beginning to execute external process for build 'CASASPECS - Master Test 3.12 - Test Tools Many Linux 2.34 Rocky 9.5 Py3.12 #288 (CASASPECS-MASTERTESTPY312-TTR9PML234-288)'
... running command line:
/opt/ci_workspace/casa/bamboo/agent2/temp/CASASPECS-MASTERTESTPY312-TTR9PML234-288-ScriptBuildTask-11487267477250791612.sh
... in: /opt/ci_workspace/casa/bamboo/agent2/xml-data/build-dir/CASASPECS-MASTERTESTPY312-TTR9PML234
05-Oct-2026 20:39:48 Package working directory
05-Oct-2026 20:39:48 nosedir/
05-Oct-2026 20:39:48 nosedir/test_tool_image_pbcor/
05-Oct-2026 20:39:48 nosedir/test_tool_image_pbcor/test_tool_image_pbcor.py
05-Oct-2026 20:39:48 nosedir/test_tool_image_pbcor/conftest.py
05-Oct-2026 20:39:48 nosedir/test_tool_image_pbcor/casa-20261006-003235.log
05-Oct-2026 20:39:48 nosedir/test_tool_image_pbcor/short_summary.log
05-Oct-2026 20:39:48 nosedir/xml/
05-Oct-2026 20:39:48 nosedir/xml/test_tool_image_pbcor/
05-Oct-2026 20:39:48 nosedir/xml/test_tool_image_pbcor/nose.xml
05-Oct-2026 20:39:48 nosedir/xml/test_tool_vpmanager/
05-Oct-2026 20:39:48 nosedir/xml/test_tool_vpmanager/nose.xml
05-Oct-2026 20:39:48 nosedir/xml/test_tool_ms/
05-Oct-2026 20:39:48 nosedir/xml/test_tool_ms/nose.xml
05-Oct-2026 20:39:48 nosedir/xml/test_tool_synthesisutils/
05-Oct-2026 20:39:48 nosedir/xml/test_tool_synthesisutils/nose.xml
05-Oct-2026 20:39:48 nosedir/xml/test_tool_regionmanager/
05-Oct-2026 20:39:48 nosedir/xml/test_tool_regionmanager/nose.xml
05-Oct-2026 20:39:48 nosedir/xml/test_tool_logsink/
05-Oct-2026 20:39:48 nosedir/xml/test_tool_logsink/nose.xml
05-Oct-2026 20:39:48 nosedir/xml/test_tool_calanalysis/
05-Oct-2026 20:39:48 nosedir/xml/test_tool_calanalysis/nose.xml
05-Oct-2026 20:39:48 nosedir/xml/test_tool_msmetadata/
05-Oct-2026 20:39:48 nosedir/xml/test_tool_msmetadata/nose.xml
05-Oct-2026 20:39:48 nosedir/xml/test_tool_imagepol/
05-Oct-2026 20:39:48 nosedir/xml/test_tool_imagepol/nose.xml
05-Oct-2026 20:39:48 nosedir/xml/test_tool_image_fitprofile/
05-Oct-2026 20:39:48 nosedir/xml/test_tool_image_fitprofile/nose.xml
05-Oct-2026 20:39:48 nosedir/xml/test_tool_image_rebin/
05-Oct-2026 20:39:48 nosedir/xml/test_tool_image_rebin/nose.xml
05-Oct-2026 20:39:48 nosedir/xml/test_tool_ms_createmultims/
05-Oct-2026 20:39:48 nosedir/xml/test_tool_ms_createmultims/nose.xml
05-Oct-2026 20:39:48 nosedir/xml/test_tool_sdm_toms/
05-Oct-2026 20:39:48 nosedir/xml/test_tool_sdm_toms/nose.xml
05-Oct-2026 20:39:48 nosedir/xml/test_tool_image_subimage/
05-Oct-2026 20:39:48 nosedir/xml/test_tool_image_subimage/nose.xml
05-Oct-2026 20:39:48 nosedir/xml/test_tool_image_pv/
05-Oct-2026 20:39:48 nosedir/xml/test_tool_image_pv/nose.xml
05-Oct-2026 20:39:48 nosedir/xml/test_tool_simulator/
05-Oct-2026 20:39:48 nosedir/xml/test_tool_simulator/nose.xml
05-Oct-2026 20:39:48 nosedir/xml/test_tool_ms_statwt/
05-Oct-2026 20:39:48 nosedir/xml/test_tool_ms_statwt/nose.xml
05-Oct-2026 20:39:48 nosedir/xml/test_tool_image_transpose/
05-Oct-2026 20:39:48 nosedir/xml/test_tool_image_transpose/nose.xml
05-Oct-2026 20:39:48 nosedir/xml/test_tool_image_collapse/
05-Oct-2026 20:39:48 nosedir/xml/test_tool_image_collapse/nose.xml
05-Oct-2026 20:39:48 nosedir/xml/test_tool_sdm/
05-Oct-2026 20:39:48 nosedir/xml/test_tool_sdm/nose.xml
05-Oct-2026 20:39:48 nosedir/xml/test_tool_msuvbinner/
05-Oct-2026 20:39:48 nosedir/xml/test_tool_msuvbinner/nose.xml
05-Oct-2026 20:39:48 nosedir/xml/test_tool_componentlist/
05-Oct-2026 20:39:48 nosedir/xml/test_tool_componentlist/nose.xml
05-Oct-2026 20:39:48 nosedir/xml/test_tool_image/
05-Oct-2026 20:39:48 nosedir/xml/test_tool_image/nose.xml
05-Oct-2026 20:39:48 nosedir/xml/test_tool_coordsys/
05-Oct-2026 20:39:48 nosedir/xml/test_tool_coordsys/nose.xml
05-Oct-2026 20:39:48 nosedir/xml/test_tool_linearmosaic/
05-Oct-2026 20:39:48 nosedir/xml/test_tool_linearmosaic/nose.xml
05-Oct-2026 20:39:48 nosedir/xml/test_tool_agentflagger/
05-Oct-2026 20:39:48 nosedir/xml/test_tool_agentflagger/nose.xml
05-Oct-2026 20:39:48 nosedir/xml/test_tool_image_deviation/
05-Oct-2026 20:39:48 nosedir/xml/test_tool_image_deviation/nose.xml
05-Oct-2026 20:39:48 nosedir/xml/test_tool_measures/
05-Oct-2026 20:39:48 nosedir/xml/test_tool_measures/nose.xml
05-Oct-2026 20:39:48 nosedir/xml/test_tool_image_statistics/
05-Oct-2026 20:39:48 nosedir/xml/test_tool_image_statistics/nose.xml
05-Oct-2026 20:39:48 nosedir/xml/test_tool_table/
05-Oct-2026 20:39:48 nosedir/xml/test_tool_table/nose.xml
05-Oct-2026 20:39:48 nosedir/xml/test_tool_calibrater/
05-Oct-2026 20:39:48 nosedir/xml/test_tool_calibrater/nose.xml
05-Oct-2026 20:39:48 nosedir/xml/test_tool_quanta/
05-Oct-2026 20:39:48 nosedir/xml/test_tool_quanta/nose.xml
05-Oct-2026 20:39:48 nosedir/xml/test_tool_image_regrid/
05-Oct-2026 20:39:48 nosedir/xml/test_tool_image_regrid/nose.xml
05-Oct-2026 20:39:48 nosedir/test_tool_vpmanager/
05-Oct-2026 20:39:48 nosedir/test_tool_vpmanager/test_tool_vpmanager.py
05-Oct-2026 20:39:48 nosedir/test_tool_vpmanager/conftest.py
05-Oct-2026 20:39:48 nosedir/test_tool_vpmanager/casa-20261006-003236.log
05-Oct-2026 20:39:48 nosedir/test_tool_vpmanager/short_summary.log
05-Oct-2026 20:39:48 nosedir/test_tool_ms/
05-Oct-2026 20:39:48 nosedir/test_tool_ms/test_tool_ms.py
05-Oct-2026 20:39:48 nosedir/test_tool_ms/conftest.py
05-Oct-2026 20:39:48 nosedir/test_tool_ms/casa-20261006-003239.log
05-Oct-2026 20:39:48 nosedir/test_tool_ms/short_summary.log
05-Oct-2026 20:39:48 nosedir/test_tool_synthesisutils/
05-Oct-2026 20:39:48 nosedir/test_tool_synthesisutils/test_tool_synthesisutils.py
05-Oct-2026 20:39:48 nosedir/test_tool_synthesisutils/conftest.py
05-Oct-2026 20:39:48 nosedir/test_tool_synthesisutils/casa-20261006-003255.log
05-Oct-2026 20:39:48 nosedir/test_tool_synthesisutils/short_summary.log
05-Oct-2026 20:39:48 nosedir/test_tool_regionmanager/
05-Oct-2026 20:39:48 nosedir/test_tool_regionmanager/test_tool_regionmanager.py
05-Oct-2026 20:39:48 nosedir/test_tool_regionmanager/conftest.py
05-Oct-2026 20:39:48 nosedir/test_tool_regionmanager/casa-20261006-003300.log
05-Oct-2026 20:39:48 nosedir/test_tool_regionmanager/short_summary.log
05-Oct-2026 20:39:48 nosedir/test_tool_logsink/
05-Oct-2026 20:39:48 nosedir/test_tool_logsink/test_tool_logsink.py
05-Oct-2026 20:39:48 nosedir/test_tool_logsink/conftest.py
05-Oct-2026 20:39:48 nosedir/test_tool_logsink/casa-20261006-003309.log
05-Oct-2026 20:39:48 nosedir/test_tool_logsink/short_summary.log
05-Oct-2026 20:39:48 nosedir/test_tool_calanalysis/
05-Oct-2026 20:39:48 nosedir/test_tool_calanalysis/test_tool_calanalysis.py
05-Oct-2026 20:39:48 nosedir/test_tool_calanalysis/conftest.py
05-Oct-2026 20:39:48 nosedir/test_tool_calanalysis/casa-20261006-003309.log
05-Oct-2026 20:39:48 nosedir/test_tool_calanalysis/short_summary.log
05-Oct-2026 20:39:48 nosedir/test_tool_msmetadata/
05-Oct-2026 20:39:48 nosedir/test_tool_msmetadata/test_tool_msmetadata.py
05-Oct-2026 20:39:48 nosedir/test_tool_msmetadata/conftest.py
05-Oct-2026 20:39:48 nosedir/test_tool_msmetadata/casa-20261006-003310.log
05-Oct-2026 20:39:48 nosedir/test_tool_msmetadata/short_summary.log
05-Oct-2026 20:39:48 nosedir/test_tool_imagepol/
05-Oct-2026 20:39:48 nosedir/test_tool_imagepol/test_tool_imagepol.py
05-Oct-2026 20:39:48 nosedir/test_tool_imagepol/conftest.py
05-Oct-2026 20:39:48 nosedir/test_tool_imagepol/casa-20261006-003313.log
05-Oct-2026 20:39:48 nosedir/test_tool_imagepol/short_summary.log
05-Oct-2026 20:39:48 nosedir/test_tool_image_fitprofile/
05-Oct-2026 20:39:48 nosedir/test_tool_image_fitprofile/test_tool_image_fitprofile.py
05-Oct-2026 20:39:48 nosedir/test_tool_image_fitprofile/conftest.py
05-Oct-2026 20:39:48 nosedir/test_tool_image_fitprofile/casa-20261006-003314.log
05-Oct-2026 20:39:48 nosedir/test_tool_image_fitprofile/short_summary.log
05-Oct-2026 20:39:48 nosedir/test_tool_image_rebin/
05-Oct-2026 20:39:48 nosedir/test_tool_image_rebin/test_tool_image_rebin.py
05-Oct-2026 20:39:48 nosedir/test_tool_image_rebin/conftest.py
05-Oct-2026 20:39:48 nosedir/test_tool_image_rebin/casa-20261006-003319.log
05-Oct-2026 20:39:48 nosedir/test_tool_image_rebin/short_summary.log
05-Oct-2026 20:39:48 nosedir/test_tool_ms_createmultims/
05-Oct-2026 20:39:48 nosedir/test_tool_ms_createmultims/test_tool_ms_createmultims.py
05-Oct-2026 20:39:48 nosedir/test_tool_ms_createmultims/conftest.py
05-Oct-2026 20:39:48 nosedir/test_tool_ms_createmultims/casa-20261006-003319.log
05-Oct-2026 20:39:48 nosedir/test_tool_ms_createmultims/short_summary.log
05-Oct-2026 20:39:48 nosedir/test_tool_sdm_toms/
05-Oct-2026 20:39:48 nosedir/test_tool_sdm_toms/test_tool_sdm_toms.py
05-Oct-2026 20:39:48 nosedir/test_tool_sdm_toms/conftest.py
05-Oct-2026 20:39:48 nosedir/test_tool_sdm_toms/casa-20261006-003322.log
05-Oct-2026 20:39:48 nosedir/test_tool_sdm_toms/short_summary.log
05-Oct-2026 20:39:48 nosedir/summary_of_failed.log
05-Oct-2026 20:39:48 nosedir/test_tool_image_subimage/
05-Oct-2026 20:39:48 nosedir/test_tool_image_subimage/test_tool_image_subimage.py
05-Oct-2026 20:39:48 nosedir/test_tool_image_subimage/conftest.py
05-Oct-2026 20:39:48 nosedir/test_tool_image_subimage/casa-20261006-003535.log
05-Oct-2026 20:39:48 nosedir/test_tool_image_subimage/short_summary.log
05-Oct-2026 20:39:48 nosedir/test_tool_image_pv/
05-Oct-2026 20:39:48 nosedir/test_tool_image_pv/test_tool_image_pv.py
05-Oct-2026 20:39:48 nosedir/test_tool_image_pv/conftest.py
05-Oct-2026 20:39:48 nosedir/test_tool_image_pv/casa-20261006-003536.log
05-Oct-2026 20:39:48 nosedir/test_tool_image_pv/short_summary.log
05-Oct-2026 20:39:48 nosedir/test_tool_simulator/
05-Oct-2026 20:39:48 nosedir/test_tool_simulator/test_tool_simulator.py
05-Oct-2026 20:39:48 nosedir/test_tool_simulator/conftest.py
05-Oct-2026 20:39:48 nosedir/test_tool_simulator/casa-20261006-003537.log
05-Oct-2026 20:39:48 nosedir/test_tool_simulator/short_summary.log
05-Oct-2026 20:39:48 nosedir/test_tool_ms_statwt/
05-Oct-2026 20:39:48 nosedir/test_tool_ms_statwt/test_tool_ms_statwt.py
05-Oct-2026 20:39:48 nosedir/test_tool_ms_statwt/conftest.py
05-Oct-2026 20:39:48 nosedir/test_tool_ms_statwt/casa-20261006-003539.log
05-Oct-2026 20:39:48 nosedir/test_tool_ms_statwt/short_summary.log
05-Oct-2026 20:39:48 nosedir/test_tool_image_transpose/
05-Oct-2026 20:39:48 nosedir/test_tool_image_transpose/test_tool_image_transpose.py
05-Oct-2026 20:39:48 nosedir/test_tool_image_transpose/conftest.py
05-Oct-2026 20:39:48 nosedir/test_tool_image_transpose/casa-20261006-003611.log
05-Oct-2026 20:39:48 nosedir/test_tool_image_transpose/short_summary.log
05-Oct-2026 20:39:48 nosedir/test_tool_image_collapse/
05-Oct-2026 20:39:48 nosedir/test_tool_image_collapse/test_tool_image_collapse.py
05-Oct-2026 20:39:48 nosedir/test_tool_image_collapse/conftest.py
05-Oct-2026 20:39:48 nosedir/test_tool_image_collapse/casa-20261006-003612.log
05-Oct-2026 20:39:48 nosedir/test_tool_image_collapse/short_summary.log
05-Oct-2026 20:39:48 nosedir/test_tool_sdm/
05-Oct-2026 20:39:48 nosedir/test_tool_sdm/test_tool_sdm.py
05-Oct-2026 20:39:48 nosedir/test_tool_sdm/conftest.py
05-Oct-2026 20:39:48 nosedir/test_tool_sdm/casa-20261006-003613.log
05-Oct-2026 20:39:48 nosedir/test_tool_sdm/short_summary.log
05-Oct-2026 20:39:48 nosedir/test_tool_msuvbinner/
05-Oct-2026 20:39:48 nosedir/test_tool_msuvbinner/test_tool_msuvbinner.py
05-Oct-2026 20:39:48 nosedir/test_tool_msuvbinner/conftest.py
05-Oct-2026 20:39:48 nosedir/test_tool_msuvbinner/casa-20261006-003620.log
05-Oct-2026 20:39:48 nosedir/test_tool_msuvbinner/short_summary.log
05-Oct-2026 20:39:48 nosedir/test_tool_componentlist/
05-Oct-2026 20:39:48 nosedir/test_tool_componentlist/test_tool_componentlist.py
05-Oct-2026 20:39:48 nosedir/test_tool_componentlist/conftest.py
05-Oct-2026 20:39:48 nosedir/test_tool_componentlist/casa-20261006-003621.log
05-Oct-2026 20:39:48 nosedir/test_tool_componentlist/short_summary.log
05-Oct-2026 20:39:48 nosedir/test_tool_image/
05-Oct-2026 20:39:48 nosedir/test_tool_image/test_tool_image.py
05-Oct-2026 20:39:48 nosedir/test_tool_image/conftest.py
05-Oct-2026 20:39:48 nosedir/test_tool_image/casa-20261006-003622.log
05-Oct-2026 20:39:48 nosedir/test_tool_image/short_summary.log
05-Oct-2026 20:39:48 nosedir/test_tool_coordsys/
05-Oct-2026 20:39:48 nosedir/test_tool_coordsys/test_tool_coordsys.py
05-Oct-2026 20:39:48 nosedir/test_tool_coordsys/conftest.py
05-Oct-2026 20:39:48 nosedir/test_tool_coordsys/casa-20261006-003651.log
05-Oct-2026 20:39:48 nosedir/test_tool_coordsys/short_summary.log
05-Oct-2026 20:39:48 nosedir/test_tool_linearmosaic/
05-Oct-2026 20:39:48 nosedir/test_tool_linearmosaic/test_tool_linearmosaic.py
05-Oct-2026 20:39:48 nosedir/test_tool_linearmosaic/conftest.py
05-Oct-2026 20:39:48 nosedir/test_tool_linearmosaic/casa-20261006-003651.log
05-Oct-2026 20:39:48 nosedir/test_tool_linearmosaic/short_summary.log
05-Oct-2026 20:39:48 nosedir/test_tool_agentflagger/
05-Oct-2026 20:39:48 nosedir/test_tool_agentflagger/test_tool_agentflagger.py
05-Oct-2026 20:39:48 nosedir/test_tool_agentflagger/conftest.py
05-Oct-2026 20:39:48 nosedir/test_tool_agentflagger/casa-20261006-003657.log
05-Oct-2026 20:39:48 nosedir/test_tool_agentflagger/short_summary.log
05-Oct-2026 20:39:48 nosedir/test_tool_image_deviation/
05-Oct-2026 20:39:48 nosedir/test_tool_image_deviation/test_tool_image_deviation.py
05-Oct-2026 20:39:48 nosedir/test_tool_image_deviation/conftest.py
05-Oct-2026 20:39:48 nosedir/test_tool_image_deviation/casa-20261006-003710.log
05-Oct-2026 20:39:48 nosedir/test_tool_image_deviation/short_summary.log
05-Oct-2026 20:39:48 nosedir/test_tool_measures/
05-Oct-2026 20:39:48 nosedir/test_tool_measures/test_tool_measures.py
05-Oct-2026 20:39:48 nosedir/test_tool_measures/conftest.py
05-Oct-2026 20:39:48 nosedir/test_tool_measures/casa-20261006-003714.log
05-Oct-2026 20:39:48 nosedir/test_tool_measures/short_summary.log
05-Oct-2026 20:39:48 nosedir/test_tool_image_statistics/
05-Oct-2026 20:39:48 nosedir/test_tool_image_statistics/test_tool_image_statistics.py
05-Oct-2026 20:39:48 nosedir/test_tool_image_statistics/conftest.py
05-Oct-2026 20:39:48 nosedir/test_tool_image_statistics/casa-20261006-003715.log
05-Oct-2026 20:39:48 nosedir/test_tool_image_statistics/short_summary.log
05-Oct-2026 20:39:48 nosedir/test_tool_table/
05-Oct-2026 20:39:48 nosedir/test_tool_table/test_tool_table.py
05-Oct-2026 20:39:48 nosedir/test_tool_table/conftest.py
05-Oct-2026 20:39:48 nosedir/test_tool_table/casa-20261006-003856.log
05-Oct-2026 20:39:48 nosedir/test_tool_table/short_summary.log
05-Oct-2026 20:39:48 nosedir/test_tool_calibrater/
05-Oct-2026 20:39:48 nosedir/test_tool_calibrater/test_tool_calibrater.py
05-Oct-2026 20:39:48 nosedir/test_tool_calibrater/conftest.py
05-Oct-2026 20:39:48 nosedir/test_tool_calibrater/casa-20261006-003857.log
05-Oct-2026 20:39:48 nosedir/test_tool_calibrater/short_summary.log
05-Oct-2026 20:39:48 nosedir/test_tool_quanta/
05-Oct-2026 20:39:48 nosedir/test_tool_quanta/test_tool_quanta.py
05-Oct-2026 20:39:48 nosedir/test_tool_quanta/conftest.py
05-Oct-2026 20:39:48 nosedir/test_tool_quanta/casa-20261006-003946.log
05-Oct-2026 20:39:48 nosedir/test_tool_quanta/short_summary.log
05-Oct-2026 20:39:48 nosedir/test_tool_image_regrid/
05-Oct-2026 20:39:48 nosedir/test_tool_image_regrid/test_tool_image_regrid.py
05-Oct-2026 20:39:48 nosedir/test_tool_image_regrid/conftest.py
05-Oct-2026 20:39:48 nosedir/test_tool_image_regrid/casa-20261006-003947.log
05-Oct-2026 20:39:48 nosedir/test_tool_image_regrid/short_summary.log
05-Oct-2026 20:39:48 total 84200
05-Oct-2026 20:39:48 -rw-r--r-- 1 casaci 15001   161014 Oct  6 00:30 casatestutils-6.7.7.12-py3-none-any.whl
05-Oct-2026 20:39:48 -rw-r--r-- 1 casaci 15001 85700381 Oct  6 00:30 casatools-6.7.7.12-cp312-cp312-manylinux_2_34_x86_64.whl
05-Oct-2026 20:39:48 -rw-r--r-- 1 casaci root      4340 Oct  6 00:39 test_tool_agentflagger.xml
05-Oct-2026 20:39:48 -rw-r--r-- 1 casaci root      1006 Oct  6 00:39 test_tool_calanalysis.xml
05-Oct-2026 20:39:48 -rw-r--r-- 1 casaci root      2656 Oct  6 00:39 test_tool_calibrater.xml
05-Oct-2026 20:39:48 -rw-r--r-- 1 casaci root       687 Oct  6 00:39 test_tool_componentlist.xml
05-Oct-2026 20:39:48 -rw-r--r-- 1 casaci root      7467 Oct  6 00:39 test_tool_coordsys.xml
05-Oct-2026 20:39:48 -rw-r--r-- 1 casaci root     12935 Oct  6 00:39 test_tool_image.xml
05-Oct-2026 20:39:48 -rw-r--r-- 1 casaci root      2220 Oct  6 00:39 test_tool_image_collapse.xml
05-Oct-2026 20:39:48 -rw-r--r-- 1 casaci root      1048 Oct  6 00:39 test_tool_image_deviation.xml
05-Oct-2026 20:39:48 -rw-r--r-- 1 casaci root      2574 Oct  6 00:39 test_tool_image_fitprofile.xml
05-Oct-2026 20:39:48 -rw-r--r-- 1 casaci root      1178 Oct  6 00:39 test_tool_image_pbcor.xml
05-Oct-2026 20:39:48 -rw-r--r-- 1 casaci root       883 Oct  6 00:39 test_tool_image_pv.xml
05-Oct-2026 20:39:48 -rw-r--r-- 1 casaci root      1006 Oct  6 00:39 test_tool_image_rebin.xml
05-Oct-2026 20:39:48 -rw-r--r-- 1 casaci root      1336 Oct  6 00:39 test_tool_image_regrid.xml
05-Oct-2026 20:39:48 -rw-r--r-- 1 casaci root      1640 Oct  6 00:39 test_tool_image_statistics.xml
05-Oct-2026 20:39:48 -rw-r--r-- 1 casaci root       765 Oct  6 00:39 test_tool_image_subimage.xml
05-Oct-2026 20:39:48 -rw-r--r-- 1 casaci root       890 Oct  6 00:39 test_tool_image_transpose.xml
05-Oct-2026 20:39:48 -rw-r--r-- 1 casaci root      1966 Oct  6 00:39 test_tool_imagepol.xml
05-Oct-2026 20:39:48 -rw-r--r-- 1 casaci root       838 Oct  6 00:39 test_tool_linearmosaic.xml
05-Oct-2026 20:39:48 -rw-r--r-- 1 casaci root       669 Oct  6 00:39 test_tool_logsink.xml
05-Oct-2026 20:39:48 -rw-r--r-- 1 casaci root       549 Oct  6 00:39 test_tool_measures.xml
05-Oct-2026 20:39:48 -rw-r--r-- 1 casaci root      5224 Oct  6 00:39 test_tool_ms.xml
05-Oct-2026 20:39:48 -rw-r--r-- 1 casaci root       367 Oct  6 00:39 test_tool_ms_createmultims.xml
05-Oct-2026 20:39:48 -rw-r--r-- 1 casaci root      2096 Oct  6 00:39 test_tool_ms_statwt.xml
05-Oct-2026 20:39:48 -rw-r--r-- 1 casaci root      8633 Oct  6 00:39 test_tool_msmetadata.xml
05-Oct-2026 20:39:48 -rw-r--r-- 1 casaci root       359 Oct  6 00:39 test_tool_msuvbinner.xml
05-Oct-2026 20:39:48 -rw-r--r-- 1 casaci root      1171 Oct  6 00:39 test_tool_quanta.xml
05-Oct-2026 20:39:48 -rw-r--r-- 1 casaci root      3975 Oct  6 00:39 test_tool_regionmanager.xml
05-Oct-2026 20:39:48 -rw-r--r-- 1 casaci root      2071 Oct  6 00:39 test_tool_sdm.xml
05-Oct-2026 20:39:48 -rw-r--r-- 1 casaci root      2190 Oct  6 00:39 test_tool_sdm_toms.xml
05-Oct-2026 20:39:48 -rw-r--r-- 1 casaci root       670 Oct  6 00:39 test_tool_simulator.xml
05-Oct-2026 20:39:48 -rw-r--r-- 1 casaci root      1716 Oct  6 00:39 test_tool_synthesisutils.xml
05-Oct-2026 20:39:48 -rw-r--r-- 1 casaci root      1462 Oct  6 00:39 test_tool_table.xml
05-Oct-2026 20:39:48 -rw-r--r-- 1 casaci root      1717 Oct  6 00:39 test_tool_vpmanager.xml
05-Oct-2026 20:39:48 -rw-r--r-- 1 casaci root    187164 Oct  6 00:39 work-rocky9_casatools-3.12.tar.gz
05-Oct-2026 20:39:48 Done packaging working directory
05-Oct-2026 20:39:48 Finished task 'Tar work directory' with result: Success
05-Oct-2026 20:39:48 Starting task 'Parse tests' of type 'com.atlassian.bamboo.plugins.testresultparser:task.testresultparser.junit'
05-Oct-2026 20:39:48 Parsing test results under /opt/ci_workspace/casa/bamboo/agent2/xml-data/build-dir/CASASPECS-MASTERTESTPY312-TTR9PML234...
05-Oct-2026 20:39:48 Finished task 'Parse tests' with result: Success
05-Oct-2026 20:39:48
Substituting variable: ${bamboo.agentId} with 153550850
05-Oct-2026 20:39:48 Starting task 'Upload wheel' of type 'com.atlassian.bamboo.plugins.scripttask:task.builder.script'
05-Oct-2026 20:39:48
Beginning to execute external process for build 'CASASPECS - Master Test 3.12 - Test Tools Many Linux 2.34 Rocky 9.5 Py3.12 #288 (CASASPECS-MASTERTESTPY312-TTR9PML234-288)'
... running command line:
/opt/ci_workspace/casa/bamboo/agent2/temp/CASASPECS-MASTERTESTPY312-TTR9PML234-288-ScriptBuildTask-6122295281408092564.sh
... in: /opt/ci_workspace/casa/bamboo/agent2/xml-data/build-dir/CASASPECS-MASTERTESTPY312-TTR9PML234
05-Oct-2026 20:39:49 Collecting twine
05-Oct-2026 20:39:49   Downloading twine-7.0.0-py3-none-any.whl (43 kB)
05-Oct-2026 20:39:49      ━━━━━━━━━━━━━━━━━━━━━━━━━━━━━━━━━━━━━━━━ 43.2/43.2 kB 5.7 MB/s eta 0:00:00
05-Oct-2026 20:39:49 Collecting requests>=2.20
05-Oct-2026 20:39:49   Downloading requests-2.34.2-py3-none-any.whl (73 kB)
05-Oct-2026 20:39:49      ━━━━━━━━━━━━━━━━━━━━━━━━━━━━━━━━━━━━━━━━ 73.1/73.1 kB 14.4 MB/s eta 0:00:00
05-Oct-2026 20:39:49 Collecting rfc3986>=1.4.0
05-Oct-2026 20:39:49   Downloading rfc3986-2.0.0-py2.py3-none-any.whl (31 kB)
05-Oct-2026 20:39:49 Collecting packaging>=26.1
05-Oct-2026 20:39:49   Downloading packaging-26.3-py3-none-any.whl (129 kB)
05-Oct-2026 20:39:49      ━━━━━━━━━━━━━━━━━━━━━━━━━━━━━━━━━━━━━━ 130.0/130.0 kB 44.4 MB/s eta 0:00:00
05-Oct-2026 20:39:49 Collecting rich>=14.3.3
05-Oct-2026 20:39:49   Downloading rich-15.0.0-py3-none-any.whl (310 kB)
05-Oct-2026 20:39:49      ━━━━━━━━━━━━━━━━━━━━━━━━━━━━━━━━━━━━━━ 310.7/310.7 kB 63.3 MB/s eta 0:00:00
05-Oct-2026 20:39:49 Collecting urllib3>=1.26.0
05-Oct-2026 20:39:49   Downloading urllib3-2.8.0-py3-none-any.whl (135 kB)
05-Oct-2026 20:39:49      ━━━━━━━━━━━━━━━━━━━━━━━━━━━━━━━━━━━━━━ 135.7/135.7 kB 49.7 MB/s eta 0:00:00
05-Oct-2026 20:39:49 Collecting requests-toolbelt!=0.9.0,>=0.8.0
05-Oct-2026 20:39:49   Downloading requests_toolbelt-1.0.0-py2.py3-none-any.whl (54 kB)
05-Oct-2026 20:39:49      ━━━━━━━━━━━━━━━━━━━━━━━━━━━━━━━━━━━━━━━━ 54.5/54.5 kB 23.6 MB/s eta 0:00:00
05-Oct-2026 20:39:49 Collecting readme-renderer>=35.0
05-Oct-2026 20:39:49   Downloading readme_renderer-46.0-py3-none-any.whl (14 kB)
05-Oct-2026 20:39:49 Collecting id
05-Oct-2026 20:39:49   Downloading id-1.6.1-py3-none-any.whl (14 kB)
05-Oct-2026 20:39:49 Collecting keyring>=21.2.0
05-Oct-2026 20:39:49   Downloading keyring-25.7.0-py3-none-any.whl (39 kB)
05-Oct-2026 20:39:49 Collecting jaraco.classes
05-Oct-2026 20:39:49   Downloading jaraco.classes-3.4.0-py3-none-any.whl (6.8 kB)
05-Oct-2026 20:39:49 Collecting jaraco.context
05-Oct-2026 20:39:49   Downloading jaraco_context-6.1.2-py3-none-any.whl (7.9 kB)
05-Oct-2026 20:39:49 Collecting jeepney>=0.4.2
05-Oct-2026 20:39:49   Downloading jeepney-0.9.0-py3-none-any.whl (49 kB)
05-Oct-2026 20:39:49      ━━━━━━━━━━━━━━━━━━━━━━━━━━━━━━━━━━━━━━━━ 49.0/49.0 kB 30.3 MB/s eta 0:00:00
05-Oct-2026 20:39:49 Collecting jaraco.functools
05-Oct-2026 20:39:49   Downloading jaraco_functools-4.6.0-py3-none-any.whl (11 kB)
05-Oct-2026 20:39:49 Collecting importlib_metadata>=4.11.4
05-Oct-2026 20:39:49   Downloading importlib_metadata-9.0.1-py3-none-any.whl (27 kB)
05-Oct-2026 20:39:49 Collecting SecretStorage>=3.2
05-Oct-2026 20:39:49   Downloading secretstorage-3.5.0-py3-none-any.whl (15 kB)
05-Oct-2026 20:39:49 Collecting nh3>=0.2.14
05-Oct-2026 20:39:49   Downloading nh3-0.3.7-cp38-abi3-manylinux_2_17_x86_64.manylinux2014_x86_64.whl (832 kB)
05-Oct-2026 20:39:49      ━━━━━━━━━━━━━━━━━━━━━━━━━━━━━━━━━━━━━━ 832.2/832.2 kB 85.0 MB/s eta 0:00:00
05-Oct-2026 20:39:49 Collecting docutils>=0.21.2
05-Oct-2026 20:39:50   Downloading docutils-0.23-py3-none-any.whl (634 kB)
05-Oct-2026 20:39:50      ━━━━━━━━━━━━━━━━━━━━━━━━━━━━━━━━━━━━━ 634.7/634.7 kB 121.3 MB/s eta 0:00:00
05-Oct-2026 20:39:50 Collecting Pygments>=2.5.1
05-Oct-2026 20:39:50   Downloading pygments-2.21.0-py3-none-any.whl (1.3 MB)
05-Oct-2026 20:39:50      ━━━━━━━━━━━━━━━━━━━━━━━━━━━━━━━━━━━━━━━━ 1.3/1.3 MB 152.2 MB/s eta 0:00:00
05-Oct-2026 20:39:50 Collecting certifi>=2023.5.7
05-Oct-2026 20:39:50   Downloading certifi-2026.7.22-py3-none-any.whl (136 kB)
05-Oct-2026 20:39:50      ━━━━━━━━━━━━━━━━━━━━━━━━━━━━━━━━━━━━━━ 137.0/137.0 kB 40.0 MB/s eta 0:00:00
05-Oct-2026 20:39:50 Collecting charset_normalizer<4,>=2
05-Oct-2026 20:39:50   Downloading charset_normalizer-3.5.2-cp310-cp310-manylinux2014_x86_64.manylinux_2_17_x86_64.manylinux_2_28_x86_64.whl (271 kB)
05-Oct-2026 20:39:50      ━━━━━━━━━━━━━━━━━━━━━━━━━━━━━━━━━━━━━━ 271.1/271.1 kB 61.7 MB/s eta 0:00:00
05-Oct-2026 20:39:50 Collecting idna<4,>=2.5
05-Oct-2026 20:39:50   Downloading idna-3.20-py3-none-any.whl (69 kB)
05-Oct-2026 20:39:50      ━━━━━━━━━━━━━━━━━━━━━━━━━━━━━━━━━━━━━━━━ 69.6/69.6 kB 34.1 MB/s eta 0:00:00
05-Oct-2026 20:39:50 Collecting markdown-it-py>=2.2.0
05-Oct-2026 20:39:50   Downloading markdown_it_py-4.2.0-py3-none-any.whl (91 kB)
05-Oct-2026 20:39:50      ━━━━━━━━━━━━━━━━━━━━━━━━━━━━━━━━━━━━━━━━ 91.7/91.7 kB 39.1 MB/s eta 0:00:00
05-Oct-2026 20:39:50 Collecting zipp>=3.20
05-Oct-2026 20:39:50   Downloading zipp-4.1.1-py3-none-any.whl (10 kB)
05-Oct-2026 20:39:50 Collecting mdurl~=0.1
05-Oct-2026 20:39:50   Downloading mdurl-0.1.2-py3-none-any.whl (10.0 kB)
05-Oct-2026 20:39:50 Collecting cryptography>=2.0
05-Oct-2026 20:39:50   Downloading cryptography-50.0.2-cp39-abi3-manylinux_2_34_x86_64.whl (4.8 MB)
05-Oct-2026 20:39:50      ━━━━━━━━━━━━━━━━━━━━━━━━━━━━━━━━━━━━━━━━ 4.8/4.8 MB 124.3 MB/s eta 0:00:00
05-Oct-2026 20:39:50 Collecting more-itertools
05-Oct-2026 20:39:50   Downloading more_itertools-11.1.0-py3-none-any.whl (72 kB)
05-Oct-2026 20:39:50      ━━━━━━━━━━━━━━━━━━━━━━━━━━━━━━━━━━━━━━━━ 72.2/72.2 kB 20.2 MB/s eta 0:00:00
05-Oct-2026 20:39:51 Collecting backports.tarfile
05-Oct-2026 20:39:51   Downloading backports.tarfile-1.2.0-py3-none-any.whl (30 kB)
05-Oct-2026 20:39:51 Collecting typing-extensions>=4.13.2
05-Oct-2026 20:39:51   Downloading typing_extensions-4.16.0-py3-none-any.whl (45 kB)
05-Oct-2026 20:39:51      ━━━━━━━━━━━━━━━━━━━━━━━━━━━━━━━━━━━━━━━━ 45.6/45.6 kB 25.2 MB/s eta 0:00:00
05-Oct-2026 20:39:51 Collecting cffi>=2.0.0
05-Oct-2026 20:39:51   Downloading cffi-2.1.1-cp310-cp310-manylinux2014_x86_64.manylinux_2_17_x86_64.whl (218 kB)
05-Oct-2026 20:39:51      ━━━━━━━━━━━━━━━━━━━━━━━━━━━━━━━━━━━━━━ 218.7/218.7 kB 45.7 MB/s eta 0:00:00
05-Oct-2026 20:39:51 Collecting pycparser
05-Oct-2026 20:39:51   Downloading pycparser-3.0-py3-none-any.whl (48 kB)
05-Oct-2026 20:39:51      ━━━━━━━━━━━━━━━━━━━━━━━━━━━━━━━━━━━━━━━━ 48.2/48.2 kB 21.5 MB/s eta 0:00:00
05-Oct-2026 20:39:51 Installing collected packages: zipp, urllib3, typing-extensions, rfc3986, Pygments, pycparser, packaging, nh3, more-itertools, mdurl, jeepney, idna, docutils, charset_normalizer, certifi, backports.tarfile, requests, readme-renderer, markdown-it-py, jaraco.functools, jaraco.context, jaraco.classes, importlib_metadata, id, cffi, rich, requests-toolbelt, cryptography, SecretStorage, keyring, twine
05-Oct-2026 20:39:52 Successfully installed Pygments-2.21.0 SecretStorage-3.5.0 backports.tarfile-1.2.0 certifi-2026.7.22 cffi-2.1.1 charset_normalizer-3.5.2 cryptography-50.0.2 docutils-0.23 id-1.6.1 idna-3.20 importlib_metadata-9.0.1 jaraco.classes-3.4.0 jaraco.context-6.1.2 jaraco.functools-4.6.0 jeepney-0.9.0 keyring-25.7.0 markdown-it-py-4.2.0 mdurl-0.1.2 more-itertools-11.1.0 nh3-0.3.7 packaging-26.3 pycparser-3.0 readme-renderer-46.0 requests-2.34.2 requests-toolbelt-1.0.0 rfc3986-2.0.0 rich-15.0.0 twine-7.0.0 typing-extensions-4.16.0 urllib3-2.8.0 zipp-4.1.1
05-Oct-2026 20:39:52 WARNING: Running pip as the 'root' user can result in broken permissions and conflicting behaviour with the system package manager. It is recommended to use a virtual environment instead: https://pip.pypa.io/warnings/venv
05-Oct-2026 20:39:53
05-Oct-2026 20:39:53 [notice] A new release of pip is available: 23.0.1 -> 26.2.1
05-Oct-2026 20:39:53 [notice] To update, run: pip3 install --upgrade pip
05-Oct-2026 20:39:53 Cloning into 'casa-build-utils'...
05-Oct-2026 20:39:53 Uploading distributions to
05-Oct-2026 20:39:53 https://casa-pip.nrao.edu:443/repository/casa-test-wheel/
05-Oct-2026 20:39:53 Uploading casatools-6.7.7.12-cp312-cp312-manylinux_2_34_x86_64.whl
05-Oct-2026 20:39:53
05-Oct-2026 20:39:53   0% ━━━━━━━━━━━━━━━━━━━━━━━━━━━━━━━━━━━━━━━━ 0.0/85.7 MB • --:-- • ?
05-Oct-2026 20:39:53 17% ━━━━━━╸━━━━━━━━━━━━━━━━━━━━━━━━━━━━━━━━━ 14.9/85.7 MB • 00:01 • 242.4 MB/s
05-Oct-2026 20:39:54 17% ━━━━━━╸━━━━━━━━━━━━━━━━━━━━━━━━━━━━━━━━━ 14.9/85.7 MB • 00:01 • 242.4 MB/s
05-Oct-2026 20:39:54 22% ━━━━━━━━╸━━━━━━━━━━━━━━━━━━━━━━━━━━━━━━━ 19.0/85.7 MB • 00:01 • 86.3 MB/s
05-Oct-2026 20:39:54 27% ━━━━━━━━━━╸━━━━━━━━━━━━━━━━━━━━━━━━━━━━━ 23.0/85.7 MB • 00:02 • 53.8 MB/s
05-Oct-2026 20:39:54 31% ━━━━━━━━━━━━╺━━━━━━━━━━━━━━━━━━━━━━━━━━━ 26.6/85.7 MB • 00:02 • 38.9 MB/s
05-Oct-2026 20:39:54 32% ━━━━━━━━━━━━╸━━━━━━━━━━━━━━━━━━━━━━━━━━━ 27.3/85.7 MB • 00:02 • 35.6 MB/s
05-Oct-2026 20:39:54 36% ━━━━━━━━━━━━━━╺━━━━━━━━━━━━━━━━━━━━━━━━━ 31.0/85.7 MB • 00:02 • 28.6 MB/s
05-Oct-2026 20:39:54 36% ━━━━━━━━━━━━━━╸━━━━━━━━━━━━━━━━━━━━━━━━━ 31.2/85.7 MB • 00:03 • 22.8 MB/s
05-Oct-2026 20:39:54 41% ━━━━━━━━━━━━━━━━╺━━━━━━━━━━━━━━━━━━━━━━━ 34.9/85.7 MB • 00:02 • 27.5 MB/s
05-Oct-2026 20:39:54 45% ━━━━━━━━━━━━━━━━━╸━━━━━━━━━━━━━━━━━━━━━━ 38.2/85.7 MB • 00:02 • 27.7 MB/s
05-Oct-2026 20:39:54 50% ━━━━━━━━━━━━━━━━━━━╸━━━━━━━━━━━━━━━━━━━━ 42.7/85.7 MB • 00:02 • 27.8 MB/s
05-Oct-2026 20:39:55 54% ━━━━━━━━━━━━━━━━━━━━━╸━━━━━━━━━━━━━━━━━━ 46.3/85.7 MB • 00:02 • 29.7 MB/s
05-Oct-2026 20:39:55 54% ━━━━━━━━━━━━━━━━━━━━━╸━━━━━━━━━━━━━━━━━━ 46.3/85.7 MB • 00:02 • 29.7 MB/s
05-Oct-2026 20:39:55 58% ━━━━━━━━━━━━━━━━━━━━━━━╺━━━━━━━━━━━━━━━━ 49.8/85.7 MB • 00:02 • 31.4 MB/s
05-Oct-2026 20:39:55 63% ━━━━━━━━━━━━━━━━━━━━━━━━━╺━━━━━━━━━━━━━━ 54.1/85.7 MB • 00:02 • 31.5 MB/s
05-Oct-2026 20:39:55 68% ━━━━━━━━━━━━━━━━━━━━━━━━━━━╺━━━━━━━━━━━━ 58.4/85.7 MB • 00:01 • 30.8 MB/s
05-Oct-2026 20:39:55 68% ━━━━━━━━━━━━━━━━━━━━━━━━━━━╺━━━━━━━━━━━━ 58.4/85.7 MB • 00:01 • 30.8 MB/s
05-Oct-2026 20:39:55 73% ━━━━━━━━━━━━━━━━━━━━━━━━━━━━━╺━━━━━━━━━━ 62.8/85.7 MB • 00:01 • 38.7 MB/s
05-Oct-2026 20:39:55 77% ━━━━━━━━━━━━━━━━━━━━━━━━━━━━━━╸━━━━━━━━━ 66.3/85.7 MB • 00:01 • 38.1 MB/s
05-Oct-2026 20:39:55 82% ━━━━━━━━━━━━━━━━━━━━━━━━━━━━━━━━╸━━━━━━━ 70.5/85.7 MB • 00:01 • 29.5 MB/s
05-Oct-2026 20:39:55 82% ━━━━━━━━━━━━━━━━━━━━━━━━━━━━━━━━╸━━━━━━━ 70.5/85.7 MB • 00:01 • 29.5 MB/s
05-Oct-2026 20:39:56 87% ━━━━━━━━━━━━━━━━━━━━━━━━━━━━━━━━━━╸━━━━━ 74.9/85.7 MB • 00:01 • 38.0 MB/s
05-Oct-2026 20:39:56 93% ━━━━━━━━━━━━━━━━━━━━━━━━━━━━━━━━━━━━━╺━━ 79.3/85.7 MB • 00:01 • 38.1 MB/s
05-Oct-2026 20:39:56 97% ━━━━━━━━━━━━━━━━━━━━━━━━━━━━━━━━━━━━━━╸━ 82.9/85.7 MB • 00:01 • 32.8 MB/s
05-Oct-2026 20:39:56 97% ━━━━━━━━━━━━━━━━━━━━━━━━━━━━━━━━━━━━━━╸━ 82.9/85.7 MB • 00:01 • 32.8 MB/s
05-Oct-2026 20:39:56 100% ━━━━━━━━━━━━━━━━━━━━━━━━━━━━━━━━━━━━━━━━ 85.7/85.7 MB • 00:02 • 30.6 MB/s
05-Oct-2026 20:39:56 100% ━━━━━━━━━━━━━━━━━━━━━━━━━━━━━━━━━━━━━━━━ 85.7/85.7 MB • 00:02 • 30.6 MB/s
05-Oct-2026 20:39:56 100% ━━━━━━━━━━━━━━━━━━━━━━━━━━━━━━━━━━━━━━━━ 85.7/85.7 MB • 00:02 • 30.6 MB/s
05-Oct-2026 20:39:56 100% ━━━━━━━━━━━━━━━━━━━━━━━━━━━━━━━━━━━━━━━━ 85.7/85.7 MB • 00:02 • 30.6 MB/s
05-Oct-2026 20:39:56 100% ━━━━━━━━━━━━━━━━━━━━━━━━━━━━━━━━━━━━━━━━ 85.7/85.7 MB • 00:02 • 30.6 MB/s
05-Oct-2026 20:39:57 Uploading distributions to
05-Oct-2026 20:39:57 https://casa-pip.nrao.edu:443/repository/casa-test-wheel/
05-Oct-2026 20:39:57 Uploading casatestutils-6.7.7.12-py3-none-any.whl
05-Oct-2026 20:39:57
05-Oct-2026 20:39:57   0% ━━━━━━━━━━━━━━━━━━━━━━━━━━━━━━━━━━━━━━━━ 0.0/174.3 kB • --:-- • ?
05-Oct-2026 20:39:57 100% ━━━━━━━━━━━━━━━━━━━━━━━━━━━━━━━━━━━━━━━ 174.3/174.3 kB • 00:00 • 206.3 MB/s
05-Oct-2026 20:39:57 WARNING Error during upload. Retry with the --verbose option for more details.
05-Oct-2026 20:39:57 ERROR    HTTPError: 400 Bad Request from                                       
05-Oct-2026 20:39:57          https://casa-pip.nrao.edu:443/repository/casa-test-wheel/             
05-Oct-2026 20:39:57          Repository does not allow updating assets: casa-test-wheel             
05-Oct-2026 20:39:57 Finished task 'Upload wheel' with result: Success
05-Oct-2026 20:39:57
Substituting variable: ${bamboo.agentId} with 153550850
05-Oct-2026 20:39:57
Substituting variable: ${bamboo.agentId} with 153550850
05-Oct-2026 20:39:57 Starting task 'Cleanup' of type 'com.atlassian.bamboo.plugins.scripttask:task.builder.script'
05-Oct-2026 20:39:57
Beginning to execute external process for build 'CASASPECS - Master Test 3.12 - Test Tools Many Linux 2.34 Rocky 9.5 Py3.12 #288 (CASASPECS-MASTERTESTPY312-TTR9PML234-288)'
... running command line:
/opt/ci_workspace/casa/bamboo/agent2/temp/CASASPECS-MASTERTESTPY312-TTR9PML234-288-ScriptBuildTask-4190502166853796595.sh
... in: /opt/ci_workspace/casa/bamboo/agent2/xml-data/build-dir/CASASPECS-MASTERTESTPY312-TTR9PML234
05-Oct-2026 20:39:57 Starting cleanup
05-Oct-2026 20:40:07 wheel-container-test-153550850
05-Oct-2026 20:40:09 wheel-container-test-153550850
05-Oct-2026 20:40:09 Cleanup complete
05-Oct-2026 20:40:09 Finished task 'Cleanup' with result: Success
05-Oct-2026 20:40:09 Running post build plugin 'Docker Container Cleanup'
05-Oct-2026 20:40:09
Beginning to execute external process for build 'CASASPECS - Master Test 3.12 - Test Tools Many Linux 2.34 Rocky 9.5 Py3.12 #288 (CASASPECS-MASTERTESTPY312-TTR9PML234-288)'
... running command line:
/usr/bin/docker rm -f wheel-container-test-153550850
... in: /opt/ci_workspace/casa/bamboo/agent2/xml-data/build-dir/CASASPECS-MASTERTESTPY312-TTR9PML234
05-Oct-2026 20:40:09 Running post build plugin 'NCover Results Collector'
05-Oct-2026 20:40:09 Running post build plugin 'Build Results Label Collector'
05-Oct-2026 20:40:09 Running post build plugin 'Clover Results Collector'
05-Oct-2026 20:40:09 Running post build plugin 'npm Cache Cleanup'
05-Oct-2026 20:40:09 Running post build plugin 'Artifact Copier'
05-Oct-2026 20:40:09 Publishing an artifact: Workdir
05-Oct-2026 20:40:09 Finished publishing of artifact Non required job artifact Http Compression On : [Workdir], patterns: [work*.tar.gz] anchored at: [wheeldirectory/] in 62.66 ms
05-Oct-2026 20:40:09 Publishing an artifact: XML Directories
05-Oct-2026 20:40:09 Finished publishing of artifact Non required job artifact Http Compression On : [XML Directories], patterns: [**/*.xml] anchored at: [wheeldirectory/] in 115.3 ms
05-Oct-2026 20:40:09 Finalising the build...
05-Oct-2026 20:40:09 Stopping timer.
05-Oct-2026 20:40:09 Build CASASPECS-MASTERTESTPY312-TTR9PML234-288 completed.
05-Oct-2026 20:40:09 Running on server: post build plugin 'Build Hanging Detection Configuration'
05-Oct-2026 20:40:09 Running on server: post build plugin 'NCover Results Collector'
05-Oct-2026 20:40:09 Running on server: post build plugin 'Build Labeller'
05-Oct-2026 20:40:09 Running on server: post build plugin 'Clover Delta Calculator'
05-Oct-2026 20:40:09 Running on server: post build plugin 'Maven Dependencies Postprocessor'
05-Oct-2026 20:40:09 All post build plugins have finished
05-Oct-2026 20:40:09 Generating build results summary...
05-Oct-2026 20:40:10 Saving build results to disk...
05-Oct-2026 20:40:10 Store variable context...
05-Oct-2026 20:40:10 Finished building CASASPECS-MASTERTESTPY312-TTR9PML234-288.