Tools and Tasks tests for Python 3.12

Build: #288 failed

Job: Test Tools Many Linux 2.28 Rocky 8.10 Py3.12 was successful

Build log

The build generated 53,402 lines of output.   The output is too long and has been truncated to the last 1,000 lines. Download or view full build log.

05-Oct-2026 20:22:17 Test the findaxis() method
05-Oct-2026 20:22:17 PASSED
05-Oct-2026 20:22:17
05-Oct-2026 20:22:17 2026-10-06 00:22:18        INFO        ImageFactory::createImage        Created Temp image  of shape [4, 4, 4, 4] with float valued pixels.
05-Oct-2026 20:22:17 2026-10-06 00:22:18        SEVERE        CoordinateSystem::getWorldAxesOrder (file /source/casa6/casatools/casacore/coordinates/Coordinates/CoordinateSystem.cc, line 4663)        No axis matches requested axis ra. Image axis names are [right ascension, declination, stokes, frequency]
05-Oct-2026 20:22:17 2026-10-06 00:22:18        SEVERE        coordsys::findaxisbyname        Error: 2026-10-06 00:22:18        SEVERE        CoordinateSystem::getWorldAxesOrder (file /source/casa6/casatools/casacore/coordinates/Coordinates/CoordinateSystem.cc, line 4663)        No axis matches requested axis ra. Image axis names are [right ascension, declination, stokes, frequency]
05-Oct-2026 20:22:17 2026-10-06 00:22:18        INFO        name::        No table opened.
05-Oct-2026 20:22:17 2026-10-06 00:22:18        INFO        showcache::        The Table Cache is empty.
05-Oct-2026 20:22:17 2026-10-06 00:22:18        INFO        name::        No table opened.
05-Oct-2026 20:22:17 2026-10-06 00:22:18        INFO        name::        No table opened.
05-Oct-2026 20:22:17 test_tool_coordsys.py::coordsys_test::test_findaxisbyname
05-Oct-2026 20:22:17 PASSED
05-Oct-2026 20:22:17
05-Oct-2026 20:22:17 2026-10-06 00:22:18        INFO        ImageFactory::createImage        Created Temp image  of shape [20, 20, 4, 20] with float valued pixels.
05-Oct-2026 20:22:17 2026-10-06 00:22:18        INFO        name::        No table opened.
05-Oct-2026 20:22:17 2026-10-06 00:22:18        INFO        showcache::        The Table Cache is empty.
05-Oct-2026 20:22:17 2026-10-06 00:22:18        INFO        name::        No table opened.
05-Oct-2026 20:22:17 2026-10-06 00:22:18        INFO        name::        No table opened.
05-Oct-2026 20:22:17 test_tool_coordsys.py::coordsys_test::test_findcoordinate
05-Oct-2026 20:22:17 Test the findcoordinate() method
05-Oct-2026 20:22:17 PASSED
05-Oct-2026 20:22:17
05-Oct-2026 20:22:17 2026-10-06 00:22:18        INFO        name::        No table opened.
05-Oct-2026 20:22:17 2026-10-06 00:22:18        INFO        showcache::        The Table Cache is empty.
05-Oct-2026 20:22:17 2026-10-06 00:22:18        INFO        name::        No table opened.
05-Oct-2026 20:22:17 2026-10-06 00:22:18        INFO        name::        No table opened.
05-Oct-2026 20:22:17 test_tool_coordsys.py::coordsys_test::test_frequencyToVelocity
05-Oct-2026 20:22:17 Test frequency to velocity conversion
05-Oct-2026 20:22:17 PASSED
05-Oct-2026 20:22:17
05-Oct-2026 20:22:17 2026-10-06 00:22:18        INFO        name::        No table opened.
05-Oct-2026 20:22:17 2026-10-06 00:22:18        INFO        showcache::        The Table Cache is empty.
05-Oct-2026 20:22:17 2026-10-06 00:22:18        INFO        name::        No table opened.
05-Oct-2026 20:22:17 2026-10-06 00:22:18        INFO        name::        No table opened.
05-Oct-2026 20:22:17 test_tool_coordsys.py::coordsys_test::test_frequencyToVelocityDiff
05-Oct-2026 20:22:17 Test the velocity diff
05-Oct-2026 20:22:17 PASSED
05-Oct-2026 20:22:17
05-Oct-2026 20:22:17 2026-10-06 00:22:18        INFO        name::        No table opened.
05-Oct-2026 20:22:17 2026-10-06 00:22:18        INFO        showcache::        The Table Cache is empty.
05-Oct-2026 20:22:17 2026-10-06 00:22:18        INFO        name::        No table opened.
05-Oct-2026 20:22:17 2026-10-06 00:22:18        INFO        name::        No table opened.
05-Oct-2026 20:22:17 test_tool_coordsys.py::coordsys_test::test_frequencyVelocityBasic
05-Oct-2026 20:22:17 Test conversion between freq and velocity
05-Oct-2026 20:22:17 PASSED
05-Oct-2026 20:22:17
05-Oct-2026 20:22:17 2026-10-06 00:22:18        SEVERE        coordsys::frequencytovelocity        Failed to set frequency units of Jy because Units are not compatible dimensionally
05-Oct-2026 20:22:17 2026-10-06 00:22:18        SEVERE        coordsys::velocitytofrequency        Failed to set frequency units of Jy because Units are not compatible dimensionally
05-Oct-2026 20:22:17 2026-10-06 00:22:18        SEVERE        coordsys::frequencytovelocity        There is no spectral coordinate in this CoordinateSystem
05-Oct-2026 20:22:17 2026-10-06 00:22:18        INFO        name::        No table opened.
05-Oct-2026 20:22:17 2026-10-06 00:22:18        INFO        showcache::        The Table Cache is empty.
05-Oct-2026 20:22:17 2026-10-06 00:22:18        INFO        name::        No table opened.
05-Oct-2026 20:22:17 2026-10-06 00:22:18        INFO        name::        No table opened.
05-Oct-2026 20:22:17 test_tool_coordsys.py::coordsys_test::test_frequencyVelocityInvalidInput
05-Oct-2026 20:22:17 Test frequencytovelocity and velocitytofrequency with invalid inputs
05-Oct-2026 20:22:17 PASSED
05-Oct-2026 20:22:17
05-Oct-2026 20:22:17 2026-10-06 00:22:18        INFO        name::        No table opened.
05-Oct-2026 20:22:17 2026-10-06 00:22:18        INFO        showcache::        The Table Cache is empty.
05-Oct-2026 20:22:17 2026-10-06 00:22:18        INFO        name::        No table opened.
05-Oct-2026 20:22:17 2026-10-06 00:22:18        INFO        name::        No table opened.
05-Oct-2026 20:22:17 test_tool_coordsys.py::coordsys_test::test_fromRecord
05-Oct-2026 20:22:17 Test that a record can be converted to a coordsys
05-Oct-2026 20:22:17 PASSED
05-Oct-2026 20:22:17
05-Oct-2026 20:22:17 2026-10-06 00:22:18        INFO        name::        No table opened.
05-Oct-2026 20:22:17 2026-10-06 00:22:18        INFO        showcache::        The Table Cache is empty.
05-Oct-2026 20:22:17 2026-10-06 00:22:18        INFO        name::        No table opened.
05-Oct-2026 20:22:17 2026-10-06 00:22:18        INFO        name::        No table opened.
05-Oct-2026 20:22:17 test_tool_coordsys.py::coordsys_test::test_incrementDefaultUnits
05-Oct-2026 20:22:17 Test increment with default coordsys units
05-Oct-2026 20:22:17 PASSED
05-Oct-2026 20:22:17
05-Oct-2026 20:22:17 2026-10-06 00:22:18        INFO        name::        No table opened.
05-Oct-2026 20:22:17 2026-10-06 00:22:18        INFO        showcache::        The Table Cache is empty.
05-Oct-2026 20:22:17 2026-10-06 00:22:18        INFO        name::        No table opened.
05-Oct-2026 20:22:17 2026-10-06 00:22:18        INFO        name::        No table opened.
05-Oct-2026 20:22:17 test_tool_coordsys.py::coordsys_test::test_incrementRad
05-Oct-2026 20:22:17 Test increment with radian units
05-Oct-2026 20:22:17 PASSED
05-Oct-2026 20:22:17
05-Oct-2026 20:22:17 2026-10-06 00:22:18        SEVERE        coordsys::recordToWorldVector        Failed to convert string formatted world [i, like, doggies] to double
05-Oct-2026 20:22:17 2026-10-06 00:22:18        INFO        name::        No table opened.
05-Oct-2026 20:22:17 2026-10-06 00:22:18        INFO        showcache::        The Table Cache is empty.
05-Oct-2026 20:22:17 2026-10-06 00:22:18        INFO        name::        No table opened.
05-Oct-2026 20:22:17 2026-10-06 00:22:18        INFO        name::        No table opened.
05-Oct-2026 20:22:17 test_tool_coordsys.py::coordsys_test::test_incrementSetIncorrect
05-Oct-2026 20:22:17 Test increment with incorrect values
05-Oct-2026 20:22:17 PASSED
05-Oct-2026 20:22:17
05-Oct-2026 20:22:17 2026-10-06 00:22:18        SEVERE        coordsys::stringToType        A coordinate of type lin does not exist
05-Oct-2026 20:22:17 2026-10-06 00:22:18        SEVERE        coordsys::increment        exceptions reported: 2026-10-06 00:22:18        SEVERE        coordsys::stringToType        A coordinate of type lin does not exist
05-Oct-2026 20:22:17 2026-10-06 00:22:18        INFO        name::        No table opened.
05-Oct-2026 20:22:17 2026-10-06 00:22:18        INFO        showcache::        The Table Cache is empty.
05-Oct-2026 20:22:17 2026-10-06 00:22:18        INFO        name::        No table opened.
05-Oct-2026 20:22:17 2026-10-06 00:22:18        INFO        name::        No table opened.
05-Oct-2026 20:22:17 test_tool_coordsys.py::coordsys_test::test_incrementSpectral
05-Oct-2026 20:22:17 Test increment using spectral type
05-Oct-2026 20:22:17 PASSED
05-Oct-2026 20:22:17
05-Oct-2026 20:22:17 2026-10-06 00:22:18        INFO        name::        No table opened.
05-Oct-2026 20:22:17 2026-10-06 00:22:18        INFO        showcache::        The Table Cache is empty.
05-Oct-2026 20:22:17 2026-10-06 00:22:18        INFO        name::        No table opened.
05-Oct-2026 20:22:17 2026-10-06 00:22:18        INFO        name::        No table opened.
05-Oct-2026 20:22:17 test_tool_coordsys.py::coordsys_test::test_linearTransformDirection
05-Oct-2026 20:22:17 Test set linear transform type to direction
05-Oct-2026 20:22:17 PASSED
05-Oct-2026 20:22:17
05-Oct-2026 20:22:17 2026-10-06 00:22:18        INFO        name::        No table opened.
05-Oct-2026 20:22:17 2026-10-06 00:22:18        INFO        showcache::        The Table Cache is empty.
05-Oct-2026 20:22:17 2026-10-06 00:22:18        INFO        name::        No table opened.
05-Oct-2026 20:22:17 2026-10-06 00:22:18        INFO        name::        No table opened.
05-Oct-2026 20:22:17 test_tool_coordsys.py::coordsys_test::test_linearTransformLinear
05-Oct-2026 20:22:17 Test set linear transform type to linear
05-Oct-2026 20:22:17 PASSED
05-Oct-2026 20:22:17
05-Oct-2026 20:22:17 2026-10-06 00:22:18        INFO        name::        No table opened.
05-Oct-2026 20:22:17 2026-10-06 00:22:18        INFO        showcache::        The Table Cache is empty.
05-Oct-2026 20:22:17 2026-10-06 00:22:18        INFO        name::        No table opened.
05-Oct-2026 20:22:17 2026-10-06 00:22:18        INFO        name::        No table opened.
05-Oct-2026 20:22:17 test_tool_coordsys.py::coordsys_test::test_linearTransformSpectral
05-Oct-2026 20:22:17 Test set linear transform type to spectral 
05-Oct-2026 20:22:17 PASSED
05-Oct-2026 20:22:17
05-Oct-2026 20:22:17 2026-10-06 00:22:18        INFO        name::        No table opened.
05-Oct-2026 20:22:17 2026-10-06 00:22:18        INFO        showcache::        The Table Cache is empty.
05-Oct-2026 20:22:17 2026-10-06 00:22:18        INFO        name::        No table opened.
05-Oct-2026 20:22:17 2026-10-06 00:22:18        INFO        name::        No table opened.
05-Oct-2026 20:22:17 test_tool_coordsys.py::coordsys_test::test_linearTransformStokes
05-Oct-2026 20:22:17 Test set linear transform type to stokes
05-Oct-2026 20:22:17 PASSED
05-Oct-2026 20:22:17
05-Oct-2026 20:22:17 2026-10-06 00:22:18        INFO        name::        No table opened.
05-Oct-2026 20:22:17 2026-10-06 00:22:18        INFO        showcache::        The Table Cache is empty.
05-Oct-2026 20:22:17 2026-10-06 00:22:18        INFO        name::        No table opened.
05-Oct-2026 20:22:17 2026-10-06 00:22:18        INFO        name::        No table opened.
05-Oct-2026 20:22:17 test_tool_coordsys.py::coordsys_test::test_linearTransformTabular
05-Oct-2026 20:22:17 Test set linear transform type to tabular
05-Oct-2026 20:22:17 PASSED
05-Oct-2026 20:22:17
05-Oct-2026 20:22:17 2026-10-06 00:22:18        INFO        name::        No table opened.
05-Oct-2026 20:22:17 2026-10-06 00:22:18        INFO        showcache::        The Table Cache is empty.
05-Oct-2026 20:22:17 2026-10-06 00:22:18        INFO        name::        No table opened.
05-Oct-2026 20:22:17 2026-10-06 00:22:18        INFO        name::        No table opened.
05-Oct-2026 20:22:17 test_tool_coordsys.py::coordsys_test::test_names
05-Oct-2026 20:22:17 Test that you can set and get names
05-Oct-2026 20:22:17 PASSED
05-Oct-2026 20:22:17
05-Oct-2026 20:22:17 2026-10-06 00:22:18        INFO        name::        No table opened.
05-Oct-2026 20:22:17 2026-10-06 00:22:18        INFO        showcache::        The Table Cache is empty.
05-Oct-2026 20:22:17 2026-10-06 00:22:18        INFO        name::        No table opened.
05-Oct-2026 20:22:17 2026-10-06 00:22:18        INFO        name::        No table opened.
05-Oct-2026 20:22:17 test_tool_coordsys.py::coordsys_test::test_naxes
05-Oct-2026 20:22:17 Test the naxes param with 0 or multiple axes
05-Oct-2026 20:22:17 PASSED
05-Oct-2026 20:22:17
05-Oct-2026 20:22:17 2026-10-06 00:22:18        INFO        name::        No table opened.
05-Oct-2026 20:22:17 2026-10-06 00:22:18        INFO        showcache::        The Table Cache is empty.
05-Oct-2026 20:22:17 2026-10-06 00:22:18        INFO        name::        No table opened.
05-Oct-2026 20:22:17 2026-10-06 00:22:18        INFO        name::        No table opened.
05-Oct-2026 20:22:17 test_tool_coordsys.py::coordsys_test::test_observer
05-Oct-2026 20:22:17 Test that you can set and get the observer
05-Oct-2026 20:22:17 PASSED
05-Oct-2026 20:22:17
05-Oct-2026 20:22:17 2026-10-06 00:22:18        INFO        name::        No table opened.
05-Oct-2026 20:22:17 2026-10-06 00:22:18        INFO        showcache::        The Table Cache is empty.
05-Oct-2026 20:22:17 2026-10-06 00:22:18        INFO        name::        No table opened.
05-Oct-2026 20:22:17 2026-10-06 00:22:18        INFO        name::        No table opened.
05-Oct-2026 20:22:17 test_tool_coordsys.py::coordsys_test::test_parentName
05-Oct-2026 20:22:17 Test that you can set and get the parent name
05-Oct-2026 20:22:17 PASSED
05-Oct-2026 20:22:17
05-Oct-2026 20:22:17 2026-10-06 00:22:18        INFO        name::        No table opened.
05-Oct-2026 20:22:17 2026-10-06 00:22:18        INFO        showcache::        The Table Cache is empty.
05-Oct-2026 20:22:17 2026-10-06 00:22:18        INFO        name::        No table opened.
05-Oct-2026 20:22:17 2026-10-06 00:22:18        INFO        name::        No table opened.
05-Oct-2026 20:22:17 test_tool_coordsys.py::coordsys_test::test_projection
05-Oct-2026 20:22:17 Test that the projection can be set
05-Oct-2026 20:22:17 PASSED
05-Oct-2026 20:22:17
05-Oct-2026 20:22:17 2026-10-06 00:22:18        INFO        name::        No table opened.
05-Oct-2026 20:22:17 2026-10-06 00:22:18        INFO        showcache::        The Table Cache is empty.
05-Oct-2026 20:22:17 2026-10-06 00:22:18        INFO        name::        No table opened.
05-Oct-2026 20:22:17 2026-10-06 00:22:18        INFO        name::        No table opened.
05-Oct-2026 20:22:17 test_tool_coordsys.py::coordsys_test::test_refCode
05-Oct-2026 20:22:17 Test that a reference code can be set
05-Oct-2026 20:22:17 PASSED
05-Oct-2026 20:22:17
05-Oct-2026 20:22:17 2026-10-06 00:22:18        INFO        name::        No table opened.
05-Oct-2026 20:22:17 2026-10-06 00:22:18        INFO        showcache::        The Table Cache is empty.
05-Oct-2026 20:22:17 2026-10-06 00:22:18        INFO        name::        No table opened.
05-Oct-2026 20:22:17 2026-10-06 00:22:18        INFO        name::        No table opened.
05-Oct-2026 20:22:17 test_tool_coordsys.py::coordsys_test::test_refPixel
05-Oct-2026 20:22:17 Test that you can get and set the reference pixel
05-Oct-2026 20:22:17 PASSED
05-Oct-2026 20:22:17
05-Oct-2026 20:22:17 2026-10-06 00:22:18        INFO        name::        No table opened.
05-Oct-2026 20:22:17 2026-10-06 00:22:18        INFO        showcache::        The Table Cache is empty.
05-Oct-2026 20:22:17 2026-10-06 00:22:18        INFO        name::        No table opened.
05-Oct-2026 20:22:17 2026-10-06 00:22:18        INFO        name::        No table opened.
05-Oct-2026 20:22:17 test_tool_coordsys.py::coordsys_test::test_referenceConvert
05-Oct-2026 20:22:17 Set values with reference conversion
05-Oct-2026 20:22:17 PASSED
05-Oct-2026 20:22:17
05-Oct-2026 20:22:17 2026-10-06 00:22:18        INFO        name::        No table opened.
05-Oct-2026 20:22:17 2026-10-06 00:22:18        INFO        showcache::        The Table Cache is empty.
05-Oct-2026 20:22:17 2026-10-06 00:22:18        INFO        name::        No table opened.
05-Oct-2026 20:22:17 2026-10-06 00:22:18        INFO        name::        No table opened.
05-Oct-2026 20:22:17 test_tool_coordsys.py::coordsys_test::test_referenceLocation
05-Oct-2026 20:22:17 Test that setreferencelocation correctly sets ref value
05-Oct-2026 20:22:17 PASSED
05-Oct-2026 20:22:17
05-Oct-2026 20:22:17 2026-10-06 00:22:18        SEVERE        coordsys::recordToWorldVector        Failed to convert string formatted world [i, like, doggies] to double
05-Oct-2026 20:22:17 2026-10-06 00:22:18        INFO        name::        No table opened.
05-Oct-2026 20:22:17 2026-10-06 00:22:18        INFO        showcache::        The Table Cache is empty.
05-Oct-2026 20:22:17 2026-10-06 00:22:18        INFO        name::        No table opened.
05-Oct-2026 20:22:17 2026-10-06 00:22:18        INFO        name::        No table opened.
05-Oct-2026 20:22:17 test_tool_coordsys.py::coordsys_test::test_referenceValueSetIncorrect
05-Oct-2026 20:22:17 Test setting the value incorrectly
05-Oct-2026 20:22:17 PASSED
05-Oct-2026 20:22:17
05-Oct-2026 20:22:17 2026-10-06 00:22:18        INFO        name::        No table opened.
05-Oct-2026 20:22:17 2026-10-06 00:22:18        INFO        showcache::        The Table Cache is empty.
05-Oct-2026 20:22:17 2026-10-06 00:22:18        INFO        name::        No table opened.
05-Oct-2026 20:22:17 2026-10-06 00:22:18        INFO        name::        No table opened.
05-Oct-2026 20:22:17 test_tool_coordsys.py::coordsys_test::test_referenceValueSetSpectral
05-Oct-2026 20:22:17 Test set reference value with spectral type
05-Oct-2026 20:22:17 PASSED
05-Oct-2026 20:22:17
05-Oct-2026 20:22:17 2026-10-06 00:22:18        INFO        name::        No table opened.
05-Oct-2026 20:22:17 2026-10-06 00:22:18        INFO        showcache::        The Table Cache is empty.
05-Oct-2026 20:22:17 2026-10-06 00:22:18        INFO        name::        No table opened.
05-Oct-2026 20:22:17 2026-10-06 00:22:18        INFO        name::        No table opened.
05-Oct-2026 20:22:17 test_tool_coordsys.py::coordsys_test::test_referenceValueSetValDefaultUnits
05-Oct-2026 20:22:17 Test set reference value using default units
05-Oct-2026 20:22:17 PASSED
05-Oct-2026 20:22:17
05-Oct-2026 20:22:17 2026-10-06 00:22:18        INFO        name::        No table opened.
05-Oct-2026 20:22:17 2026-10-06 00:22:18        INFO        showcache::        The Table Cache is empty.
05-Oct-2026 20:22:17 2026-10-06 00:22:18        INFO        name::        No table opened.
05-Oct-2026 20:22:17 2026-10-06 00:22:18        INFO        name::        No table opened.
05-Oct-2026 20:22:17 test_tool_coordsys.py::coordsys_test::test_referenceValueSetValRad
05-Oct-2026 20:22:17 Test set reference value in radians
05-Oct-2026 20:22:17 PASSED
05-Oct-2026 20:22:17
05-Oct-2026 20:22:17 2026-10-06 00:22:18        INFO        name::        No table opened.
05-Oct-2026 20:22:17 2026-10-06 00:22:18        INFO        showcache::        The Table Cache is empty.
05-Oct-2026 20:22:17 2026-10-06 00:22:18        INFO        name::        No table opened.
05-Oct-2026 20:22:17 2026-10-06 00:22:18        INFO        name::        No table opened.
05-Oct-2026 20:22:17 test_tool_coordsys.py::coordsys_test::test_reorder
05-Oct-2026 20:22:17 Test that the coords are reordered
05-Oct-2026 20:22:17 PASSED
05-Oct-2026 20:22:17
05-Oct-2026 20:22:17 2026-10-06 00:22:18        SEVERE        coordsys::reorder        order vector must be of length 4
05-Oct-2026 20:22:17 2026-10-06 00:22:18        INFO        name::        No table opened.
05-Oct-2026 20:22:17 2026-10-06 00:22:18        INFO        showcache::        The Table Cache is empty.
05-Oct-2026 20:22:17 2026-10-06 00:22:18        INFO        name::        No table opened.
05-Oct-2026 20:22:17 2026-10-06 00:22:18        INFO        name::        No table opened.
05-Oct-2026 20:22:17 test_tool_coordsys.py::coordsys_test::test_reorderInvalid
05-Oct-2026 20:22:17 Test that invalid inputs for reorder raises exceptions
05-Oct-2026 20:22:17 PASSED
05-Oct-2026 20:22:17
05-Oct-2026 20:22:17 2026-10-06 00:22:18        WARN        coordsys::replace        Replacement incurred warning
05-Oct-2026 20:22:17 2026-10-06 00:22:18        INFO        name::        No table opened.
05-Oct-2026 20:22:17 2026-10-06 00:22:18        INFO        showcache::        The Table Cache is empty.
05-Oct-2026 20:22:17 2026-10-06 00:22:18        INFO        name::        No table opened.
05-Oct-2026 20:22:17 2026-10-06 00:22:18        INFO        name::        No table opened.
05-Oct-2026 20:22:17 test_tool_coordsys.py::coordsys_test::test_replace
05-Oct-2026 20:22:17 Test that a coord types can be replaced
05-Oct-2026 20:22:17 PASSED
05-Oct-2026 20:22:17
05-Oct-2026 20:22:17 2026-10-06 00:22:18        SEVERE        coordsys::replace        Coordinates must have the same number of axes
05-Oct-2026 20:22:17 2026-10-06 00:22:18        INFO        name::        No table opened.
05-Oct-2026 20:22:17 2026-10-06 00:22:18        INFO        showcache::        The Table Cache is empty.
05-Oct-2026 20:22:17 2026-10-06 00:22:18        INFO        name::        No table opened.
05-Oct-2026 20:22:17 2026-10-06 00:22:18        INFO        name::        No table opened.
05-Oct-2026 20:22:17 test_tool_coordsys.py::coordsys_test::test_replaceIncorrect
05-Oct-2026 20:22:17 Test that incorrect inputs for replace result in failures
05-Oct-2026 20:22:17 PASSED
05-Oct-2026 20:22:17
05-Oct-2026 20:22:17 2026-10-06 00:22:18        INFO        name::        No table opened.
05-Oct-2026 20:22:17 2026-10-06 00:22:18        INFO        showcache::        The Table Cache is empty.
05-Oct-2026 20:22:17 2026-10-06 00:22:18        INFO        name::        No table opened.
05-Oct-2026 20:22:17 2026-10-06 00:22:18        INFO        name::        No table opened.
05-Oct-2026 20:22:17 test_tool_coordsys.py::coordsys_test::test_restFreq
05-Oct-2026 20:22:17 Test that the rest frequency can be set
05-Oct-2026 20:22:17 PASSED
05-Oct-2026 20:22:17
05-Oct-2026 20:22:17 2026-10-06 00:22:18        INFO        name::        No table opened.
05-Oct-2026 20:22:17 2026-10-06 00:22:18        INFO        showcache::        The Table Cache is empty.
05-Oct-2026 20:22:17 2026-10-06 00:22:18        INFO        name::        No table opened.
05-Oct-2026 20:22:17 2026-10-06 00:22:18        INFO        name::        No table opened.
05-Oct-2026 20:22:17 test_tool_coordsys.py::coordsys_test::test_setDirection
05-Oct-2026 20:22:17 Test that direction can be set
05-Oct-2026 20:22:17 PASSED
05-Oct-2026 20:22:17
05-Oct-2026 20:22:17 2026-10-06 00:22:18        INFO        name::        No table opened.
05-Oct-2026 20:22:17 2026-10-06 00:22:18        INFO        showcache::        The Table Cache is empty.
05-Oct-2026 20:22:17 2026-10-06 00:22:18        INFO        name::        No table opened.
05-Oct-2026 20:22:17 2026-10-06 00:22:18        INFO        name::        No table opened.
05-Oct-2026 20:22:17 test_tool_coordsys.py::coordsys_test::test_setDirectionPixVal
05-Oct-2026 20:22:17 Test that direction is set correctly with ref pix and val
05-Oct-2026 20:22:17 PASSED
05-Oct-2026 20:22:17
05-Oct-2026 20:22:17 2026-10-06 00:22:18        INFO        name::        No table opened.
05-Oct-2026 20:22:17 2026-10-06 00:22:18        INFO        showcache::        The Table Cache is empty.
05-Oct-2026 20:22:17 2026-10-06 00:22:18        INFO        name::        No table opened.
05-Oct-2026 20:22:17 2026-10-06 00:22:18        INFO        name::        No table opened.
05-Oct-2026 20:22:17 test_tool_coordsys.py::coordsys_test::test_setDirectionVal
05-Oct-2026 20:22:17 Test that direction is set correctly with ref val
05-Oct-2026 20:22:17 PASSED
05-Oct-2026 20:22:17
05-Oct-2026 20:22:17 2026-10-06 00:22:18        INFO        name::        No table opened.
05-Oct-2026 20:22:17 2026-10-06 00:22:18        INFO        showcache::        The Table Cache is empty.
05-Oct-2026 20:22:17 2026-10-06 00:22:18        INFO        name::        No table opened.
05-Oct-2026 20:22:17 2026-10-06 00:22:18        INFO        name::        No table opened.
05-Oct-2026 20:22:17 test_tool_coordsys.py::coordsys_test::test_setSpectral
05-Oct-2026 20:22:17 PASSED
05-Oct-2026 20:22:17
05-Oct-2026 20:22:17 2026-10-06 00:22:18        SEVERE        coordsys::findCoordinate        No coordinate of type Spectral in this CoordinateSystem
05-Oct-2026 20:22:17 2026-10-06 00:22:18        INFO        name::        No table opened.
05-Oct-2026 20:22:17 2026-10-06 00:22:18        INFO        showcache::        The Table Cache is empty.
05-Oct-2026 20:22:17 2026-10-06 00:22:18        INFO        name::        No table opened.
05-Oct-2026 20:22:17 2026-10-06 00:22:18        INFO        name::        No table opened.
05-Oct-2026 20:22:17 test_tool_coordsys.py::coordsys_test::test_setSpectralInvalidInput
05-Oct-2026 20:22:17 PASSED
05-Oct-2026 20:22:17
05-Oct-2026 20:22:17 2026-10-06 00:22:18        INFO        name::        No table opened.
05-Oct-2026 20:22:17 2026-10-06 00:22:18        INFO        showcache::        The Table Cache is empty.
05-Oct-2026 20:22:17 2026-10-06 00:22:18        INFO        name::        No table opened.
05-Oct-2026 20:22:17 2026-10-06 00:22:18        INFO        name::        No table opened.
05-Oct-2026 20:22:17 test_tool_coordsys.py::coordsys_test::test_setTabular
05-Oct-2026 20:22:17 Test that with tabular coordinates reference and pixel values can be set
05-Oct-2026 20:22:17 PASSED
05-Oct-2026 20:22:17
05-Oct-2026 20:22:17 2026-10-06 00:22:18        SEVERE        coordsys::settabular        Specified TabularCoordinate could not be found
05-Oct-2026 20:22:17 2026-10-06 00:22:18        SEVERE        coordsys::settabular        Pixel and world vectors must be the same length
05-Oct-2026 20:22:17 2026-10-06 00:22:18        SEVERE        coordsys::settabular        Pixel and world vectors must be the same length
05-Oct-2026 20:22:17 2026-10-06 00:22:18        INFO        coordsys::settabular        Old world vector length = 3
05-Oct-2026 20:22:17 2026-10-06 00:22:18        SEVERE        coordsys::settabular        Pixel and world vectors must be the same length
05-Oct-2026 20:22:17 2026-10-06 00:22:18        INFO        coordsys::settabular        Old pixel vector length = 3
05-Oct-2026 20:22:17 2026-10-06 00:22:18        SEVERE        coordsys::settabular        Pixel and world vectors must be the same length
05-Oct-2026 20:22:17 2026-10-06 00:22:18        INFO        name::        No table opened.
05-Oct-2026 20:22:17 2026-10-06 00:22:18        INFO        showcache::        The Table Cache is empty.
05-Oct-2026 20:22:17 2026-10-06 00:22:18        INFO        name::        No table opened.
05-Oct-2026 20:22:17 2026-10-06 00:22:18        INFO        name::        No table opened.
05-Oct-2026 20:22:17 test_tool_coordsys.py::coordsys_test::test_setTabularIncorrect
05-Oct-2026 20:22:17 Test that incorrect inputs will raise exceptions
05-Oct-2026 20:22:17 PASSED
05-Oct-2026 20:22:17
05-Oct-2026 20:22:17 2026-10-06 00:22:18        INFO        name::        No table opened.
05-Oct-2026 20:22:17 2026-10-06 00:22:18        INFO        showcache::        The Table Cache is empty.
05-Oct-2026 20:22:17 2026-10-06 00:22:18        INFO        name::        No table opened.
05-Oct-2026 20:22:17 2026-10-06 00:22:18        INFO        name::        No table opened.
05-Oct-2026 20:22:17 test_tool_coordsys.py::coordsys_test::test_stokes
05-Oct-2026 20:22:17 Test that you can create a coordsys with the given stokes values
05-Oct-2026 20:22:17 PASSED
05-Oct-2026 20:22:17
05-Oct-2026 20:22:17 2026-10-06 00:22:18        INFO        name::        No table opened.
05-Oct-2026 20:22:17 2026-10-06 00:22:18        INFO        showcache::        The Table Cache is empty.
05-Oct-2026 20:22:17 2026-10-06 00:22:18        INFO        name::        No table opened.
05-Oct-2026 20:22:17 2026-10-06 00:22:18        INFO        name::        No table opened.
05-Oct-2026 20:22:17 test_tool_coordsys.py::coordsys_test::test_stokesSetValue
05-Oct-2026 20:22:17 Test that you can set the stokes values after creation
05-Oct-2026 20:22:17 PASSED
05-Oct-2026 20:22:17
05-Oct-2026 20:22:17 2026-10-06 00:22:18        SEVERE        coordsys::findCoordinate        No coordinate of type Stokes in this CoordinateSystem
05-Oct-2026 20:22:17 2026-10-06 00:22:18        SEVERE        coordsys::findCoordinate        No coordinate of type Stokes in this CoordinateSystem
05-Oct-2026 20:22:17 2026-10-06 00:22:18        INFO        name::        No table opened.
05-Oct-2026 20:22:17 2026-10-06 00:22:18        INFO        showcache::        The Table Cache is empty.
05-Oct-2026 20:22:17 2026-10-06 00:22:18        INFO        name::        No table opened.
05-Oct-2026 20:22:17 2026-10-06 00:22:18        INFO        name::        No table opened.
05-Oct-2026 20:22:17 test_tool_coordsys.py::coordsys_test::test_stokesWrongValues
05-Oct-2026 20:22:17 Test that incorrect values raise exceptions
05-Oct-2026 20:22:17 PASSED
05-Oct-2026 20:22:17
05-Oct-2026 20:22:17 2026-10-06 00:22:18        INFO        name::        No table opened.
05-Oct-2026 20:22:17 2026-10-06 00:22:18        INFO        showcache::        The Table Cache is empty.
05-Oct-2026 20:22:17 2026-10-06 00:22:18        INFO        name::        No table opened.
05-Oct-2026 20:22:17 2026-10-06 00:22:18        INFO        name::        No table opened.
05-Oct-2026 20:22:17 test_tool_coordsys.py::coordsys_test::test_telescope
05-Oct-2026 20:22:17 Test that you can set and get the telescope
05-Oct-2026 20:22:17 PASSED
05-Oct-2026 20:22:17
05-Oct-2026 20:22:17 2026-10-06 00:22:18        SEVERE        coordsys::checkAbsRel        The value is absolute, not relative', origin='coordsys.checkAbsRel
05-Oct-2026 20:22:17 2026-10-06 00:22:18        SEVERE        coordsys::checkAbsRel        The value is relative, not absolute', origin='coordsys.checkAbsRel
05-Oct-2026 20:22:17 2026-10-06 00:22:18        SEVERE        coordsys::checkAbsRel        The value is absolute, not relative', origin='coordsys.checkAbsRel
05-Oct-2026 20:22:17 2026-10-06 00:22:18        SEVERE        coordsys::checkAbsRel        The value is relative, not absolute', origin='coordsys.checkAbsRel
05-Oct-2026 20:22:17 2026-10-06 00:22:18        INFO        name::        No table opened.
05-Oct-2026 20:22:17 2026-10-06 00:22:18        INFO        showcache::        The Table Cache is empty.
05-Oct-2026 20:22:17 2026-10-06 00:22:18        INFO        name::        No table opened.
05-Oct-2026 20:22:17 2026-10-06 00:22:18        INFO        name::        No table opened.
05-Oct-2026 20:22:17 test_tool_coordsys.py::coordsys_test::test_toAbsRelInvalidInput
05-Oct-2026 20:22:17 Test expected failure cases of toabs and torel
05-Oct-2026 20:22:17 PASSED
05-Oct-2026 20:22:17
05-Oct-2026 20:22:17 2026-10-06 00:22:18        INFO        name::        No table opened.
05-Oct-2026 20:22:17 2026-10-06 00:22:18        INFO        showcache::        The Table Cache is empty.
05-Oct-2026 20:22:17 2026-10-06 00:22:18        INFO        name::        No table opened.
05-Oct-2026 20:22:17 2026-10-06 00:22:18        INFO        name::        No table opened.
05-Oct-2026 20:22:17 test_tool_coordsys.py::coordsys_test::test_toAbsRelMany
05-Oct-2026 20:22:17 Test conversion of many to rel and abs
05-Oct-2026 20:22:17 w list:  [0.000e+00 0.000e+00 1.000e+00 1.415e+09 0.000e+00 0.000e+00]
05-Oct-2026 20:22:17 ww list:  [[0.000e+00 0.000e+00 1.000e+00 1.415e+09 0.000e+00]
05-Oct-2026 20:22:17 [0.000e+00 0.000e+00 1.000e+00 1.415e+09 0.000e+00]
05-Oct-2026 20:22:17 [0.000e+00 0.000e+00 1.000e+00 1.415e+09 0.000e+00]
05-Oct-2026 20:22:17 [0.000e+00 0.000e+00 1.000e+00 1.415e+09 0.000e+00]
05-Oct-2026 20:22:17 [0.000e+00 0.000e+00 1.000e+00 1.415e+09 0.000e+00]
05-Oct-2026 20:22:17 [0.000e+00 0.000e+00 1.000e+00 1.415e+09 0.000e+00]]
05-Oct-2026 20:22:17 absworld list:  [[ 0.000e+00  0.000e+00  1.000e+00 -5.200e+03  0.000e+00]
05-Oct-2026 20:22:17 [ 0.000e+00  0.000e+00  1.000e+00  5.200e+03  0.000e+00]
05-Oct-2026 20:22:17 [ 0.000e+00  0.000e+00  1.000e+00  1.415e+09  0.000e+00]
05-Oct-2026 20:22:17 [ 0.000e+00  0.000e+00  1.000e+00  1.415e+09  0.000e+00]
05-Oct-2026 20:22:17 [ 0.000e+00  0.000e+00  1.000e+00  1.415e+09  0.000e+00]
05-Oct-2026 20:22:17 [ 0.000e+00  0.000e+00  1.000e+00  1.415e+09  0.000e+00]]
05-Oct-2026 20:22:17 (np.float64(0.0), np.float64(0.0))
05-Oct-2026 20:22:17 (np.float64(0.0), np.float64(0.0))
05-Oct-2026 20:22:17 (np.float64(1.0), np.float64(0.0))
05-Oct-2026 20:22:17 (np.float64(1415000000.0), np.float64(0.0))
05-Oct-2026 20:22:17 (np.float64(0.0), np.float64(0.0))
05-Oct-2026 20:22:17 (np.float64(0.0), np.float64(0.0))
05-Oct-2026 20:22:17 (np.float64(0.0), np.float64(0.0))
05-Oct-2026 20:22:17 (np.float64(0.0), np.float64(0.0))
05-Oct-2026 20:22:17 (np.float64(1.0), np.float64(0.0))
05-Oct-2026 20:22:17 (np.float64(1415000000.0), np.float64(0.0))
05-Oct-2026 20:22:17 (np.float64(0.0), np.float64(0.0))
05-Oct-2026 20:22:17 (np.float64(0.0), np.float64(0.0))
05-Oct-2026 20:22:17 (np.float64(0.0), np.float64(1.0))
05-Oct-2026 20:22:17 (np.float64(0.0), np.float64(1.0))
05-Oct-2026 20:22:17 (np.float64(1.0), np.float64(1.0))
05-Oct-2026 20:22:17 (np.float64(1415000000.0), np.float64(1.0))
05-Oct-2026 20:22:17 (np.float64(0.0), np.float64(1.0))
05-Oct-2026 20:22:17 (np.float64(0.0), np.float64(1.0))
05-Oct-2026 20:22:17 (np.float64(0.0), np.float64(-5199.999999994527))
05-Oct-2026 20:22:17 (np.float64(0.0), np.float64(5199.999999994549))
05-Oct-2026 20:22:17 (np.float64(1.0), np.float64(1415000000.0))
05-Oct-2026 20:22:17 (np.float64(1415000000.0), np.float64(1415000000.0))
05-Oct-2026 20:22:17 (np.float64(0.0), np.float64(1415000000.0))
05-Oct-2026 20:22:17 (np.float64(0.0), np.float64(1415000000.0))
05-Oct-2026 20:22:17 (np.float64(0.0), np.float64(0.0))
05-Oct-2026 20:22:17 (np.float64(0.0), np.float64(0.0))
05-Oct-2026 20:22:17 (np.float64(1.0), np.float64(0.0))
05-Oct-2026 20:22:17 (np.float64(1415000000.0), np.float64(0.0))
05-Oct-2026 20:22:17 (np.float64(0.0), np.float64(0.0))
05-Oct-2026 20:22:17 (np.float64(0.0), np.float64(0.0))
05-Oct-2026 20:22:17 PASSED
05-Oct-2026 20:22:17
05-Oct-2026 20:22:17 2026-10-06 00:22:18        INFO        name::        No table opened.
05-Oct-2026 20:22:17 2026-10-06 00:22:18        INFO        showcache::        The Table Cache is empty.
05-Oct-2026 20:22:17 2026-10-06 00:22:18        INFO        name::        No table opened.
05-Oct-2026 20:22:17 2026-10-06 00:22:18        INFO        name::        No table opened.
05-Oct-2026 20:22:17 test_tool_coordsys.py::coordsys_test::test_toAbsRelRefPix
05-Oct-2026 20:22:17 Test that converting from pixel coordinates gives the correct value
05-Oct-2026 20:22:17 PASSED
05-Oct-2026 20:22:17
05-Oct-2026 20:22:17 2026-10-06 00:22:18        INFO        name::        No table opened.
05-Oct-2026 20:22:17 2026-10-06 00:22:18        INFO        showcache::        The Table Cache is empty.
05-Oct-2026 20:22:17 2026-10-06 00:22:18        INFO        name::        No table opened.
05-Oct-2026 20:22:17 2026-10-06 00:22:18        INFO        name::        No table opened.
05-Oct-2026 20:22:17 test_tool_coordsys.py::coordsys_test::test_toAbsRelWorld
05-Oct-2026 20:22:17 Test that converting from world coordinates gives the correct value
05-Oct-2026 20:22:17 PASSED
05-Oct-2026 20:22:17
05-Oct-2026 20:22:17 2026-10-06 00:22:18        INFO        name::        No table opened.
05-Oct-2026 20:22:17 2026-10-06 00:22:18        INFO        showcache::        The Table Cache is empty.
05-Oct-2026 20:22:17 2026-10-06 00:22:18        INFO        name::        No table opened.
05-Oct-2026 20:22:17 2026-10-06 00:22:18        INFO        name::        No table opened.
05-Oct-2026 20:22:17 test_tool_coordsys.py::coordsys_test::test_toPixel
05-Oct-2026 20:22:17 Test topixel parameter
05-Oct-2026 20:22:17 PASSED
05-Oct-2026 20:22:17
05-Oct-2026 20:22:17 2026-10-06 00:22:18        INFO        name::        No table opened.
05-Oct-2026 20:22:17 2026-10-06 00:22:18        INFO        showcache::        The Table Cache is empty.
05-Oct-2026 20:22:17 2026-10-06 00:22:18        INFO        name::        No table opened.
05-Oct-2026 20:22:17 2026-10-06 00:22:18        INFO        name::        No table opened.
05-Oct-2026 20:22:17 test_tool_coordsys.py::coordsys_test::test_toPixelMany
05-Oct-2026 20:22:17 Test topixelmany parameter
05-Oct-2026 20:22:17 PASSED
05-Oct-2026 20:22:17
05-Oct-2026 20:22:17 2026-10-06 00:22:18        INFO        name::        No table opened.
05-Oct-2026 20:22:17 2026-10-06 00:22:18        INFO        showcache::        The Table Cache is empty.
05-Oct-2026 20:22:17 2026-10-06 00:22:18        INFO        name::        No table opened.
05-Oct-2026 20:22:17 2026-10-06 00:22:18        INFO        name::        No table opened.
05-Oct-2026 20:22:17 test_tool_coordsys.py::coordsys_test::test_toRecord
05-Oct-2026 20:22:17 Test that the coordsys can be converted to a record
05-Oct-2026 20:22:17 PASSED
05-Oct-2026 20:22:17
05-Oct-2026 20:22:17 2026-10-06 00:22:18        INFO        name::        No table opened.
05-Oct-2026 20:22:17 2026-10-06 00:22:18        INFO        showcache::        The Table Cache is empty.
05-Oct-2026 20:22:17 2026-10-06 00:22:18        INFO        name::        No table opened.
05-Oct-2026 20:22:17 2026-10-06 00:22:18        INFO        name::        No table opened.
05-Oct-2026 20:22:17 test_tool_coordsys.py::coordsys_test::test_toWorld
05-Oct-2026 20:22:17 Test the toworld conversion
05-Oct-2026 20:22:17 PASSED
05-Oct-2026 20:22:17
05-Oct-2026 20:22:17 2026-10-06 00:22:18        INFO        name::        No table opened.
05-Oct-2026 20:22:17 2026-10-06 00:22:18        INFO        showcache::        The Table Cache is empty.
05-Oct-2026 20:22:17 2026-10-06 00:22:18        INFO        name::        No table opened.
05-Oct-2026 20:22:17 2026-10-06 00:22:18        INFO        name::        No table opened.
05-Oct-2026 20:22:17 test_tool_coordsys.py::coordsys_test::test_toWorldMany
05-Oct-2026 20:22:17 Test the toworldmany parameter
05-Oct-2026 20:22:17 PASSED
05-Oct-2026 20:22:17
05-Oct-2026 20:22:17 2026-10-06 00:22:18        INFO        ImageFactory::createImage        Created Temp image  of shape [4, 4, 4, 4] with float valued pixels.
05-Oct-2026 20:22:17 2026-10-06 00:22:18        INFO        name::        No table opened.
05-Oct-2026 20:22:17 2026-10-06 00:22:18        INFO        showcache::        The Table Cache is empty.
05-Oct-2026 20:22:17 2026-10-06 00:22:18        INFO        name::        No table opened.
05-Oct-2026 20:22:17 2026-10-06 00:22:18        INFO        name::        No table opened.
05-Oct-2026 20:22:17 test_tool_coordsys.py::coordsys_test::test_transpose
05-Oct-2026 20:22:17 Test the transpose() method
05-Oct-2026 20:22:17 PASSED
05-Oct-2026 20:22:17
05-Oct-2026 20:22:17 2026-10-06 00:22:18        INFO        name::        No table opened.
05-Oct-2026 20:22:17 2026-10-06 00:22:18        INFO        showcache::        The Table Cache is empty.
05-Oct-2026 20:22:17 2026-10-06 00:22:18        INFO        name::        No table opened.
05-Oct-2026 20:22:17 2026-10-06 00:22:18        INFO        name::        No table opened.
05-Oct-2026 20:22:17 test_tool_coordsys.py::coordsys_test::test_units
05-Oct-2026 20:22:17 Test that you can set and get unit names
05-Oct-2026 20:22:17 PASSED
05-Oct-2026 20:22:17
05-Oct-2026 20:22:17 2026-10-06 00:22:18        INFO        name::        No table opened.
05-Oct-2026 20:22:17 2026-10-06 00:22:18        INFO        showcache::        The Table Cache is empty.
05-Oct-2026 20:22:17 2026-10-06 00:22:18        INFO        name::        No table opened.
05-Oct-2026 20:22:17 2026-10-06 00:22:18        INFO        name::        No table opened.
05-Oct-2026 20:22:17 test_tool_coordsys.py::coordsys_test::test_velocityToFrequency
05-Oct-2026 20:22:17 Test velocity To frequency conversion
05-Oct-2026 20:22:17 PASSED
05-Oct-2026 20:22:17
05-Oct-2026 20:22:17 2026-10-06 00:22:18        INFO        name::        No table opened.
05-Oct-2026 20:22:17 2026-10-06 00:22:18        INFO        showcache::        The Table Cache is empty.
05-Oct-2026 20:22:17 2026-10-06 00:22:18        INFO        name::        No table opened.
05-Oct-2026 20:22:17 2026-10-06 00:22:18        INFO        name::        No table opened.
05-Oct-2026 20:22:17 test_tool_coordsys.py::coordsys_test::test_velocityToFrequencyDiff
05-Oct-2026 20:22:17 Test the drequency diff
05-Oct-2026 20:22:17 PASSED
05-Oct-2026 20:22:17
05-Oct-2026 20:22:17 - generated xml file: /home/casatest/casa6/casatestutils/nosedir/xml/test_tool_coordsys/nose.xml -
05-Oct-2026 20:22:17 ======================== 74 passed, 1 warning in 0.43s =========================
05-Oct-2026 20:22:18 ============================= test session starts ==============================
05-Oct-2026 20:22:18 platform linux -- Python 3.12.9, pytest-9.1.1, pluggy-1.6.0 -- /home/casatest/venv/bin/python3.12
05-Oct-2026 20:22:18 cachedir: .pytest_cache
05-Oct-2026 20:22:18 rootdir: /home/casatest/casa6/casatestutils/nosedir/test_tool_table
05-Oct-2026 20:22:18 configfile: pytest.ini
05-Oct-2026 20:22:18 collecting ... table tool tests will use /opt/casa/data/casatestdata/unittest/table/n08c1_swap1.ms
05-Oct-2026 20:22:18 collected 13 items
05-Oct-2026 20:22:18
05-Oct-2026 20:22:18
05-Oct-2026 20:22:18 2026-10-06 00:22:18        INFO        name::        No table opened.
05-Oct-2026 20:22:18 2026-10-06 00:22:18        INFO        name::        No table opened.
05-Oct-2026 20:22:18 test_tool_table.py::TableGetcoliterTest::test_consistency
05-Oct-2026 20:22:18 PASSED
05-Oct-2026 20:22:18
05-Oct-2026 20:22:18 2026-10-06 00:22:18        INFO        name::        No table opened.
05-Oct-2026 20:22:18 2026-10-06 00:22:18        INFO        name::        No table opened.
05-Oct-2026 20:22:18 test_tool_table.py::TableGetcoliterTest::test_element_match
05-Oct-2026 20:22:18 Test element match using direct comparison and StopIteration assertion. 
05-Oct-2026 20:22:18 [4.71188568e+09 4.71188569e+09 4.71188570e+09 4.71188571e+09
05-Oct-2026 20:22:18 4.71188571e+09 4.71188572e+09 4.71188573e+09 4.71188574e+09]
05-Oct-2026 20:22:18 [4.71188568e+09 4.71188569e+09 4.71188570e+09 4.71188571e+09
05-Oct-2026 20:22:18 4.71188571e+09 4.71188572e+09 4.71188573e+09 4.71188574e+09]
05-Oct-2026 20:22:18 PASSED
05-Oct-2026 20:22:18
05-Oct-2026 20:22:18 2026-10-06 00:22:18        INFO        name::        No table opened.
05-Oct-2026 20:22:18 2026-10-06 00:22:18        INFO        name::        No table opened.
05-Oct-2026 20:22:18 test_tool_table.py::TableGetcoliterTest::test_errors
05-Oct-2026 20:22:18 PASSED
05-Oct-2026 20:22:18
05-Oct-2026 20:22:18 2026-10-06 00:22:18        INFO        name::        No table opened.
05-Oct-2026 20:22:18 2026-10-06 00:22:18        INFO        name::        No table opened.
05-Oct-2026 20:22:18 test_tool_table.py::TableGetcoliterTest::test_values
05-Oct-2026 20:22:18 PASSED
05-Oct-2026 20:22:18
05-Oct-2026 20:22:18 2026-10-06 00:22:18        INFO        name::        No table opened.
05-Oct-2026 20:22:18 2026-10-06 00:22:18        INFO        name::        No table opened.
05-Oct-2026 20:22:18 test_tool_table.py::TableRowTest::test_all_rows
05-Oct-2026 20:22:18 PASSED
05-Oct-2026 20:22:18
05-Oct-2026 20:22:18 2026-10-06 00:22:18        INFO        name::        No table opened.
05-Oct-2026 20:22:18 2026-10-06 00:22:18        INFO        name::        No table opened.
05-Oct-2026 20:22:18 test_tool_table.py::TableRowTest::test_columnnames_exclude
05-Oct-2026 20:22:18 PASSED
05-Oct-2026 20:22:18
05-Oct-2026 20:22:18 2026-10-06 00:22:18        INFO        name::        No table opened.
05-Oct-2026 20:22:18 2026-10-06 00:22:18        INFO        name::        No table opened.
05-Oct-2026 20:22:18 test_tool_table.py::TableRowTest::test_columnnames_include
05-Oct-2026 20:22:18 PASSED
05-Oct-2026 20:22:18
05-Oct-2026 20:22:18 2026-10-06 00:22:18        INFO        name::        No table opened.
05-Oct-2026 20:22:18 2026-10-06 00:22:18        INFO        name::        No table opened.
05-Oct-2026 20:22:18 test_tool_table.py::TableRowTest::test_get
05-Oct-2026 20:22:18 Test get function
05-Oct-2026 20:22:18 PASSED
05-Oct-2026 20:22:18
05-Oct-2026 20:22:18 2026-10-06 00:22:18        INFO        name::        No table opened.
05-Oct-2026 20:22:18 2026-10-06 00:22:18        INFO        name::        No table opened.
05-Oct-2026 20:22:18 2026-10-06 00:22:18        INFO        name::        No table opened.
05-Oct-2026 20:22:18 2026-10-06 00:22:18        INFO        name::        No table opened.
05-Oct-2026 20:22:18 test_tool_table.py::TableRowTest::test_put
05-Oct-2026 20:22:18 Test put function
05-Oct-2026 20:22:18 PASSED
05-Oct-2026 20:22:18
05-Oct-2026 20:22:18 2026-10-06 00:22:19        INFO        name::        No table opened.
05-Oct-2026 20:22:18 2026-10-06 00:22:19        INFO        name::        No table opened.
05-Oct-2026 20:22:18 test_tool_table.py::TableRowTest::test_shape
05-Oct-2026 20:22:18 Test for valid data shape
05-Oct-2026 20:22:18 PASSED
05-Oct-2026 20:22:18
05-Oct-2026 20:22:18 2026-10-06 00:22:19        INFO        name::        No table opened.
05-Oct-2026 20:22:18 2026-10-06 00:22:19        INFO        name::        No table opened.
05-Oct-2026 20:22:18 test_tool_table.py::TableRowTest::test_some_rows
05-Oct-2026 20:22:18 PASSED
05-Oct-2026 20:22:18
05-Oct-2026 20:22:18 2026-10-06 00:22:19        INFO        ImageFactory::createImage        Created Paged image 'tmp.im' of shape [3, 4] with float valued pixels.
05-Oct-2026 20:22:18 2026-10-06 00:22:19        SEVERE        getcellslice::bogus        Exception Reported: Table column bogus is unknown
05-Oct-2026 20:22:18 2026-10-06 00:22:19        SEVERE        getcellslice::map        Exception Reported: TableColumn: row number 1 exceeds #rows 1 in table /home/casatest/casa6/casatestutils/nosedir/test_tool_table/tmp.im
05-Oct-2026 20:22:18 2026-10-06 00:22:19        SEVERE        getcellslice::map        Exception Reported: Exception: blc must have length of 2.
05-Oct-2026 20:22:18 2026-10-06 00:22:19        SEVERE        getcellslice::map+        ... thrown by void casac::table::_checkCorner(const std::vector<long int>&, const casacore::String&, const casacore::IPosition&, const std::pair<std::vector<long int>, std::vector<long int> >* const&) at File: src/tools/table/table_cmpt.cc, line: 1386
05-Oct-2026 20:22:18 2026-10-06 00:22:19        SEVERE        getcellslice::map        Exception Reported: Exception: All elements of blc must be greater than or equal to 0.
05-Oct-2026 20:22:18 2026-10-06 00:22:19        SEVERE        getcellslice::map+        ... thrown by void casac::table::_checkCorner(const std::vector<long int>&, const casacore::String&, const casacore::IPosition&, const std::pair<std::vector<long int>, std::vector<long int> >* const&) at File: src/tools/table/table_cmpt.cc, line: 1390
05-Oct-2026 20:22:18 2026-10-06 00:22:19        SEVERE        getcellslice::map        Exception Reported: Exception: Element 1 of blc must be less than 4.
05-Oct-2026 20:22:18 2026-10-06 00:22:19        SEVERE        getcellslice::map+        ... thrown by void casac::table::_checkCorner(const std::vector<long int>&, const casacore::String&, const casacore::IPosition&, const std::pair<std::vector<long int>, std::vector<long int> >* const&) at File: src/tools/table/table_cmpt.cc, line: 1395
05-Oct-2026 20:22:18 2026-10-06 00:22:19        SEVERE        getcellslice::map        Exception Reported: Exception: trc must have length of 2.
05-Oct-2026 20:22:18 2026-10-06 00:22:19        SEVERE        getcellslice::map+        ... thrown by void casac::table::_checkCorner(const std::vector<long int>&, const casacore::String&, const casacore::IPosition&, const std::pair<std::vector<long int>, std::vector<long int> >* const&) at File: src/tools/table/table_cmpt.cc, line: 1386
05-Oct-2026 20:22:18 2026-10-06 00:22:19        SEVERE        getcellslice::map        Exception Reported: Exception: All elements of trc must be greater than or equal to 0.
05-Oct-2026 20:22:18 2026-10-06 00:22:19        SEVERE        getcellslice::map+        ... thrown by void casac::table::_checkCorner(const std::vector<long int>&, const casacore::String&, const casacore::IPosition&, const std::pair<std::vector<long int>, std::vector<long int> >* const&) at File: src/tools/table/table_cmpt.cc, line: 1390
05-Oct-2026 20:22:18 2026-10-06 00:22:19        SEVERE        getcellslice::map        Exception Reported: Exception: Element 0 of trc must be less than 3.
05-Oct-2026 20:22:18 2026-10-06 00:22:19        SEVERE        getcellslice::map+        ... thrown by void casac::table::_checkCorner(const std::vector<long int>&, const casacore::String&, const casacore::IPosition&, const std::pair<std::vector<long int>, std::vector<long int> >* const&) at File: src/tools/table/table_cmpt.cc, line: 1395
05-Oct-2026 20:22:18 2026-10-06 00:22:19        SEVERE        getcellslice::map        Exception Reported: Exception: All elements of trc must be greater than or equal to their corresponding blc elements.
05-Oct-2026 20:22:18 2026-10-06 00:22:19        SEVERE        getcellslice::map+        ... thrown by void casac::table::_checkCorner(const std::vector<long int>&, const casacore::String&, const casacore::IPosition&, const std::pair<std::vector<long int>, std::vector<long int> >* const&) at File: src/tools/table/table_cmpt.cc, line: 1405
05-Oct-2026 20:22:18 2026-10-06 00:22:19        SEVERE        getcellslice::map        Exception Reported: Exception: incr must have length of 2.
05-Oct-2026 20:22:18 2026-10-06 00:22:19        SEVERE        getcellslice::map+        ... thrown by casac::variant* casac::table::getcellslice(const string&, long int, const std::vector<long int>&, const std::vector<long int>&, const std::vector<long int>&) at File: src/tools/table/table_cmpt.cc, line: 1466
05-Oct-2026 20:22:18 2026-10-06 00:22:19        SEVERE        getcellslice::map        Exception Reported: Exception: All elements of incr must be greater than 0.
05-Oct-2026 20:22:18 2026-10-06 00:22:19        SEVERE        getcellslice::map+        ... thrown by casac::variant* casac::table::getcellslice(const string&, long int, const std::vector<long int>&, const std::vector<long int>&, const std::vector<long int>&) at File: src/tools/table/table_cmpt.cc, line: 1471
05-Oct-2026 20:22:18 2026-10-06 00:22:19        INFO        name::        No table opened.
05-Oct-2026 20:22:18 2026-10-06 00:22:19        INFO        name::        No table opened.
05-Oct-2026 20:22:18 test_tool_table.py::table_getcellslice_test::test_exceptions
05-Oct-2026 20:22:18 Test various exception cases
05-Oct-2026 20:22:18 PASSED
05-Oct-2026 20:22:18
05-Oct-2026 20:22:18 2026-10-06 00:22:19        INFO        ImageFactory::createImage        Created Paged image 'tmp.im' of shape [3, 4] with float valued pixels.
05-Oct-2026 20:22:18 2026-10-06 00:22:19        INFO        name::        No table opened.
05-Oct-2026 20:22:18 2026-10-06 00:22:19        INFO        name::        No table opened.
05-Oct-2026 20:22:18 2026-10-06 00:22:19        INFO        name::        No table opened.
05-Oct-2026 20:22:18 test_tool_table.py::table_getcellslice_test::test_getcellslice
05-Oct-2026 20:22:18 tests for valid inputs
05-Oct-2026 20:22:18 PASSED
05-Oct-2026 20:22:18
05-Oct-2026 20:22:18 - generated xml file: /home/casatest/casa6/casatestutils/nosedir/xml/test_tool_table/nose.xml -
05-Oct-2026 20:22:18 ======================== 13 passed, 1 warning in 0.51s =========================
05-Oct-2026 20:22:18
05-Oct-2026 20:22:18
05-Oct-2026 20:22:18 Setting Working Directory: /home/casatest/casa6/casatestutils/nosedir/test_tool_msmetadata/
05-Oct-2026 20:22:18 Test Directory: /home/casatest/casa6/casatestutils/nosedir/test_tool_msmetadata
05-Oct-2026 20:22:18
05-Oct-2026 20:22:18 Running Command: pytest --junitxml=/home/casatest/casa6/casatestutils/nosedir/xml/test_tool_msmetadata/nose.xml -s --disable-pytest-warnings --verbose -ra --tb=short /home/casatest/casa6/casatestutils/nosedir/test_tool_msmetadata/
05-Oct-2026 20:22:18
05-Oct-2026 20:22:18 Setting Working Directory: /home/casatest/casa6/casatestutils/nosedir/test_tool_calibrater/
05-Oct-2026 20:22:18 Test Directory: /home/casatest/casa6/casatestutils/nosedir/test_tool_calibrater
05-Oct-2026 20:22:18
05-Oct-2026 20:22:18 Running Command: pytest --junitxml=/home/casatest/casa6/casatestutils/nosedir/xml/test_tool_calibrater/nose.xml -s --disable-pytest-warnings --verbose -ra --tb=short /home/casatest/casa6/casatestutils/nosedir/test_tool_calibrater/
05-Oct-2026 20:22:18
05-Oct-2026 20:22:18 Setting Working Directory: /home/casatest/casa6/casatestutils/nosedir/test_tool_image_transpose/
05-Oct-2026 20:22:18 Test Directory: /home/casatest/casa6/casatestutils/nosedir/test_tool_image_transpose
05-Oct-2026 20:22:18
05-Oct-2026 20:22:18 Running Command: pytest --junitxml=/home/casatest/casa6/casatestutils/nosedir/xml/test_tool_image_transpose/nose.xml -s --disable-pytest-warnings --verbose -ra --tb=short /home/casatest/casa6/casatestutils/nosedir/test_tool_image_transpose/
05-Oct-2026 20:22:18
05-Oct-2026 20:22:18 Setting Working Directory: /home/casatest/casa6/casatestutils/nosedir/test_tool_image/
05-Oct-2026 20:22:18 Test Directory: /home/casatest/casa6/casatestutils/nosedir/test_tool_image
05-Oct-2026 20:22:18
05-Oct-2026 20:22:18 Running Command: pytest --junitxml=/home/casatest/casa6/casatestutils/nosedir/xml/test_tool_image/nose.xml -s --disable-pytest-warnings --verbose -ra --tb=short /home/casatest/casa6/casatestutils/nosedir/test_tool_image/
05-Oct-2026 20:22:18
05-Oct-2026 20:22:18 Setting Working Directory: /home/casatest/casa6/casatestutils/nosedir/test_tool_sdm_toms/
05-Oct-2026 20:22:18 Test Directory: /home/casatest/casa6/casatestutils/nosedir/test_tool_sdm_toms
05-Oct-2026 20:22:18
05-Oct-2026 20:22:18 Running Command: pytest --junitxml=/home/casatest/casa6/casatestutils/nosedir/xml/test_tool_sdm_toms/nose.xml -s --disable-pytest-warnings --verbose -ra --tb=short /home/casatest/casa6/casatestutils/nosedir/test_tool_sdm_toms/
05-Oct-2026 20:22:18
05-Oct-2026 20:22:18 Setting Working Directory: /home/casatest/casa6/casatestutils/nosedir/test_tool_imagepol/
05-Oct-2026 20:22:18 Test Directory: /home/casatest/casa6/casatestutils/nosedir/test_tool_imagepol
05-Oct-2026 20:22:18
05-Oct-2026 20:22:18 Running Command: pytest --junitxml=/home/casatest/casa6/casatestutils/nosedir/xml/test_tool_imagepol/nose.xml -s --disable-pytest-warnings --verbose -ra --tb=short /home/casatest/casa6/casatestutils/nosedir/test_tool_imagepol/
05-Oct-2026 20:22:18
05-Oct-2026 20:22:18 Setting Working Directory: /home/casatest/casa6/casatestutils/nosedir/test_tool_vpmanager/
05-Oct-2026 20:22:18 Test Directory: /home/casatest/casa6/casatestutils/nosedir/test_tool_vpmanager
05-Oct-2026 20:22:18
05-Oct-2026 20:22:18 Running Command: pytest --junitxml=/home/casatest/casa6/casatestutils/nosedir/xml/test_tool_vpmanager/nose.xml -s --disable-pytest-warnings --verbose -ra --tb=short /home/casatest/casa6/casatestutils/nosedir/test_tool_vpmanager/
05-Oct-2026 20:22:18
05-Oct-2026 20:22:18 Setting Working Directory: /home/casatest/casa6/casatestutils/nosedir/test_tool_ms_statwt/
05-Oct-2026 20:22:18 Test Directory: /home/casatest/casa6/casatestutils/nosedir/test_tool_ms_statwt
05-Oct-2026 20:22:18
05-Oct-2026 20:22:18 Running Command: pytest --junitxml=/home/casatest/casa6/casatestutils/nosedir/xml/test_tool_ms_statwt/nose.xml -s --disable-pytest-warnings --verbose -ra --tb=short /home/casatest/casa6/casatestutils/nosedir/test_tool_ms_statwt/
05-Oct-2026 20:22:18
05-Oct-2026 20:22:18 Setting Working Directory: /home/casatest/casa6/casatestutils/nosedir/test_tool_linearmosaic/
05-Oct-2026 20:22:18 Test Directory: /home/casatest/casa6/casatestutils/nosedir/test_tool_linearmosaic
05-Oct-2026 20:22:18
05-Oct-2026 20:22:18 Running Command: pytest --junitxml=/home/casatest/casa6/casatestutils/nosedir/xml/test_tool_linearmosaic/nose.xml -s --disable-pytest-warnings --verbose -ra --tb=short /home/casatest/casa6/casatestutils/nosedir/test_tool_linearmosaic/
05-Oct-2026 20:22:18
05-Oct-2026 20:22:18 Setting Working Directory: /home/casatest/casa6/casatestutils/nosedir/test_tool_image_collapse/
05-Oct-2026 20:22:18 Test Directory: /home/casatest/casa6/casatestutils/nosedir/test_tool_image_collapse
05-Oct-2026 20:22:18
05-Oct-2026 20:22:18 Running Command: pytest --junitxml=/home/casatest/casa6/casatestutils/nosedir/xml/test_tool_image_collapse/nose.xml -s --disable-pytest-warnings --verbose -ra --tb=short /home/casatest/casa6/casatestutils/nosedir/test_tool_image_collapse/
05-Oct-2026 20:22:18
05-Oct-2026 20:22:18 Setting Working Directory: /home/casatest/casa6/casatestutils/nosedir/test_tool_ms_createmultims/
05-Oct-2026 20:22:18 Test Directory: /home/casatest/casa6/casatestutils/nosedir/test_tool_ms_createmultims
05-Oct-2026 20:22:18
05-Oct-2026 20:22:18 Running Command: pytest --junitxml=/home/casatest/casa6/casatestutils/nosedir/xml/test_tool_ms_createmultims/nose.xml -s --disable-pytest-warnings --verbose -ra --tb=short /home/casatest/casa6/casatestutils/nosedir/test_tool_ms_createmultims/
05-Oct-2026 20:22:18
05-Oct-2026 20:22:18 Setting Working Directory: /home/casatest/casa6/casatestutils/nosedir/test_tool_ms/
05-Oct-2026 20:22:18 Test Directory: /home/casatest/casa6/casatestutils/nosedir/test_tool_ms
05-Oct-2026 20:22:18
05-Oct-2026 20:22:18 Running Command: pytest --junitxml=/home/casatest/casa6/casatestutils/nosedir/xml/test_tool_ms/nose.xml -s --disable-pytest-warnings --verbose -ra --tb=short /home/casatest/casa6/casatestutils/nosedir/test_tool_ms/
05-Oct-2026 20:22:18
05-Oct-2026 20:22:18 Setting Working Directory: /home/casatest/casa6/casatestutils/nosedir/test_tool_image_subimage/
05-Oct-2026 20:22:18 Test Directory: /home/casatest/casa6/casatestutils/nosedir/test_tool_image_subimage
05-Oct-2026 20:22:18
05-Oct-2026 20:22:18 Running Command: pytest --junitxml=/home/casatest/casa6/casatestutils/nosedir/xml/test_tool_image_subimage/nose.xml -s --disable-pytest-warnings --verbose -ra --tb=short /home/casatest/casa6/casatestutils/nosedir/test_tool_image_subimage/
05-Oct-2026 20:22:18
05-Oct-2026 20:22:18 Setting Working Directory: /home/casatest/casa6/casatestutils/nosedir/test_tool_simulator/
05-Oct-2026 20:22:18 Test Directory: /home/casatest/casa6/casatestutils/nosedir/test_tool_simulator
05-Oct-2026 20:22:18
05-Oct-2026 20:22:18 Running Command: pytest --junitxml=/home/casatest/casa6/casatestutils/nosedir/xml/test_tool_simulator/nose.xml -s --disable-pytest-warnings --verbose -ra --tb=short /home/casatest/casa6/casatestutils/nosedir/test_tool_simulator/
05-Oct-2026 20:22:18
05-Oct-2026 20:22:18 Setting Working Directory: /home/casatest/casa6/casatestutils/nosedir/test_tool_image_rebin/
05-Oct-2026 20:22:18 Test Directory: /home/casatest/casa6/casatestutils/nosedir/test_tool_image_rebin
05-Oct-2026 20:22:18
05-Oct-2026 20:22:18 Running Command: pytest --junitxml=/home/casatest/casa6/casatestutils/nosedir/xml/test_tool_image_rebin/nose.xml -s --disable-pytest-warnings --verbose -ra --tb=short /home/casatest/casa6/casatestutils/nosedir/test_tool_image_rebin/
05-Oct-2026 20:22:18
05-Oct-2026 20:22:18 Setting Working Directory: /home/casatest/casa6/casatestutils/nosedir/test_tool_regionmanager/
05-Oct-2026 20:22:18 Test Directory: /home/casatest/casa6/casatestutils/nosedir/test_tool_regionmanager
05-Oct-2026 20:22:18
05-Oct-2026 20:22:18 Running Command: pytest --junitxml=/home/casatest/casa6/casatestutils/nosedir/xml/test_tool_regionmanager/nose.xml -s --disable-pytest-warnings --verbose -ra --tb=short /home/casatest/casa6/casatestutils/nosedir/test_tool_regionmanager/
05-Oct-2026 20:22:18
05-Oct-2026 20:22:18 Setting Working Directory: /home/casatest/casa6/casatestutils/nosedir/test_tool_coordsys/
05-Oct-2026 20:22:18 Test Directory: /home/casatest/casa6/casatestutils/nosedir/test_tool_coordsys
05-Oct-2026 20:22:18
05-Oct-2026 20:22:18 Running Command: pytest --junitxml=/home/casatest/casa6/casatestutils/nosedir/xml/test_tool_coordsys/nose.xml -s --disable-pytest-warnings --verbose -ra --tb=short /home/casatest/casa6/casatestutils/nosedir/test_tool_coordsys/
05-Oct-2026 20:22:18
05-Oct-2026 20:22:18 Setting Working Directory: /home/casatest/casa6/casatestutils/nosedir/test_tool_table/
05-Oct-2026 20:22:18 Test Directory: /home/casatest/casa6/casatestutils/nosedir/test_tool_table
05-Oct-2026 20:22:18
05-Oct-2026 20:22:18 Running Command: pytest --junitxml=/home/casatest/casa6/casatestutils/nosedir/xml/test_tool_table/nose.xml -s --disable-pytest-warnings --verbose -ra --tb=short /home/casatest/casa6/casatestutils/nosedir/test_tool_table/
05-Oct-2026 20:22:18 total 77820
05-Oct-2026 20:22:18 -rw-r--r-- 1 casaci 15001   161014 Oct  6 00:13 casatestutils-6.7.7.12-py3-none-any.whl
05-Oct-2026 20:22:18 -rw-r--r-- 1 casaci 15001 79352313 Oct  6 00:13 casatools-6.7.7.12-cp312-cp312-manylinux_2_28_x86_64.whl
05-Oct-2026 20:22:18 -rw-r--r-- 1 casaci root      4340 Oct  6 00:22 test_tool_agentflagger.xml
05-Oct-2026 20:22:18 -rw-r--r-- 1 casaci root      1006 Oct  6 00:22 test_tool_calanalysis.xml
05-Oct-2026 20:22:18 -rw-r--r-- 1 casaci root      2656 Oct  6 00:22 test_tool_calibrater.xml
05-Oct-2026 20:22:18 -rw-r--r-- 1 casaci root       687 Oct  6 00:22 test_tool_componentlist.xml
05-Oct-2026 20:22:18 -rw-r--r-- 1 casaci root      7467 Oct  6 00:22 test_tool_coordsys.xml
05-Oct-2026 20:22:18 -rw-r--r-- 1 casaci root     12935 Oct  6 00:22 test_tool_image.xml
05-Oct-2026 20:22:18 -rw-r--r-- 1 casaci root      2220 Oct  6 00:22 test_tool_image_collapse.xml
05-Oct-2026 20:22:18 -rw-r--r-- 1 casaci root      1048 Oct  6 00:22 test_tool_image_deviation.xml
05-Oct-2026 20:22:18 -rw-r--r-- 1 casaci root      2574 Oct  6 00:22 test_tool_image_fitprofile.xml
05-Oct-2026 20:22:18 -rw-r--r-- 1 casaci root      1178 Oct  6 00:22 test_tool_image_pbcor.xml
05-Oct-2026 20:22:18 -rw-r--r-- 1 casaci root       883 Oct  6 00:22 test_tool_image_pv.xml
05-Oct-2026 20:22:18 -rw-r--r-- 1 casaci root      1006 Oct  6 00:22 test_tool_image_rebin.xml
05-Oct-2026 20:22:18 -rw-r--r-- 1 casaci root      1336 Oct  6 00:22 test_tool_image_regrid.xml
05-Oct-2026 20:22:18 -rw-r--r-- 1 casaci root      1639 Oct  6 00:22 test_tool_image_statistics.xml
05-Oct-2026 20:22:18 -rw-r--r-- 1 casaci root       765 Oct  6 00:22 test_tool_image_subimage.xml
05-Oct-2026 20:22:18 -rw-r--r-- 1 casaci root       890 Oct  6 00:22 test_tool_image_transpose.xml
05-Oct-2026 20:22:18 -rw-r--r-- 1 casaci root      1966 Oct  6 00:22 test_tool_imagepol.xml
05-Oct-2026 20:22:18 -rw-r--r-- 1 casaci root       838 Oct  6 00:22 test_tool_linearmosaic.xml
05-Oct-2026 20:22:18 -rw-r--r-- 1 casaci root       669 Oct  6 00:22 test_tool_logsink.xml
05-Oct-2026 20:22:18 -rw-r--r-- 1 casaci root       549 Oct  6 00:22 test_tool_measures.xml
05-Oct-2026 20:22:18 -rw-r--r-- 1 casaci root      5224 Oct  6 00:22 test_tool_ms.xml
05-Oct-2026 20:22:18 -rw-r--r-- 1 casaci root       367 Oct  6 00:22 test_tool_ms_createmultims.xml
05-Oct-2026 20:22:18 -rw-r--r-- 1 casaci root      2096 Oct  6 00:22 test_tool_ms_statwt.xml
05-Oct-2026 20:22:18 -rw-r--r-- 1 casaci root      8633 Oct  6 00:22 test_tool_msmetadata.xml
05-Oct-2026 20:22:18 -rw-r--r-- 1 casaci root       359 Oct  6 00:22 test_tool_msuvbinner.xml
05-Oct-2026 20:22:18 -rw-r--r-- 1 casaci root      1171 Oct  6 00:22 test_tool_quanta.xml
05-Oct-2026 20:22:18 -rw-r--r-- 1 casaci root      3975 Oct  6 00:22 test_tool_regionmanager.xml
05-Oct-2026 20:22:18 -rw-r--r-- 1 casaci root      2071 Oct  6 00:22 test_tool_sdm.xml
05-Oct-2026 20:22:18 -rw-r--r-- 1 casaci root      2190 Oct  6 00:22 test_tool_sdm_toms.xml
05-Oct-2026 20:22:18 -rw-r--r-- 1 casaci root       670 Oct  6 00:22 test_tool_simulator.xml
05-Oct-2026 20:22:18 -rw-r--r-- 1 casaci root      1716 Oct  6 00:22 test_tool_synthesisutils.xml
05-Oct-2026 20:22:18 -rw-r--r-- 1 casaci root      1462 Oct  6 00:22 test_tool_table.xml
05-Oct-2026 20:22:18 -rw-r--r-- 1 casaci root      1717 Oct  6 00:22 test_tool_vpmanager.xml
05-Oct-2026 20:22:18 Finished task 'Test wheel' with result: Success
05-Oct-2026 20:22:18
Substituting variable: ${bamboo.python_version} with 3.12
05-Oct-2026 20:22:18
Substituting variable: ${bamboo.agentId} with 153550849
05-Oct-2026 20:22:18
Substituting variable: ${bamboo.agentId} with 153550849
05-Oct-2026 20:22:18
Substituting variable: ${bamboo.agentId} with 153550849
05-Oct-2026 20:22:18
Substituting variable: ${bamboo.agentId} with 153550849
05-Oct-2026 20:22:18 Starting task 'Tar work directory' of type 'com.atlassian.bamboo.plugins.scripttask:task.builder.script'
05-Oct-2026 20:22:18
Beginning to execute external process for build 'CASASPECS - Master Test 3.12 - Test Tools Many Linux 2.28 Rocky 8.10 Py3.12 #288 (CASASPECS-MASTERTESTPY312-TTOMLPY38-288)'
... running command line:
/opt/ci_workspace/casa/bamboo/agent1/temp/CASASPECS-MASTERTESTPY312-TTOMLPY38-288-ScriptBuildTask-3927623134223099013.sh
... in: /opt/ci_workspace/casa/bamboo/agent1/xml-data/build-dir/CASASPECS-MASTERTESTPY312-TTOMLPY38
05-Oct-2026 20:22:18 Package working directory
05-Oct-2026 20:22:19 tar: nosedir: Cannot stat: No such file or directory
05-Oct-2026 20:22:19 tar: Exiting with failure status due to previous errors
05-Oct-2026 20:22:19 total 77824
05-Oct-2026 20:22:19 -rw-r--r-- 1 casaci 15001   161014 Oct  6 00:13 casatestutils-6.7.7.12-py3-none-any.whl
05-Oct-2026 20:22:19 -rw-r--r-- 1 casaci 15001 79352313 Oct  6 00:13 casatools-6.7.7.12-cp312-cp312-manylinux_2_28_x86_64.whl
05-Oct-2026 20:22:19 -rw-r--r-- 1 casaci root      4340 Oct  6 00:22 test_tool_agentflagger.xml
05-Oct-2026 20:22:19 -rw-r--r-- 1 casaci root      1006 Oct  6 00:22 test_tool_calanalysis.xml
05-Oct-2026 20:22:19 -rw-r--r-- 1 casaci root      2656 Oct  6 00:22 test_tool_calibrater.xml
05-Oct-2026 20:22:19 -rw-r--r-- 1 casaci root       687 Oct  6 00:22 test_tool_componentlist.xml
05-Oct-2026 20:22:19 -rw-r--r-- 1 casaci root      7467 Oct  6 00:22 test_tool_coordsys.xml
05-Oct-2026 20:22:19 -rw-r--r-- 1 casaci root     12935 Oct  6 00:22 test_tool_image.xml
05-Oct-2026 20:22:19 -rw-r--r-- 1 casaci root      2220 Oct  6 00:22 test_tool_image_collapse.xml
05-Oct-2026 20:22:19 -rw-r--r-- 1 casaci root      1048 Oct  6 00:22 test_tool_image_deviation.xml
05-Oct-2026 20:22:19 -rw-r--r-- 1 casaci root      2574 Oct  6 00:22 test_tool_image_fitprofile.xml
05-Oct-2026 20:22:19 -rw-r--r-- 1 casaci root      1178 Oct  6 00:22 test_tool_image_pbcor.xml
05-Oct-2026 20:22:19 -rw-r--r-- 1 casaci root       883 Oct  6 00:22 test_tool_image_pv.xml
05-Oct-2026 20:22:19 -rw-r--r-- 1 casaci root      1006 Oct  6 00:22 test_tool_image_rebin.xml
05-Oct-2026 20:22:19 -rw-r--r-- 1 casaci root      1336 Oct  6 00:22 test_tool_image_regrid.xml
05-Oct-2026 20:22:19 -rw-r--r-- 1 casaci root      1639 Oct  6 00:22 test_tool_image_statistics.xml
05-Oct-2026 20:22:19 -rw-r--r-- 1 casaci root       765 Oct  6 00:22 test_tool_image_subimage.xml
05-Oct-2026 20:22:19 -rw-r--r-- 1 casaci root       890 Oct  6 00:22 test_tool_image_transpose.xml
05-Oct-2026 20:22:19 -rw-r--r-- 1 casaci root      1966 Oct  6 00:22 test_tool_imagepol.xml
05-Oct-2026 20:22:19 -rw-r--r-- 1 casaci root       838 Oct  6 00:22 test_tool_linearmosaic.xml
05-Oct-2026 20:22:19 -rw-r--r-- 1 casaci root       669 Oct  6 00:22 test_tool_logsink.xml
05-Oct-2026 20:22:19 -rw-r--r-- 1 casaci root       549 Oct  6 00:22 test_tool_measures.xml
05-Oct-2026 20:22:19 -rw-r--r-- 1 casaci root      5224 Oct  6 00:22 test_tool_ms.xml
05-Oct-2026 20:22:19 -rw-r--r-- 1 casaci root       367 Oct  6 00:22 test_tool_ms_createmultims.xml
05-Oct-2026 20:22:19 -rw-r--r-- 1 casaci root      2096 Oct  6 00:22 test_tool_ms_statwt.xml
05-Oct-2026 20:22:19 -rw-r--r-- 1 casaci root      8633 Oct  6 00:22 test_tool_msmetadata.xml
05-Oct-2026 20:22:19 -rw-r--r-- 1 casaci root       359 Oct  6 00:22 test_tool_msuvbinner.xml
05-Oct-2026 20:22:19 -rw-r--r-- 1 casaci root      1171 Oct  6 00:22 test_tool_quanta.xml
05-Oct-2026 20:22:19 -rw-r--r-- 1 casaci root      3975 Oct  6 00:22 test_tool_regionmanager.xml
05-Oct-2026 20:22:19 -rw-r--r-- 1 casaci root      2071 Oct  6 00:22 test_tool_sdm.xml
05-Oct-2026 20:22:19 -rw-r--r-- 1 casaci root      2190 Oct  6 00:22 test_tool_sdm_toms.xml
05-Oct-2026 20:22:19 -rw-r--r-- 1 casaci root       670 Oct  6 00:22 test_tool_simulator.xml
05-Oct-2026 20:22:19 -rw-r--r-- 1 casaci root      1716 Oct  6 00:22 test_tool_synthesisutils.xml
05-Oct-2026 20:22:19 -rw-r--r-- 1 casaci root      1462 Oct  6 00:22 test_tool_table.xml
05-Oct-2026 20:22:19 -rw-r--r-- 1 casaci root      1717 Oct  6 00:22 test_tool_vpmanager.xml
05-Oct-2026 20:22:19 -rw-r--r-- 1 casaci root        45 Oct  6 00:22 work-manylinux228-3.12.tar.gz
05-Oct-2026 20:22:19 Done packaging working directory
05-Oct-2026 20:22:19 Finished task 'Tar work directory' with result: Success
05-Oct-2026 20:22:19 Starting task 'Parse tests' of type 'com.atlassian.bamboo.plugins.testresultparser:task.testresultparser.junit'
05-Oct-2026 20:22:19 Parsing test results under /opt/ci_workspace/casa/bamboo/agent1/xml-data/build-dir/CASASPECS-MASTERTESTPY312-TTOMLPY38...
05-Oct-2026 20:22:19 Finished task 'Parse tests' with result: Success
05-Oct-2026 20:22:19
Substituting variable: ${bamboo.agentId} with 153550849
05-Oct-2026 20:22:19 Starting task 'Upload wheel' of type 'com.atlassian.bamboo.plugins.scripttask:task.builder.script'
05-Oct-2026 20:22:19
Beginning to execute external process for build 'CASASPECS - Master Test 3.12 - Test Tools Many Linux 2.28 Rocky 8.10 Py3.12 #288 (CASASPECS-MASTERTESTPY312-TTOMLPY38-288)'
... running command line:
/opt/ci_workspace/casa/bamboo/agent1/temp/CASASPECS-MASTERTESTPY312-TTOMLPY38-288-ScriptBuildTask-15685093622798312249.sh
... in: /opt/ci_workspace/casa/bamboo/agent1/xml-data/build-dir/CASASPECS-MASTERTESTPY312-TTOMLPY38
05-Oct-2026 20:22:19 Collecting twine
05-Oct-2026 20:22:19   Downloading twine-7.0.0-py3-none-any.whl (43 kB)
05-Oct-2026 20:22:19      ━━━━━━━━━━━━━━━━━━━━━━━━━━━━━━━━━━━━━━━━ 43.2/43.2 kB 7.0 MB/s eta 0:00:00
05-Oct-2026 20:22:19 Collecting readme-renderer>=35.0
05-Oct-2026 20:22:19   Downloading readme_renderer-46.0-py3-none-any.whl (14 kB)
05-Oct-2026 20:22:19 Collecting id
05-Oct-2026 20:22:19   Downloading id-1.6.1-py3-none-any.whl (14 kB)
05-Oct-2026 20:22:19 Collecting rfc3986>=1.4.0
05-Oct-2026 20:22:19   Downloading rfc3986-2.0.0-py2.py3-none-any.whl (31 kB)
05-Oct-2026 20:22:19 Collecting urllib3>=1.26.0
05-Oct-2026 20:22:19   Downloading urllib3-2.8.0-py3-none-any.whl (135 kB)
05-Oct-2026 20:22:19      ━━━━━━━━━━━━━━━━━━━━━━━━━━━━━━━━━━━━━━ 135.7/135.7 kB 31.0 MB/s eta 0:00:00
05-Oct-2026 20:22:19 Collecting requests>=2.20
05-Oct-2026 20:22:19   Downloading requests-2.34.2-py3-none-any.whl (73 kB)
05-Oct-2026 20:22:19      ━━━━━━━━━━━━━━━━━━━━━━━━━━━━━━━━━━━━━━━━ 73.1/73.1 kB 40.5 MB/s eta 0:00:00
05-Oct-2026 20:22:19 Collecting packaging>=26.1
05-Oct-2026 20:22:19   Downloading packaging-26.3-py3-none-any.whl (129 kB)
05-Oct-2026 20:22:19      ━━━━━━━━━━━━━━━━━━━━━━━━━━━━━━━━━━━━━━ 130.0/130.0 kB 40.2 MB/s eta 0:00:00
05-Oct-2026 20:22:19 Collecting rich>=14.3.3
05-Oct-2026 20:22:19   Downloading rich-15.0.0-py3-none-any.whl (310 kB)
05-Oct-2026 20:22:19      ━━━━━━━━━━━━━━━━━━━━━━━━━━━━━━━━━━━━━━ 310.7/310.7 kB 59.7 MB/s eta 0:00:00
05-Oct-2026 20:22:19 Collecting keyring>=21.2.0
05-Oct-2026 20:22:19   Downloading keyring-25.7.0-py3-none-any.whl (39 kB)
05-Oct-2026 20:22:19 Collecting requests-toolbelt!=0.9.0,>=0.8.0
05-Oct-2026 20:22:19   Downloading requests_toolbelt-1.0.0-py2.py3-none-any.whl (54 kB)
05-Oct-2026 20:22:19      ━━━━━━━━━━━━━━━━━━━━━━━━━━━━━━━━━━━━━━━━ 54.5/54.5 kB 20.3 MB/s eta 0:00:00
05-Oct-2026 20:22:20 Collecting importlib_metadata>=4.11.4
05-Oct-2026 20:22:20   Downloading importlib_metadata-9.0.1-py3-none-any.whl (27 kB)
05-Oct-2026 20:22:20 Collecting jeepney>=0.4.2
05-Oct-2026 20:22:20   Downloading jeepney-0.9.0-py3-none-any.whl (49 kB)
05-Oct-2026 20:22:20      ━━━━━━━━━━━━━━━━━━━━━━━━━━━━━━━━━━━━━━━━ 49.0/49.0 kB 21.3 MB/s eta 0:00:00
05-Oct-2026 20:22:20 Collecting SecretStorage>=3.2
05-Oct-2026 20:22:20   Downloading secretstorage-3.5.0-py3-none-any.whl (15 kB)
05-Oct-2026 20:22:20 Collecting jaraco.context
05-Oct-2026 20:22:20   Downloading jaraco_context-6.1.2-py3-none-any.whl (7.9 kB)
05-Oct-2026 20:22:20 Collecting jaraco.functools
05-Oct-2026 20:22:20   Downloading jaraco_functools-4.6.0-py3-none-any.whl (11 kB)
05-Oct-2026 20:22:20 Collecting jaraco.classes
05-Oct-2026 20:22:20   Downloading jaraco.classes-3.4.0-py3-none-any.whl (6.8 kB)
05-Oct-2026 20:22:20 Collecting Pygments>=2.5.1
05-Oct-2026 20:22:20   Downloading pygments-2.21.0-py3-none-any.whl (1.3 MB)
05-Oct-2026 20:22:20      ━━━━━━━━━━━━━━━━━━━━━━━━━━━━━━━━━━━━━━━━ 1.3/1.3 MB 119.8 MB/s eta 0:00:00
05-Oct-2026 20:22:20 Collecting docutils>=0.21.2
05-Oct-2026 20:22:20   Downloading docutils-0.23-py3-none-any.whl (634 kB)
05-Oct-2026 20:22:20      ━━━━━━━━━━━━━━━━━━━━━━━━━━━━━━━━━━━━━━ 634.7/634.7 kB 86.3 MB/s eta 0:00:00
05-Oct-2026 20:22:20 Collecting nh3>=0.2.14
05-Oct-2026 20:22:20   Downloading nh3-0.3.7-cp38-abi3-manylinux_2_17_x86_64.manylinux2014_x86_64.whl (832 kB)
05-Oct-2026 20:22:20      ━━━━━━━━━━━━━━━━━━━━━━━━━━━━━━━━━━━━━ 832.2/832.2 kB 111.5 MB/s eta 0:00:00
05-Oct-2026 20:22:20 Collecting charset_normalizer<4,>=2
05-Oct-2026 20:22:20   Downloading charset_normalizer-3.5.2-cp310-cp310-manylinux2014_x86_64.manylinux_2_17_x86_64.manylinux_2_28_x86_64.whl (271 kB)
05-Oct-2026 20:22:20      ━━━━━━━━━━━━━━━━━━━━━━━━━━━━━━━━━━━━━━ 271.1/271.1 kB 60.8 MB/s eta 0:00:00
05-Oct-2026 20:22:20 Collecting idna<4,>=2.5
05-Oct-2026 20:22:20   Downloading idna-3.20-py3-none-any.whl (69 kB)
05-Oct-2026 20:22:20      ━━━━━━━━━━━━━━━━━━━━━━━━━━━━━━━━━━━━━━━━ 69.6/69.6 kB 34.5 MB/s eta 0:00:00
05-Oct-2026 20:22:20 Collecting certifi>=2023.5.7
05-Oct-2026 20:22:20   Downloading certifi-2026.7.22-py3-none-any.whl (136 kB)
05-Oct-2026 20:22:20      ━━━━━━━━━━━━━━━━━━━━━━━━━━━━━━━━━━━━━━ 137.0/137.0 kB 59.3 MB/s eta 0:00:00
05-Oct-2026 20:22:20 Collecting markdown-it-py>=2.2.0
05-Oct-2026 20:22:20   Downloading markdown_it_py-4.2.0-py3-none-any.whl (91 kB)
05-Oct-2026 20:22:20      ━━━━━━━━━━━━━━━━━━━━━━━━━━━━━━━━━━━━━━━━ 91.7/91.7 kB 25.7 MB/s eta 0:00:00
05-Oct-2026 20:22:20 Collecting zipp>=3.20
05-Oct-2026 20:22:20   Downloading zipp-4.1.1-py3-none-any.whl (10 kB)
05-Oct-2026 20:22:20 Collecting mdurl~=0.1
05-Oct-2026 20:22:20   Downloading mdurl-0.1.2-py3-none-any.whl (10.0 kB)
05-Oct-2026 20:22:21 Collecting cryptography>=2.0
05-Oct-2026 20:22:21   Downloading cryptography-50.0.2-cp39-abi3-manylinux_2_28_x86_64.whl (4.8 MB)
05-Oct-2026 20:22:21      ━━━━━━━━━━━━━━━━━━━━━━━━━━━━━━━━━━━━━━━━ 4.8/4.8 MB 82.0 MB/s eta 0:00:00
05-Oct-2026 20:22:21 Collecting more-itertools
05-Oct-2026 20:22:21   Downloading more_itertools-11.1.0-py3-none-any.whl (72 kB)
05-Oct-2026 20:22:21      ━━━━━━━━━━━━━━━━━━━━━━━━━━━━━━━━━━━━━━━━ 72.2/72.2 kB 9.6 MB/s eta 0:00:00
05-Oct-2026 20:22:21 Collecting backports.tarfile
05-Oct-2026 20:22:21   Downloading backports.tarfile-1.2.0-py3-none-any.whl (30 kB)
05-Oct-2026 20:22:21 Collecting cffi>=2.0.0
05-Oct-2026 20:22:21   Downloading cffi-2.1.1-cp310-cp310-manylinux2014_x86_64.manylinux_2_17_x86_64.whl (218 kB)
05-Oct-2026 20:22:21      ━━━━━━━━━━━━━━━━━━━━━━━━━━━━━━━━━━━━━━ 218.7/218.7 kB 50.0 MB/s eta 0:00:00
05-Oct-2026 20:22:21 Collecting typing-extensions>=4.13.2
05-Oct-2026 20:22:21   Downloading typing_extensions-4.16.0-py3-none-any.whl (45 kB)
05-Oct-2026 20:22:21      ━━━━━━━━━━━━━━━━━━━━━━━━━━━━━━━━━━━━━━━━ 45.6/45.6 kB 26.2 MB/s eta 0:00:00
05-Oct-2026 20:22:21 Collecting pycparser
05-Oct-2026 20:22:21   Downloading pycparser-3.0-py3-none-any.whl (48 kB)
05-Oct-2026 20:22:21      ━━━━━━━━━━━━━━━━━━━━━━━━━━━━━━━━━━━━━━━━ 48.2/48.2 kB 14.2 MB/s eta 0:00:00
05-Oct-2026 20:22:21 Installing collected packages: zipp, urllib3, typing-extensions, rfc3986, Pygments, pycparser, packaging, nh3, more-itertools, mdurl, jeepney, idna, docutils, charset_normalizer, certifi, backports.tarfile, requests, readme-renderer, markdown-it-py, jaraco.functools, jaraco.context, jaraco.classes, importlib_metadata, id, cffi, rich, requests-toolbelt, cryptography, SecretStorage, keyring, twine
05-Oct-2026 20:22:23 Successfully installed Pygments-2.21.0 SecretStorage-3.5.0 backports.tarfile-1.2.0 certifi-2026.7.22 cffi-2.1.1 charset_normalizer-3.5.2 cryptography-50.0.2 docutils-0.23 id-1.6.1 idna-3.20 importlib_metadata-9.0.1 jaraco.classes-3.4.0 jaraco.context-6.1.2 jaraco.functools-4.6.0 jeepney-0.9.0 keyring-25.7.0 markdown-it-py-4.2.0 mdurl-0.1.2 more-itertools-11.1.0 nh3-0.3.7 packaging-26.3 pycparser-3.0 readme-renderer-46.0 requests-2.34.2 requests-toolbelt-1.0.0 rfc3986-2.0.0 rich-15.0.0 twine-7.0.0 typing-extensions-4.16.0 urllib3-2.8.0 zipp-4.1.1
05-Oct-2026 20:22:23 WARNING: Running pip as the 'root' user can result in broken permissions and conflicting behaviour with the system package manager. It is recommended to use a virtual environment instead: https://pip.pypa.io/warnings/venv
05-Oct-2026 20:22:23
05-Oct-2026 20:22:23 [notice] A new release of pip is available: 23.0.1 -> 26.2.1
05-Oct-2026 20:22:23 [notice] To update, run: pip3 install --upgrade pip
05-Oct-2026 20:22:23 Cloning into 'casa-build-utils'...
05-Oct-2026 20:22:23 Uploading distributions to
05-Oct-2026 20:22:23 https://casa-pip.nrao.edu:443/repository/casa-test-wheel/
05-Oct-2026 20:22:24 Uploading casatools-6.7.7.12-cp312-cp312-manylinux_2_28_x86_64.whl
05-Oct-2026 20:22:24
05-Oct-2026 20:22:24   0% ━━━━━━━━━━━━━━━━━━━━━━━━━━━━━━━━━━━━━━━━ 0.0/79.4 MB • --:-- • ?
05-Oct-2026 20:22:24 12% ━━━━╸━━━━━━━━━━━━━━━━━━━━━━━━━━━━━━━━━━━ 9.7/79.4 MB • 00:01 • 151.4 MB/s
05-Oct-2026 20:22:24 16% ━━━━━━╺━━━━━━━━━━━━━━━━━━━━━━━━━━━━━━━━━ 12.8/79.4 MB • 00:01 • 88.8 MB/s
05-Oct-2026 20:22:24 18% ━━━━━━━╺━━━━━━━━━━━━━━━━━━━━━━━━━━━━━━━━ 14.6/79.4 MB • 00:01 • 67.7 MB/s
05-Oct-2026 20:22:24 21% ━━━━━━━━╺━━━━━━━━━━━━━━━━━━━━━━━━━━━━━━━ 16.6/79.4 MB • 00:02 • 57.0 MB/s
05-Oct-2026 20:22:24 25% ━━━━━━━━━╸━━━━━━━━━━━━━━━━━━━━━━━━━━━━━━ 19.5/79.4 MB • 00:02 • 43.1 MB/s
05-Oct-2026 20:22:24 30% ━━━━━━━━━━━━╺━━━━━━━━━━━━━━━━━━━━━━━━━━━ 24.0/79.4 MB • 00:02 • 31.3 MB/s
05-Oct-2026 20:22:24 33% ━━━━━━━━━━━━━╺━━━━━━━━━━━━━━━━━━━━━━━━━━ 26.4/79.4 MB • 00:02 • 28.3 MB/s
05-Oct-2026 20:22:25 36% ━━━━━━━━━━━━━━╺━━━━━━━━━━━━━━━━━━━━━━━━━ 28.6/79.4 MB • 00:02 • 28.2 MB/s
05-Oct-2026 20:22:25 42% ━━━━━━━━━━━━━━━━╸━━━━━━━━━━━━━━━━━━━━━━━ 33.4/79.4 MB • 00:02 • 33.1 MB/s
05-Oct-2026 20:22:25 45% ━━━━━━━━━━━━━━━━━╸━━━━━━━━━━━━━━━━━━━━━━ 35.7/79.4 MB • 00:02 • 29.1 MB/s
05-Oct-2026 20:22:25 48% ━━━━━━━━━━━━━━━━━━━╺━━━━━━━━━━━━━━━━━━━━ 38.1/79.4 MB • 00:02 • 32.9 MB/s
05-Oct-2026 20:22:25 52% ━━━━━━━━━━━━━━━━━━━━╸━━━━━━━━━━━━━━━━━━━ 41.5/79.4 MB • 00:02 • 30.4 MB/s
05-Oct-2026 20:22:25 56% ━━━━━━━━━━━━━━━━━━━━━━╺━━━━━━━━━━━━━━━━━ 44.3/79.4 MB • 00:02 • 29.6 MB/s
05-Oct-2026 20:22:25 59% ━━━━━━━━━━━━━━━━━━━━━━━╸━━━━━━━━━━━━━━━━ 46.6/79.4 MB • 00:02 • 29.6 MB/s
05-Oct-2026 20:22:25 64% ━━━━━━━━━━━━━━━━━━━━━━━━━╸━━━━━━━━━━━━━━ 50.9/79.4 MB • 00:01 • 30.2 MB/s
05-Oct-2026 20:22:25 67% ━━━━━━━━━━━━━━━━━━━━━━━━━━╸━━━━━━━━━━━━━ 53.1/79.4 MB • 00:01 • 30.7 MB/s
05-Oct-2026 20:22:25 72% ━━━━━━━━━━━━━━━━━━━━━━━━━━━━╸━━━━━━━━━━━ 57.2/79.4 MB • 00:01 • 32.1 MB/s
05-Oct-2026 20:22:26 75% ━━━━━━━━━━━━━━━━━━━━━━━━━━━━━╸━━━━━━━━━━ 59.4/79.4 MB • 00:01 • 33.8 MB/s
05-Oct-2026 20:22:26 77% ━━━━━━━━━━━━━━━━━━━━━━━━━━━━━━╸━━━━━━━━━ 61.2/79.4 MB • 00:01 • 33.5 MB/s
05-Oct-2026 20:22:26 82% ━━━━━━━━━━━━━━━━━━━━━━━━━━━━━━━━╸━━━━━━━ 65.1/79.4 MB • 00:01 • 29.8 MB/s
05-Oct-2026 20:22:26 85% ━━━━━━━━━━━━━━━━━━━━━━━━━━━━━━━━━╸━━━━━━ 67.2/79.4 MB • 00:01 • 29.7 MB/s
05-Oct-2026 20:22:26 91% ━━━━━━━━━━━━━━━━━━━━━━━━━━━━━━━━━━━━╺━━━ 71.8/79.4 MB • 00:01 • 33.1 MB/s
05-Oct-2026 20:22:26 93% ━━━━━━━━━━━━━━━━━━━━━━━━━━━━━━━━━━━━━╺━━ 73.6/79.4 MB • 00:01 • 29.4 MB/s
05-Oct-2026 20:22:26 95% ━━━━━━━━━━━━━━━━━━━━━━━━━━━━━━━━━━━━━╸━━ 75.4/79.4 MB • 00:01 • 28.4 MB/s
05-Oct-2026 20:22:26 100% ━━━━━━━━━━━━━━━━━━━━━━━━━━━━━━━━━━━━━━━━ 79.4/79.4 MB • 00:02 • 28.1 MB/s
05-Oct-2026 20:22:26 100% ━━━━━━━━━━━━━━━━━━━━━━━━━━━━━━━━━━━━━━━━ 79.4/79.4 MB • 00:02 • 28.1 MB/s
05-Oct-2026 20:22:26 100% ━━━━━━━━━━━━━━━━━━━━━━━━━━━━━━━━━━━━━━━━ 79.4/79.4 MB • 00:02 • 28.1 MB/s
05-Oct-2026 20:22:27 100% ━━━━━━━━━━━━━━━━━━━━━━━━━━━━━━━━━━━━━━━━ 79.4/79.4 MB • 00:02 • 28.1 MB/s
05-Oct-2026 20:22:27 100% ━━━━━━━━━━━━━━━━━━━━━━━━━━━━━━━━━━━━━━━━ 79.4/79.4 MB • 00:02 • 28.1 MB/s
05-Oct-2026 20:22:27 100% ━━━━━━━━━━━━━━━━━━━━━━━━━━━━━━━━━━━━━━━━ 79.4/79.4 MB • 00:02 • 28.1 MB/s
05-Oct-2026 20:22:27 Uploading distributions to
05-Oct-2026 20:22:27 https://casa-pip.nrao.edu:443/repository/casa-test-wheel/
05-Oct-2026 20:22:27 Uploading casatestutils-6.7.7.12-py3-none-any.whl
05-Oct-2026 20:22:27
05-Oct-2026 20:22:27   0% ━━━━━━━━━━━━━━━━━━━━━━━━━━━━━━━━━━━━━━━━ 0.0/174.3 kB • --:-- • ?
05-Oct-2026 20:22:27 100% ━━━━━━━━━━━━━━━━━━━━━━━━━━━━━━━━━━━━━━━ 174.3/174.3 kB • 00:00 • 181.0 MB/s
05-Oct-2026 20:22:27 100% ━━━━━━━━━━━━━━━━━━━━━━━━━━━━━━━━━━━━━━━ 174.3/174.3 kB • 00:00 • 181.0 MB/s
05-Oct-2026 20:22:27 100% ━━━━━━━━━━━━━━━━━━━━━━━━━━━━━━━━━━━━━━━ 174.3/174.3 kB • 00:00 • 181.0 MB/s
05-Oct-2026 20:22:27 100% ━━━━━━━━━━━━━━━━━━━━━━━━━━━━━━━━━━━━━━━ 174.3/174.3 kB • 00:00 • 181.0 MB/s
05-Oct-2026 20:22:27 100% ━━━━━━━━━━━━━━━━━━━━━━━━━━━━━━━━━━━━━━━ 174.3/174.3 kB • 00:00 • 181.0 MB/s
05-Oct-2026 20:22:27
05-Oct-2026 20:22:27 Finished task 'Upload wheel' with result: Success
05-Oct-2026 20:22:27
Substituting variable: ${bamboo.agentId} with 153550849
05-Oct-2026 20:22:27
Substituting variable: ${bamboo.agentId} with 153550849
05-Oct-2026 20:22:27 Starting task 'Cleanup' of type 'com.atlassian.bamboo.plugins.scripttask:task.builder.script'
05-Oct-2026 20:22:27
Beginning to execute external process for build 'CASASPECS - Master Test 3.12 - Test Tools Many Linux 2.28 Rocky 8.10 Py3.12 #288 (CASASPECS-MASTERTESTPY312-TTOMLPY38-288)'
... running command line:
/opt/ci_workspace/casa/bamboo/agent1/temp/CASASPECS-MASTERTESTPY312-TTOMLPY38-288-ScriptBuildTask-2406856312916625478.sh
... in: /opt/ci_workspace/casa/bamboo/agent1/xml-data/build-dir/CASASPECS-MASTERTESTPY312-TTOMLPY38
05-Oct-2026 20:22:27 Starting cleanup
05-Oct-2026 20:22:38 wheel-container-test-153550849
05-Oct-2026 20:22:39 wheel-container-test-153550849
05-Oct-2026 20:22:39 Cleanup complete
05-Oct-2026 20:22:39 Finished task 'Cleanup' with result: Success
05-Oct-2026 20:22:39 Running post build plugin 'Docker Container Cleanup'
05-Oct-2026 20:22:39
Beginning to execute external process for build 'CASASPECS - Master Test 3.12 - Test Tools Many Linux 2.28 Rocky 8.10 Py3.12 #288 (CASASPECS-MASTERTESTPY312-TTOMLPY38-288)'
... running command line:
/usr/bin/docker rm -f wheel-container-test-153550849
... in: /opt/ci_workspace/casa/bamboo/agent1/xml-data/build-dir/CASASPECS-MASTERTESTPY312-TTOMLPY38
05-Oct-2026 20:22:39 Running post build plugin 'NCover Results Collector'
05-Oct-2026 20:22:39 Running post build plugin 'Build Results Label Collector'
05-Oct-2026 20:22:39 Running post build plugin 'Clover Results Collector'
05-Oct-2026 20:22:39 Running post build plugin 'npm Cache Cleanup'
05-Oct-2026 20:22:39 Running post build plugin 'Artifact Copier'
05-Oct-2026 20:22:39 Publishing an artifact: Workdir
05-Oct-2026 20:22:40 Finished publishing of artifact Non required job artifact Http Compression On : [Workdir], patterns: [work*.tar.gz] anchored at: [wheeldirectory/] in 50.54 ms
05-Oct-2026 20:22:40 Publishing an artifact: XML Directories
05-Oct-2026 20:22:40 Finished publishing of artifact Non required job artifact Http Compression On : [XML Directories], patterns: [**/*.xml] anchored at: [wheeldirectory/] in 125.7 ms
05-Oct-2026 20:22:40 Finalising the build...
05-Oct-2026 20:22:40 Stopping timer.
05-Oct-2026 20:22:40 Build CASASPECS-MASTERTESTPY312-TTOMLPY38-288 completed.
05-Oct-2026 20:22:40 Running on server: post build plugin 'Build Hanging Detection Configuration'
05-Oct-2026 20:22:40 Running on server: post build plugin 'NCover Results Collector'
05-Oct-2026 20:22:40 Running on server: post build plugin 'Build Labeller'
05-Oct-2026 20:22:40 Running on server: post build plugin 'Clover Delta Calculator'
05-Oct-2026 20:22:40 Running on server: post build plugin 'Maven Dependencies Postprocessor'
05-Oct-2026 20:22:40 All post build plugins have finished
05-Oct-2026 20:22:40 Generating build results summary...
05-Oct-2026 20:22:40 Saving build results to disk...
05-Oct-2026 20:22:40 Store variable context...
05-Oct-2026 20:22:40 Finished building CASASPECS-MASTERTESTPY312-TTOMLPY38-288.