Tools and Tasks tests for Python 3.12

Build: #296 failed

Job: Test Tools Many Linux 2.28 Rocky 9.5 Py3.12 failed

Build log

The build generated 382 lines of output. Download or view full build log.

27-Oct-2026 20:00:25 Build CASASPECS - Master Test 3.12 - Test Tools Many Linux 2.28 Rocky 9.5 Py3.12 #296 (CASASPECS-MASTERTESTPY312-TTR9P-296) is being prepared for building on agent casaci-4.cv.nrao.edu, bamboo version: 9.6.26
27-Oct-2026 20:00:25 Remote agent on host casaci-4.cv.nrao.edu
27-Oct-2026 20:00:25 Build working directory is /opt/ci_workspace/casa/bamboo/agent5/xml-data/build-dir/CASASPECS-MASTERTESTPY312-TTR9P
27-Oct-2026 20:00:25 Executing build CASASPECS - Master Test 3.12 - Test Tools Many Linux 2.28 Rocky 9.5 Py3.12 #296 (CASASPECS-MASTERTESTPY312-TTR9P-296)
27-Oct-2026 20:00:25 Starting task 'Source Code Checkout' of type 'com.atlassian.bamboo.plugins.vcs:task.vcs.checkout'
27-Oct-2026 20:00:25 Build always requires a clean checkout
27-Oct-2026 20:00:25 Cleaning build directory '/opt/ci_workspace/casa/bamboo/agent5/xml-data/build-dir/CASASPECS-MASTERTESTPY312-TTR9P'
27-Oct-2026 20:00:27 Checking out into /opt/ci_workspace/casa/bamboo/agent5/xml-data/build-dir/CASASPECS-MASTERTESTPY312-TTR9P
27-Oct-2026 20:00:27 Updating source code to revision: 188b64ce030a360ced17720a68d5af3bbcffaf87
27-Oct-2026 20:00:29 Fetching 'refs/heads/master' from 'ssh://git@open-bitbucket.nrao.edu:7999/casa/casa6.git'.
27-Oct-2026 20:00:29 Warning: Permanently added '[127.0.0.1]:33115' (RSA) to the list of known hosts.
27-Oct-2026 20:00:29 X11 forwarding request failed on channel 0
27-Oct-2026 20:00:31 Checking out revision 188b64ce030a360ced17720a68d5af3bbcffaf87.
27-Oct-2026 20:00:31 Creating local git repository in '/opt/ci_workspace/casa/bamboo/agent5/xml-data/build-dir/CASASPECS-MASTERTESTPY312-TTR9P/.git'.
27-Oct-2026 20:00:31 Cloning into '/opt/ci_workspace/casa/bamboo/agent5/xml-data/build-dir/CASASPECS-MASTERTESTPY312-TTR9P'...
27-Oct-2026 20:00:31 done.
27-Oct-2026 20:00:33 Already on 'master'
27-Oct-2026 20:00:33 Your branch is up to date with 'origin/master'.
27-Oct-2026 20:00:33 Submodule 'casatools/casacore' (https://github.com/casacore/casacore.git) registered for path 'casatools/casacore'
27-Oct-2026 20:00:33 Submodule 'casatools/grpc-source' (https://github.com/grpc/grpc) registered for path 'casatools/grpc-source'
27-Oct-2026 20:00:33 Cloning into '/opt/ci_workspace/casa/bamboo/agent5/xml-data/build-dir/CASASPECS-MASTERTESTPY312-TTR9P/casatools/casacore'...
27-Oct-2026 20:00:41 Cloning into '/opt/ci_workspace/casa/bamboo/agent5/xml-data/build-dir/CASASPECS-MASTERTESTPY312-TTR9P/casatools/grpc-source'...
27-Oct-2026 20:01:04 Submodule path 'casatools/casacore': checked out 'aaf72eb7edd5a5fecefa78ca04713233b7b6ffd6'
27-Oct-2026 20:01:04 Submodule path 'casatools/grpc-source': checked out 'cca868ac8f3641df4003a82b7fc54c921e14f765'
27-Oct-2026 20:01:04 Submodule 'third_party/abseil-cpp' (https://github.com/abseil/abseil-cpp) registered for path 'casatools/grpc-source/third_party/abseil-cpp'
27-Oct-2026 20:01:04 Submodule 'third_party/benchmark' (https://github.com/google/benchmark) registered for path 'casatools/grpc-source/third_party/benchmark'
27-Oct-2026 20:01:04 Submodule 'third_party/bloaty' (https://github.com/google/bloaty.git) registered for path 'casatools/grpc-source/third_party/bloaty'
27-Oct-2026 20:01:04 Submodule 'third_party/boringssl' (https://github.com/google/boringssl.git) registered for path 'casatools/grpc-source/third_party/boringssl'
27-Oct-2026 20:01:04 Submodule 'third_party/boringssl-with-bazel' (https://github.com/google/boringssl.git) registered for path 'casatools/grpc-source/third_party/boringssl-with-bazel'
27-Oct-2026 20:01:04 Submodule 'third_party/cares/cares' (https://github.com/c-ares/c-ares.git) registered for path 'casatools/grpc-source/third_party/cares/cares'
27-Oct-2026 20:01:04 Submodule 'third_party/gflags' (https://github.com/gflags/gflags.git) registered for path 'casatools/grpc-source/third_party/gflags'
27-Oct-2026 20:01:04 Submodule 'third_party/googletest' (https://github.com/google/googletest.git) registered for path 'casatools/grpc-source/third_party/googletest'
27-Oct-2026 20:01:04 Submodule 'third_party/protobuf' (https://github.com/google/protobuf.git) registered for path 'casatools/grpc-source/third_party/protobuf'
27-Oct-2026 20:01:04 Submodule 'third_party/zlib' (https://github.com/madler/zlib) registered for path 'casatools/grpc-source/third_party/zlib'
27-Oct-2026 20:01:04 Cloning into '/opt/ci_workspace/casa/bamboo/agent5/xml-data/build-dir/CASASPECS-MASTERTESTPY312-TTR9P/casatools/grpc-source/third_party/abseil-cpp'...
27-Oct-2026 20:01:05 Cloning into '/opt/ci_workspace/casa/bamboo/agent5/xml-data/build-dir/CASASPECS-MASTERTESTPY312-TTR9P/casatools/grpc-source/third_party/benchmark'...
27-Oct-2026 20:01:06 Cloning into '/opt/ci_workspace/casa/bamboo/agent5/xml-data/build-dir/CASASPECS-MASTERTESTPY312-TTR9P/casatools/grpc-source/third_party/bloaty'...
27-Oct-2026 20:01:06 Cloning into '/opt/ci_workspace/casa/bamboo/agent5/xml-data/build-dir/CASASPECS-MASTERTESTPY312-TTR9P/casatools/grpc-source/third_party/boringssl'...
27-Oct-2026 20:01:17 Cloning into '/opt/ci_workspace/casa/bamboo/agent5/xml-data/build-dir/CASASPECS-MASTERTESTPY312-TTR9P/casatools/grpc-source/third_party/boringssl-with-bazel'...
27-Oct-2026 20:01:26 Cloning into '/opt/ci_workspace/casa/bamboo/agent5/xml-data/build-dir/CASASPECS-MASTERTESTPY312-TTR9P/casatools/grpc-source/third_party/cares/cares'...
27-Oct-2026 20:01:27 Cloning into '/opt/ci_workspace/casa/bamboo/agent5/xml-data/build-dir/CASASPECS-MASTERTESTPY312-TTR9P/casatools/grpc-source/third_party/gflags'...
27-Oct-2026 20:01:27 Cloning into '/opt/ci_workspace/casa/bamboo/agent5/xml-data/build-dir/CASASPECS-MASTERTESTPY312-TTR9P/casatools/grpc-source/third_party/googletest'...
27-Oct-2026 20:01:28 Cloning into '/opt/ci_workspace/casa/bamboo/agent5/xml-data/build-dir/CASASPECS-MASTERTESTPY312-TTR9P/casatools/grpc-source/third_party/protobuf'...
27-Oct-2026 20:01:37 Cloning into '/opt/ci_workspace/casa/bamboo/agent5/xml-data/build-dir/CASASPECS-MASTERTESTPY312-TTR9P/casatools/grpc-source/third_party/zlib'...
27-Oct-2026 20:01:37 Submodule path 'casatools/grpc-source/third_party/abseil-cpp': checked out 'cc4bed2d74f7c8717e31f9579214ab52a9c9c610'
27-Oct-2026 20:01:37 Submodule path 'casatools/grpc-source/third_party/benchmark': checked out '5b7683f49e1e9223cf9927b24f6fd3d6bd82e3f8'
27-Oct-2026 20:01:37 Submodule path 'casatools/grpc-source/third_party/bloaty': checked out '73594cde8c9a52a102c4341c244c833aa61b9c06'
27-Oct-2026 20:01:37 Submodule 'third_party/googletest' (https://github.com/google/googletest.git) registered for path 'casatools/grpc-source/third_party/bloaty/third_party/googletest'
27-Oct-2026 20:01:37 Submodule 'third_party/libFuzzer' (https://chromium.googlesource.com/chromium/llvm-project/llvm/lib/Fuzzer) registered for path 'casatools/grpc-source/third_party/bloaty/third_party/libFuzzer'
27-Oct-2026 20:01:37 Submodule 'third_party/re2' (https://github.com/google/re2) registered for path 'casatools/grpc-source/third_party/bloaty/third_party/re2'
27-Oct-2026 20:01:37 Cloning into '/opt/ci_workspace/casa/bamboo/agent5/xml-data/build-dir/CASASPECS-MASTERTESTPY312-TTR9P/casatools/grpc-source/third_party/bloaty/third_party/googletest'...
27-Oct-2026 20:01:38 Cloning into '/opt/ci_workspace/casa/bamboo/agent5/xml-data/build-dir/CASASPECS-MASTERTESTPY312-TTR9P/casatools/grpc-source/third_party/bloaty/third_party/libFuzzer'...
27-Oct-2026 20:01:39 Cloning into '/opt/ci_workspace/casa/bamboo/agent5/xml-data/build-dir/CASASPECS-MASTERTESTPY312-TTR9P/casatools/grpc-source/third_party/bloaty/third_party/re2'...
27-Oct-2026 20:01:39 Submodule path 'casatools/grpc-source/third_party/bloaty/third_party/googletest': checked out 'a2b8a8e07628e5fd60644b6dd99c1b5e7d7f1f47'
27-Oct-2026 20:01:39 Submodule path 'casatools/grpc-source/third_party/bloaty/third_party/libFuzzer': checked out '1b543d6e5073b56be214394890c9193979a3d7e1'
27-Oct-2026 20:01:39 Submodule path 'casatools/grpc-source/third_party/bloaty/third_party/re2': checked out 'c964d9b07816f9b52ca692e23b8b3dba33beec54'
27-Oct-2026 20:01:40 Submodule path 'casatools/grpc-source/third_party/boringssl': checked out 'be2ee342d3781ddb954f91f8a7e660c6f59e87e5'
27-Oct-2026 20:01:40 Submodule path 'casatools/grpc-source/third_party/boringssl-with-bazel': checked out '886e7d75368e3f4fab3f4d0d3584e4abfc557755'
27-Oct-2026 20:01:40 Submodule path 'casatools/grpc-source/third_party/cares/cares': checked out '3be1924221e1326df520f8498d704a5c4c8d0cce'
27-Oct-2026 20:01:40 Submodule path 'casatools/grpc-source/third_party/gflags': checked out '30dbc81fb5ffdc98ea9b14b1918bfe4e8779b26e'
27-Oct-2026 20:01:40 Submodule 'doc' (https://github.com/gflags/gflags.git) registered for path 'casatools/grpc-source/third_party/gflags/doc'
27-Oct-2026 20:01:40 Cloning into '/opt/ci_workspace/casa/bamboo/agent5/xml-data/build-dir/CASASPECS-MASTERTESTPY312-TTR9P/casatools/grpc-source/third_party/gflags/doc'...
27-Oct-2026 20:01:40 Submodule path 'casatools/grpc-source/third_party/gflags/doc': checked out '971dd2a4fadac9cdab174c523c22df79efd63aa5'
27-Oct-2026 20:01:40 Submodule path 'casatools/grpc-source/third_party/googletest': checked out 'ec44c6c1675c25b9827aacd08c02433cccde7780'
27-Oct-2026 20:01:40 Submodule path 'casatools/grpc-source/third_party/protobuf': checked out '2761122b810fe8861004ae785cc3ab39f384d342'
27-Oct-2026 20:01:40 Submodule 'third_party/benchmark' (https://github.com/google/benchmark.git) registered for path 'casatools/grpc-source/third_party/protobuf/third_party/benchmark'
27-Oct-2026 20:01:40 Cloning into '/opt/ci_workspace/casa/bamboo/agent5/xml-data/build-dir/CASASPECS-MASTERTESTPY312-TTR9P/casatools/grpc-source/third_party/protobuf/third_party/benchmark'...
27-Oct-2026 20:01:41 Submodule path 'casatools/grpc-source/third_party/protobuf/third_party/benchmark': checked out '360e66c1c4777c99402cf8cd535aa510fee16573'
27-Oct-2026 20:01:41 Submodule path 'casatools/grpc-source/third_party/zlib': checked out 'cacf7f1d4e3d44d871b605da3b647f07d718623f'
27-Oct-2026 20:01:41 Updated source code to revision: 188b64ce030a360ced17720a68d5af3bbcffaf87
27-Oct-2026 20:01:41 Finished task 'Source Code Checkout' with result: Success
27-Oct-2026 20:01:41 Running pre-build action: Build Log Labeller Pre Build Action
27-Oct-2026 20:01:41 Running pre-build action: VCS Version Collector
27-Oct-2026 20:01:41 Build CASASPECS - Master Test 3.12 - Test Tools Many Linux 2.28 Rocky 9.5 Py3.12 #296 (CASASPECS-MASTERTESTPY312-TTR9P-296) started building on agent 'casaci-4.cv.nrao.edu' (Remote agent on host casaci-4.cv.nrao.edu)
27-Oct-2026 20:01:41 Starting task 'Update data' of type 'com.atlassian.bamboo.plugins.scripttask:task.builder.script'
27-Oct-2026 20:01:41
Beginning to execute external process for build 'CASASPECS - Master Test 3.12 - Test Tools Many Linux 2.28 Rocky 9.5 Py3.12 #296 (CASASPECS-MASTERTESTPY312-TTR9P-296)'
... running command line:
/opt/ci_workspace/casa/bamboo/agent5/temp/CASASPECS-MASTERTESTPY312-TTR9P-296-ScriptBuildTask-16584200293035689083.sh
... in: /opt/ci_workspace/casa/bamboo/agent5/xml-data/build-dir/CASASPECS-MASTERTESTPY312-TTR9P
27-Oct-2026 20:01:41 Already up to date.
27-Oct-2026 20:01:41 Already up to date.
27-Oct-2026 20:01:41 Data update complete
27-Oct-2026 20:01:41 Finished task 'Update data' with result: Success
27-Oct-2026 20:01:41
Substituting variable: ${bamboo.repository.branch.name} with master
27-Oct-2026 20:01:41 Starting task 'Create wheeldirectory' of type 'com.atlassian.bamboo.plugins.scripttask:task.builder.script'
27-Oct-2026 20:01:41
Beginning to execute external process for build 'CASASPECS - Master Test 3.12 - Test Tools Many Linux 2.28 Rocky 9.5 Py3.12 #296 (CASASPECS-MASTERTESTPY312-TTR9P-296)'
... running command line:
/opt/ci_workspace/casa/bamboo/agent5/temp/CASASPECS-MASTERTESTPY312-TTR9P-296-ScriptBuildTask-6418788605885975768.sh
... in: /opt/ci_workspace/casa/bamboo/agent5/xml-data/build-dir/CASASPECS-MASTERTESTPY312-TTR9P
27-Oct-2026 20:01:41 Finished task 'Create wheeldirectory' with result: Success
27-Oct-2026 20:01:41 Starting task 'Get latest wheel' of type 'com.atlassian.bamboo.plugins.bamboo-artifact-downloader-plugin:artifactdownloadertask'
27-Oct-2026 20:01:41 Preparing to download plan result CASASPECS-MASTERBUILDCASALITH-304 artifact: Required shared artifact Http Compression On : [ManyLinux228 Python 3.12 Casatestutils], patterns: [casatestutils*.whl] anchored at: [source/wheels]
27-Oct-2026 20:01:41 Retrieving artifact ManyLinux228 Python 3.12 Casatestutils for CASASPECS-MASTERBUILDCASALITH-304 using Bamboo server artifact handler
27-Oct-2026 20:01:41 Artifact [ManyLinux228 Python 3.12 Casatestutils] downloaded successfully in 34.95 ms to wheeldirectory/
27-Oct-2026 20:01:41 Preparing to download plan result CASASPECS-MASTERBUILDCASALITH-304 artifact: Required shared artifact Http Compression On : [ManyLinux228 Python 3.12 Tool wheel], patterns: [casatools*.whl] anchored at: [source/wheels]
27-Oct-2026 20:01:41 Retrieving artifact ManyLinux228 Python 3.12 Tool wheel for CASASPECS-MASTERBUILDCASALITH-304 using Bamboo server artifact handler
27-Oct-2026 20:01:47 Artifact [ManyLinux228 Python 3.12 Tool wheel] downloaded successfully in 6.098 s to wheeldirectory/
27-Oct-2026 20:01:47 Finished task 'Get latest wheel' with result: Success
27-Oct-2026 20:01:47
Substituting variable: ${bamboo.agentId} with 153550853
27-Oct-2026 20:01:47
Substituting variable: ${bamboo.agentId} with 153550853
27-Oct-2026 20:01:47 Starting task 'Stop and remove running wheel-container-test' of type 'com.atlassian.bamboo.plugins.scripttask:task.builder.script'
27-Oct-2026 20:01:47
Beginning to execute external process for build 'CASASPECS - Master Test 3.12 - Test Tools Many Linux 2.28 Rocky 9.5 Py3.12 #296 (CASASPECS-MASTERTESTPY312-TTR9P-296)'
... running command line:
/opt/ci_workspace/casa/bamboo/agent5/temp/CASASPECS-MASTERTESTPY312-TTR9P-296-ScriptBuildTask-7804901528517325639.sh
... in: /opt/ci_workspace/casa/bamboo/agent5/xml-data/build-dir/CASASPECS-MASTERTESTPY312-TTR9P
27-Oct-2026 20:01:47 Error response from daemon: No such container: wheel-container-test-153550853
27-Oct-2026 20:01:47 Error response from daemon: No such container: wheel-container-test-153550853
27-Oct-2026 20:01:47 Removed wheel-container-test
27-Oct-2026 20:01:47 Finished task 'Stop and remove running wheel-container-test' with result: Success
27-Oct-2026 20:01:47
Substituting variable: ${bamboo.rocky9_docker_image} with casa-docker.nrao.edu:5000/casa-test-rocky-9.5:1
27-Oct-2026 20:01:47
Substituting variable: ${bamboo.working.directory} with /opt/ci_workspace/casa/bamboo/agent5/xml-data/build-dir/CASASPECS-MASTERTESTPY312-TTR9P
27-Oct-2026 20:01:47
Substituting variable: ${bamboo.agentId} with 153550853
27-Oct-2026 20:01:47 Starting task 'Start container' of type 'com.atlassian.bamboo.plugins.bamboo-docker-plugin:task.docker.cli'
27-Oct-2026 20:01:47 Running image name (casa-docker.nrao.edu:5000/casa-test-rocky-9.5:1)
27-Oct-2026 20:01:47
Beginning to execute external process for build 'CASASPECS - Master Test 3.12 - Test Tools Many Linux 2.28 Rocky 9.5 Py3.12 #296 (CASASPECS-MASTERTESTPY312-TTR9P-296)'
... running command line:
/usr/bin/docker run --volume /opt/ci_workspace/casa/bamboo/agent5/xml-data/build-dir/CASASPECS-MASTERTESTPY312-TTR9P/wheeldirectory:/wheeldirectory --volume /opt/casa/data:/opt/casa/data --detach --name wheel-container-test-153550853 casa-docker.nrao.edu:5000/casa-test-rocky-9.5:1 tail -f /dev/null
... in: /opt/ci_workspace/casa/bamboo/agent5/xml-data/build-dir/CASASPECS-MASTERTESTPY312-TTR9P
27-Oct-2026 20:01:51 4a16360f007122704fa22f6c1fe7d766c0565a373b7149ac2a0fd5677081e517
27-Oct-2026 20:01:52 Finished task 'Start container' with result: Success
27-Oct-2026 20:01:52
Substituting variable: ${bamboo.agentId} with 153550853
27-Oct-2026 20:01:52
Substituting variable: ${bamboo.planRepository.branchName} with master
27-Oct-2026 20:01:52
Substituting variable: ${bamboo.python_version} with 3.12
27-Oct-2026 20:01:52 Starting task 'Test wheel' of type 'com.atlassian.bamboo.plugins.scripttask:task.builder.script'
27-Oct-2026 20:01:52
Beginning to execute external process for build 'CASASPECS - Master Test 3.12 - Test Tools Many Linux 2.28 Rocky 9.5 Py3.12 #296 (CASASPECS-MASTERTESTPY312-TTR9P-296)'
... running command line:
/opt/ci_workspace/casa/bamboo/agent5/temp/CASASPECS-MASTERTESTPY312-TTR9P-296-ScriptBuildTask-3976699725754444234.sh
... in: /opt/ci_workspace/casa/bamboo/agent5/xml-data/build-dir/CASASPECS-MASTERTESTPY312-TTR9P
27-Oct-2026 20:01:52 branch: master
27-Oct-2026 20:01:52 Python version: 3.12
27-Oct-2026 20:01:52   % Total    % Received % Xferd  Average Speed   Time    Time     Time  Current
27-Oct-2026 20:01:52                                  Dload  Upload   Total   Spent    Left  Speed
27-Oct-2026 20:01:52
27-Oct-2026 20:01:52   0     0    0     0    0     0      0      0 --:--:-- --:--:-- --:--:--     0
27-Oct-2026 20:01:52 100 6002k  100 6002k    0     0  58.0M      0 --:--:-- --:--:-- --:--:-- 58.0M
27-Oct-2026 20:01:52 bamboo_jira_components:''
27-Oct-2026 20:01:52 bamboo_testlist:''
27-Oct-2026 20:01:52 Ticket components:
27-Oct-2026 20:01:52 datapath=[ "/opt/casa/data/master", "/opt/casa/data/casatestdata" ]
27-Oct-2026 20:01:52 measurespath="/opt/casa/data/master"
27-Oct-2026 20:01:52 measures_auto_update=False
27-Oct-2026 20:01:52 data_auto_update=False
27-Oct-2026 20:01:52 [467666] Failed to execute script 'atlutil' due to unhandled exception!
27-Oct-2026 20:01:52 Traceback (most recent call last):
27-Oct-2026 20:01:52   File "atlutil.py", line 200, in <module>
27-Oct-2026 20:01:52   File "atlutil.py", line 165, in has_fix_version
27-Oct-2026 20:01:52 KeyError: 'fields'
27-Oct-2026 20:01:52 datapath=[ "/opt/casa/data/master", "/opt/casa/data/casatestdata" ]
27-Oct-2026 20:01:52 measurespath="/opt/casa/data/master"
27-Oct-2026 20:01:52 measures_auto_update=False
27-Oct-2026 20:01:52 data_auto_update=False
27-Oct-2026 20:01:54 Requirement already satisfied: pip in /home/casatest/venv/lib/python3.12/site-packages (24.3.1)
27-Oct-2026 20:01:55 Collecting pip
27-Oct-2026 20:01:55   Downloading pip-26.2.2-py3-none-any.whl.metadata (4.6 kB)
27-Oct-2026 20:01:55 Collecting numpy
27-Oct-2026 20:01:55   Downloading numpy-2.5.4-cp312-cp312-manylinux_2_27_x86_64.manylinux_2_28_x86_64.whl.metadata (6.6 kB)
27-Oct-2026 20:01:55 Downloading pip-26.2.2-py3-none-any.whl (1.8 MB)
27-Oct-2026 20:01:55    ━━━━━━━━━━━━━━━━━━━━━━━━━━━━━━━━━━━━━━━━ 1.8/1.8 MB 31.7 MB/s eta 0:00:00
27-Oct-2026 20:01:55 Downloading numpy-2.5.4-cp312-cp312-manylinux_2_27_x86_64.manylinux_2_28_x86_64.whl (16.7 MB)
27-Oct-2026 20:01:55    ━━━━━━━━━━━━━━━━━━━━━━━━━━━━━━━━━━━━━━━━ 16.7/16.7 MB 205.3 MB/s eta 0:00:00
27-Oct-2026 20:01:55 Installing collected packages: pip, numpy
27-Oct-2026 20:01:55   Attempting uninstall: pip
27-Oct-2026 20:01:55     Found existing installation: pip 24.3.1
27-Oct-2026 20:01:55     Uninstalling pip-24.3.1:
27-Oct-2026 20:01:55       Successfully uninstalled pip-24.3.1
27-Oct-2026 20:01:58 Successfully installed numpy-2.5.4 pip-26.2.2
27-Oct-2026 20:01:58 Processing ./casatestutils-6.8.0.2-py3-none-any.whl
27-Oct-2026 20:01:58 Collecting pytest>=6.0 (from casatestutils==6.8.0.2)
27-Oct-2026 20:01:58   Downloading pytest-9.2.0-py3-none-any.whl.metadata (7.9 kB)
27-Oct-2026 20:01:58 Collecting astropy (from casatestutils==6.8.0.2)
27-Oct-2026 20:01:58   Downloading astropy-8.0.2-cp311-abi3-manylinux2014_x86_64.manylinux_2_17_x86_64.manylinux_2_28_x86_64.whl.metadata (11 kB)
27-Oct-2026 20:01:58 Collecting iniconfig>=2 (from pytest>=6.0->casatestutils==6.8.0.2)
27-Oct-2026 20:01:58   Downloading iniconfig-2.3.1-py3-none-any.whl.metadata (2.8 kB)
27-Oct-2026 20:01:58 Collecting packaging>=24 (from pytest>=6.0->casatestutils==6.8.0.2)
27-Oct-2026 20:01:58   Downloading packaging-26.3-py3-none-any.whl.metadata (3.5 kB)
27-Oct-2026 20:01:58 Collecting pluggy<2,>=1.6 (from pytest>=6.0->casatestutils==6.8.0.2)
27-Oct-2026 20:01:58   Downloading pluggy-1.7.0-py3-none-any.whl.metadata (5.0 kB)
27-Oct-2026 20:01:59 Collecting pygments>=2.15 (from pytest>=6.0->casatestutils==6.8.0.2)
27-Oct-2026 20:01:59   Downloading pygments-2.21.0-py3-none-any.whl.metadata (2.5 kB)
27-Oct-2026 20:01:59 Collecting astropy-iers-data>=0.2026.9.28.0.59.37 (from astropy->casatestutils==6.8.0.2)
27-Oct-2026 20:01:59   Downloading astropy_iers_data-0.2026.10.19.0.52.1-py3-none-any.whl.metadata (3.4 kB)
27-Oct-2026 20:01:59 Requirement already satisfied: numpy>=2.0 in /home/casatest/venv/lib/python3.12/site-packages (from astropy->casatestutils==6.8.0.2) (2.5.4)
27-Oct-2026 20:01:59 Collecting pyerfa>=2.0.1.3 (from astropy->casatestutils==6.8.0.2)
27-Oct-2026 20:01:59   Downloading pyerfa-2.0.1.5-cp39-abi3-manylinux_2_17_x86_64.manylinux2014_x86_64.whl.metadata (5.7 kB)
27-Oct-2026 20:01:59 Collecting PyYAML>=6.0.0 (from astropy->casatestutils==6.8.0.2)
27-Oct-2026 20:01:59   Downloading pyyaml-6.0.3-cp312-cp312-manylinux2014_x86_64.manylinux_2_17_x86_64.manylinux_2_28_x86_64.whl.metadata (2.4 kB)
27-Oct-2026 20:01:59 Downloading pytest-9.2.0-py3-none-any.whl (411 kB)
27-Oct-2026 20:01:59 Downloading pluggy-1.7.0-py3-none-any.whl (27 kB)
27-Oct-2026 20:01:59 Downloading iniconfig-2.3.1-py3-none-any.whl (7.6 kB)
27-Oct-2026 20:01:59 Downloading packaging-26.3-py3-none-any.whl (129 kB)
27-Oct-2026 20:01:59 Downloading pygments-2.21.0-py3-none-any.whl (1.3 MB)
27-Oct-2026 20:01:59    ━━━━━━━━━━━━━━━━━━━━━━━━━━━━━━━━━━━━━━━━ 1.3/1.3 MB 30.1 MB/s  0:00:00
27-Oct-2026 20:01:59 Downloading astropy-8.0.2-cp311-abi3-manylinux2014_x86_64.manylinux_2_17_x86_64.manylinux_2_28_x86_64.whl (10.4 MB)
27-Oct-2026 20:01:59    ━━━━━━━━━━━━━━━━━━━━━━━━━━━━━━━━━━━━━━━━ 10.4/10.4 MB 130.8 MB/s  0:00:00
27-Oct-2026 20:01:59 Downloading astropy_iers_data-0.2026.10.19.0.52.1-py3-none-any.whl (2.0 MB)
27-Oct-2026 20:01:59    ━━━━━━━━━━━━━━━━━━━━━━━━━━━━━━━━━━━━━━━━ 2.0/2.0 MB 36.6 MB/s  0:00:00
27-Oct-2026 20:01:59 Downloading pyerfa-2.0.1.5-cp39-abi3-manylinux_2_17_x86_64.manylinux2014_x86_64.whl (738 kB)
27-Oct-2026 20:01:59    ━━━━━━━━━━━━━━━━━━━━━━━━━━━━━━━━━━━━━━━━ 738.7/738.7 kB 86.0 MB/s  0:00:00
27-Oct-2026 20:01:59 Downloading pyyaml-6.0.3-cp312-cp312-manylinux2014_x86_64.manylinux_2_17_x86_64.manylinux_2_28_x86_64.whl (807 kB)
27-Oct-2026 20:01:59    ━━━━━━━━━━━━━━━━━━━━━━━━━━━━━━━━━━━━━━━━ 807.9/807.9 kB 79.3 MB/s  0:00:00
27-Oct-2026 20:01:59 Installing collected packages: PyYAML, pygments, pyerfa, pluggy, packaging, iniconfig, astropy-iers-data, pytest, astropy, casatestutils
27-Oct-2026 20:02:02
27-Oct-2026 20:02:02 Successfully installed PyYAML-6.0.3 astropy-8.0.2 astropy-iers-data-0.2026.10.19.0.52.1 casatestutils-6.8.0.2 iniconfig-2.3.1 packaging-26.3 pluggy-1.7.0 pyerfa-2.0.1.5 pygments-2.21.0 pytest-9.2.0
27-Oct-2026 20:02:03 Processing ./casatools-6.8.0.2-cp312-cp312-manylinux_2_28_x86_64.whl
27-Oct-2026 20:02:03 Requirement already satisfied: numpy in /home/casatest/venv/lib/python3.12/site-packages (from casatools==6.8.0.2) (2.5.4)
27-Oct-2026 20:02:03 Collecting casaconfig (from casatools==6.8.0.2)
27-Oct-2026 20:02:03   Downloading casaconfig-1.5.2-py3-none-any.whl.metadata (4.0 kB)
27-Oct-2026 20:02:03 Collecting certifi>=2023.5.7 (from casaconfig->casatools==6.8.0.2)
27-Oct-2026 20:02:03   Downloading certifi-2026.10.23-py3-none-any.whl.metadata (2.5 kB)
27-Oct-2026 20:02:03 Downloading casaconfig-1.5.2-py3-none-any.whl (77 kB)
27-Oct-2026 20:02:03 Downloading certifi-2026.10.23-py3-none-any.whl (135 kB)
27-Oct-2026 20:02:03 Installing collected packages: certifi, casaconfig, casatools
27-Oct-2026 20:02:04
27-Oct-2026 20:02:04 Successfully installed casaconfig-1.5.2 casatools-6.8.0.2 certifi-2026.10.23
27-Oct-2026 20:03:20 Already on 'master'build        27-Oct-2026 20:03:20        Your branch is up to date with 'origin/master'.
31-Dec-1969 19:00:00
27-Oct-2026 20:03:20   % Total    % Received % Xferd  Average Speed   Time    Time     Time  Current
27-Oct-2026 20:03:20                                  Dload  Upload   Total   Spent    Left  Speed
27-Oct-2026 20:03:20
27-Oct-2026 20:03:20   0     0    0     0    0     0      0      0 --:--:-- --:--:-- --:--:--     0
27-Oct-2026 20:03:20 100   669    0   669    0     0  44600      0 --:--:-- --:--:-- --:--:-- 44600
27-Oct-2026 20:03:29 ============================= test session starts ==============================
27-Oct-2026 20:03:29 platform linux -- Python 3.12.9, pytest-9.2.0, pluggy-1.7.0 -- /home/casatest/venv/bin/python3.12
27-Oct-2026 20:03:29 cachedir: .pytest_cache
27-Oct-2026 20:03:29 rootdir: /home/casatest/casa6/casatestutils/nosedir/test_tool_msuvbinner
27-Oct-2026 20:03:29 configfile: pytest.ini
27-Oct-2026 20:03:29 collecting ... collected 1 item
27-Oct-2026 20:03:29 INTERNALERROR> Traceback (most recent call last):
27-Oct-2026 20:03:29 INTERNALERROR>   File "/home/casatest/venv/lib/python3.12/site-packages/_pytest/main.py", line 333, in wrap_session
27-Oct-2026 20:03:29 INTERNALERROR>     session.exitstatus = doit(config, session) or 0
27-Oct-2026 20:03:29 INTERNALERROR>                          ^^^^^^^^^^^^^^^^^^^^^
27-Oct-2026 20:03:29 INTERNALERROR>   File "/home/casatest/venv/lib/python3.12/site-packages/_pytest/main.py", line 387, in _main
27-Oct-2026 20:03:29 INTERNALERROR>     config.hook.pytest_runtestloop(session=session)
27-Oct-2026 20:03:29 INTERNALERROR>   File "/home/casatest/venv/lib/python3.12/site-packages/pluggy/_caller.py", line 197, in __call__
27-Oct-2026 20:03:29 INTERNALERROR>     return self._hookexec(
27-Oct-2026 20:03:29 INTERNALERROR>            ^^^^^^^^^^^^^^^
27-Oct-2026 20:03:29 INTERNALERROR>   File "/home/casatest/venv/lib/python3.12/site-packages/pluggy/_manager.py", line 183, in _hookexec
27-Oct-2026 20:03:29 INTERNALERROR>     return self._inner_hookexec(hook_name, methods, kwargs, firstresult)
27-Oct-2026 20:03:29 INTERNALERROR>            ^^^^^^^^^^^^^^^^^^^^^^^^^^^^^^^^^^^^^^^^^^^^^^^^^^^^^^^^^^^^^
27-Oct-2026 20:03:29 INTERNALERROR>   File "/home/casatest/venv/lib/python3.12/site-packages/pluggy/_execution.py", line 195, in _multicall
27-Oct-2026 20:03:29 INTERNALERROR>     raise exception
27-Oct-2026 20:03:29 INTERNALERROR>   File "/home/casatest/venv/lib/python3.12/site-packages/pluggy/_execution.py", line 167, in _multicall
27-Oct-2026 20:03:29 INTERNALERROR>     teardown.throw(exception)
27-Oct-2026 20:03:29 INTERNALERROR>   File "/home/casatest/venv/lib/python3.12/site-packages/_pytest/logging.py", line 829, in pytest_runtestloop
27-Oct-2026 20:03:29 INTERNALERROR>     return (yield)  # Run all the tests.
27-Oct-2026 20:03:29 INTERNALERROR>             ^^^^^
27-Oct-2026 20:03:29 INTERNALERROR>   File "/home/casatest/venv/lib/python3.12/site-packages/pluggy/_execution.py", line 167, in _multicall
27-Oct-2026 20:03:29 INTERNALERROR>     teardown.throw(exception)
27-Oct-2026 20:03:29 INTERNALERROR>   File "/home/casatest/venv/lib/python3.12/site-packages/_pytest/terminal.py", line 723, in pytest_runtestloop
27-Oct-2026 20:03:29 INTERNALERROR>     result = yield
27-Oct-2026 20:03:29 INTERNALERROR>              ^^^^^
27-Oct-2026 20:03:29 INTERNALERROR>   File "/home/casatest/venv/lib/python3.12/site-packages/pluggy/_execution.py", line 147, in _multicall
27-Oct-2026 20:03:29 INTERNALERROR>     res = hook_impl.function(*args)
27-Oct-2026 20:03:29 INTERNALERROR>           ^^^^^^^^^^^^^^^^^^^^^^^^^
27-Oct-2026 20:03:29 INTERNALERROR>   File "/home/casatest/venv/lib/python3.12/site-packages/_pytest/main.py", line 411, in pytest_runtestloop
27-Oct-2026 20:03:29 INTERNALERROR>     item.config.hook.pytest_runtest_protocol(item=item, nextitem=nextitem)
27-Oct-2026 20:03:29 INTERNALERROR>   File "/home/casatest/venv/lib/python3.12/site-packages/pluggy/_caller.py", line 197, in __call__
27-Oct-2026 20:03:29 INTERNALERROR>     return self._hookexec(
27-Oct-2026 20:03:29 INTERNALERROR>            ^^^^^^^^^^^^^^^
27-Oct-2026 20:03:29 INTERNALERROR>   File "/home/casatest/venv/lib/python3.12/site-packages/pluggy/_manager.py", line 183, in _hookexec
27-Oct-2026 20:03:29 INTERNALERROR>     return self._inner_hookexec(hook_name, methods, kwargs, firstresult)
27-Oct-2026 20:03:29 INTERNALERROR>            ^^^^^^^^^^^^^^^^^^^^^^^^^^^^^^^^^^^^^^^^^^^^^^^^^^^^^^^^^^^^^
27-Oct-2026 20:03:29 INTERNALERROR>   File "/home/casatest/venv/lib/python3.12/site-packages/pluggy/_execution.py", line 195, in _multicall
27-Oct-2026 20:03:29 INTERNALERROR>     raise exception
27-Oct-2026 20:03:29 INTERNALERROR>   File "/home/casatest/venv/lib/python3.12/site-packages/pluggy/_execution.py", line 167, in _multicall
27-Oct-2026 20:03:29 INTERNALERROR>     teardown.throw(exception)
27-Oct-2026 20:03:29 INTERNALERROR>   File "/home/casatest/venv/lib/python3.12/site-packages/_pytest/warnings.py", line 75, in pytest_runtest_protocol
27-Oct-2026 20:03:29 INTERNALERROR>     return (yield)
27-Oct-2026 20:03:29 INTERNALERROR>             ^^^^^
27-Oct-2026 20:03:29 INTERNALERROR>   File "/home/casatest/venv/lib/python3.12/site-packages/pluggy/_execution.py", line 167, in _multicall
27-Oct-2026 20:03:29 INTERNALERROR>     teardown.throw(exception)
27-Oct-2026 20:03:29 INTERNALERROR>   File "/home/casatest/venv/lib/python3.12/site-packages/_pytest/assertion/__init__.py", line 212, in pytest_runtest_protocol
27-Oct-2026 20:03:29 INTERNALERROR>     return (yield)
27-Oct-2026 20:03:29 INTERNALERROR>             ^^^^^
27-Oct-2026 20:03:29 INTERNALERROR>   File "/home/casatest/venv/lib/python3.12/site-packages/pluggy/_execution.py", line 167, in _multicall
27-Oct-2026 20:03:29 INTERNALERROR>     teardown.throw(exception)
27-Oct-2026 20:03:29 INTERNALERROR>   File "/home/casatest/venv/lib/python3.12/site-packages/_pytest/unittest.py", line 610, in pytest_runtest_protocol
27-Oct-2026 20:03:29 INTERNALERROR>     return (yield)
27-Oct-2026 20:03:29 INTERNALERROR>             ^^^^^
27-Oct-2026 20:03:29 INTERNALERROR>   File "/home/casatest/venv/lib/python3.12/site-packages/pluggy/_execution.py", line 167, in _multicall
27-Oct-2026 20:03:29 INTERNALERROR>     teardown.throw(exception)
27-Oct-2026 20:03:29 INTERNALERROR>   File "/home/casatest/venv/lib/python3.12/site-packages/_pytest/faulthandler.py", line 102, in pytest_runtest_protocol
27-Oct-2026 20:03:29 INTERNALERROR>     return (yield)
27-Oct-2026 20:03:29 INTERNALERROR>             ^^^^^
27-Oct-2026 20:03:29 INTERNALERROR>   File "/home/casatest/venv/lib/python3.12/site-packages/pluggy/_execution.py", line 147, in _multicall
27-Oct-2026 20:03:29 INTERNALERROR>     res = hook_impl.function(*args)
27-Oct-2026 20:03:29 INTERNALERROR>           ^^^^^^^^^^^^^^^^^^^^^^^^^
27-Oct-2026 20:03:29 INTERNALERROR>   File "/home/casatest/casa6/casatestutils/nosedir/test_tool_msuvbinner/conftest.py", line 24, in pytest_runtest_protocol
27-Oct-2026 20:03:29 INTERNALERROR>     self.funcn = item._nodeid
27-Oct-2026 20:03:29 INTERNALERROR>                  ^^^^^^^^^^^^
27-Oct-2026 20:03:29 INTERNALERROR> AttributeError: 'TestCaseFunction' object has no attribute '_nodeid'. Did you mean: 'nodeid'?
27-Oct-2026 20:03:29
27-Oct-2026 20:03:29 ============================== 1 warning in 0.28s ==============================
27-Oct-2026 20:03:29 Traceback (most recent call last):
27-Oct-2026 20:03:29   File "/home/casatest/casa6/casatestutils/runtest.py", line 1526, in <module>
27-Oct-2026 20:03:29     run(
27-Oct-2026 20:03:29   File "/home/casatest/casa6/casatestutils/runtest.py", line 1135, in run
27-Oct-2026 20:03:29     setup_and_run(cmd, workdir, workpath, dirname, DRY_RUN , pytest_args)
27-Oct-2026 20:03:29   File "/home/casatest/casa6/casatestutils/runtest.py", line 1016, in setup_and_run
27-Oct-2026 20:03:29     update_xml(xmlfile, result, name=os.getcwd().split("/")[-1])
27-Oct-2026 20:03:29   File "/home/casatest/casa6/casatestutils/runtest.py", line 581, in update_xml
27-Oct-2026 20:03:29     testclass = element.attrib["classname"].split(".")[1]
27-Oct-2026 20:03:29                 ~~~~~~~~~~~~~~~~~~~~~~~~~~~~~~~~~~~~~~^^^
27-Oct-2026 20:03:29 IndexError: list index out of range
27-Oct-2026 20:03:29 Namespace(list=False, verbose=False, dry_run=False, classes=None, file=None, mapfile=<_io.TextIOWrapper name='/home/casatest/casa6/casatestutils/casatestutils/component_to_test_map.json' mode='r' encoding='utf-8'>, branch='master', merge_target=None, pkg=None, work_dir=None, ncores=2, test_paths=None, test_list=None, test_config=None, test_group='casatools', pmode=None, bamboo=False, cachedir=None, ignore_list=None, run_skipped=False, only_skipped=False)
27-Oct-2026 20:03:29
27-Oct-2026 20:03:29 Operating system: Linux
27-Oct-2026 20:03:29
27-Oct-2026 20:03:29 Testing Components['casatools']
27-Oct-2026 20:03:29
27-Oct-2026 20:03:29 Arguments Sent Direct To Pytest :  []
27-Oct-2026 20:03:29 Running 33 Test(s)
27-Oct-2026 20:03:29 Cleaning: /home/casatest/casa6/casatestutils/nosedir/
27-Oct-2026 20:03:29 Tests: ['test_tool_agentflagger', 'test_tool_calanalysis', 'test_tool_calibrater', 'test_tool_componentlist', 'test_tool_coordsys', 'test_tool_image', 'test_tool_image_collapse', 'test_tool_image_deviation', 'test_tool_image_fitprofile', 'test_tool_image_pbcor', 'test_tool_image_pv', 'test_tool_image_rebin', 'test_tool_image_regrid', 'test_tool_image_statistics', 'test_tool_image_subimage', 'test_tool_image_transpose', 'test_tool_imagepol', 'test_tool_linearmosaic', 'test_tool_logsink', 'test_tool_measures', 'test_tool_ms', 'test_tool_ms_createmultims', 'test_tool_ms_statwt', 'test_tool_msmetadata', 'test_tool_msuvbinner', 'test_tool_quanta', 'test_tool_regionmanager', 'test_tool_sdm', 'test_tool_sdm_toms', 'test_tool_simulator', 'test_tool_synthesisutils', 'test_tool_table', 'test_tool_vpmanager']
27-Oct-2026 20:03:29 Fetching Repository: casa6
27-Oct-2026 20:03:29         Running:  git clone https://open-bitbucket.nrao.edu/scm/casa/casa6
27-Oct-2026 20:03:29         Running:  git checkout origin/master
27-Oct-2026 20:03:29
27-Oct-2026 20:03:29 Fetching Repository: casampi
27-Oct-2026 20:03:29         Running:  git clone https://open-bitbucket.nrao.edu/scm/casa/casampi
27-Oct-2026 20:03:29         Tag: tags/0.6.0
27-Oct-2026 20:03:29         Running:  git checkout tags/0.6.0
27-Oct-2026 20:03:29
27-Oct-2026 20:03:29 Fetching Repository: casaplotms
27-Oct-2026 20:03:29         Running:  git clone https://open-bitbucket.nrao.edu/scm/casa/casaplotms
27-Oct-2026 20:03:29         Tag: tags/3.0.3
27-Oct-2026 20:03:29         Running:  git checkout tags/3.0.3
27-Oct-2026 20:03:29
27-Oct-2026 20:03:29 Fetching Repository: casaviewer
27-Oct-2026 20:03:29         Running:  git clone https://open-bitbucket.nrao.edu/scm/casa/casaviewer
27-Oct-2026 20:03:29         Tag: tags/2.5.1
27-Oct-2026 20:03:29         Running:  git checkout tags/2.5.1
27-Oct-2026 20:03:29 Directory Of Tests:  /home/casatest/casa6/casatestutils/nosedir/tests/
27-Oct-2026 20:03:29
27-Oct-2026 20:03:29 Setting Working Directory: /home/casatest/casa6/casatestutils/nosedir/test_tool_msuvbinner/
27-Oct-2026 20:03:29 Test Directory: /home/casatest/casa6/casatestutils/nosedir/test_tool_msuvbinner
27-Oct-2026 20:03:29
27-Oct-2026 20:03:29 Running Command: pytest --junitxml=/home/casatest/casa6/casatestutils/nosedir/xml/test_tool_msuvbinner/nose.xml -s --disable-pytest-warnings --verbose -ra --tb=short /home/casatest/casa6/casatestutils/nosedir/test_tool_msuvbinner/
27-Oct-2026 20:03:30 total 77668
27-Oct-2026 20:03:30 -rw-r--r-- 1 casaci 15001   161031 Oct 28 00:01 casatestutils-6.8.0.2-py3-none-any.whl
27-Oct-2026 20:03:30 -rw-r--r-- 1 casaci 15001 79357138 Oct 28 00:01 casatools-6.8.0.2-cp312-cp312-manylinux_2_28_x86_64.whl
27-Oct-2026 20:03:30 -rw-r--r-- 1 casaci root      4358 Oct 28 00:03 test_tool_msuvbinner.xml
27-Oct-2026 20:03:30 Finished task 'Test wheel' with result: Success
27-Oct-2026 20:03:30
Substituting variable: ${bamboo.planRepository.branchName} with master
27-Oct-2026 20:03:30
Substituting variable: ${bamboo.python_version} with 3.12
27-Oct-2026 20:03:30
Substituting variable: ${bamboo.agentId} with 153550853
27-Oct-2026 20:03:30
Substituting variable: ${bamboo.agentId} with 153550853
27-Oct-2026 20:03:30
Substituting variable: ${bamboo.agentId} with 153550853
27-Oct-2026 20:03:30
Substituting variable: ${bamboo.agentId} with 153550853
27-Oct-2026 20:03:30 Starting task 'Tar work directory' of type 'com.atlassian.bamboo.plugins.scripttask:task.builder.script'
27-Oct-2026 20:03:30
Beginning to execute external process for build 'CASASPECS - Master Test 3.12 - Test Tools Many Linux 2.28 Rocky 9.5 Py3.12 #296 (CASASPECS-MASTERTESTPY312-TTR9P-296)'
... running command line:
/opt/ci_workspace/casa/bamboo/agent5/temp/CASASPECS-MASTERTESTPY312-TTR9P-296-ScriptBuildTask-2414695170438225932.sh
... in: /opt/ci_workspace/casa/bamboo/agent5/xml-data/build-dir/CASASPECS-MASTERTESTPY312-TTR9P
27-Oct-2026 20:03:30 Package working directory
27-Oct-2026 20:03:30 nosedir/
27-Oct-2026 20:03:30 nosedir/test_tool_msuvbinner/
27-Oct-2026 20:03:30 nosedir/test_tool_msuvbinner/test_tool_msuvbinner.py
27-Oct-2026 20:03:30 nosedir/test_tool_msuvbinner/pytest.ini
27-Oct-2026 20:03:30 nosedir/test_tool_msuvbinner/conftest.py
27-Oct-2026 20:03:30 nosedir/test_tool_msuvbinner/casa-20261028-000329.log
27-Oct-2026 20:03:30 nosedir/xml/
27-Oct-2026 20:03:30 nosedir/xml/test_tool_msuvbinner/
27-Oct-2026 20:03:30 nosedir/xml/test_tool_msuvbinner/nose.xml
27-Oct-2026 20:03:30 total 77672
27-Oct-2026 20:03:30 -rw-r--r-- 1 casaci 15001   161031 Oct 28 00:01 casatestutils-6.8.0.2-py3-none-any.whl
27-Oct-2026 20:03:30 -rw-r--r-- 1 casaci 15001 79357138 Oct 28 00:01 casatools-6.8.0.2-cp312-cp312-manylinux_2_28_x86_64.whl
27-Oct-2026 20:03:30 -rw-r--r-- 1 casaci root      4358 Oct 28 00:03 test_tool_msuvbinner.xml
27-Oct-2026 20:03:30 -rw-r--r-- 1 casaci root      3121 Oct 28 00:03 work-rocky9_casatools-3.12.tar.gz
27-Oct-2026 20:03:30 Done packaging working directory
27-Oct-2026 20:03:30 Finished task 'Tar work directory' with result: Success
27-Oct-2026 20:03:30 Starting task 'Parse tests' of type 'com.atlassian.bamboo.plugins.testresultparser:task.testresultparser.junit'
27-Oct-2026 20:03:30 Parsing test results under /opt/ci_workspace/casa/bamboo/agent5/xml-data/build-dir/CASASPECS-MASTERTESTPY312-TTR9P...
27-Oct-2026 20:03:30 Failing task since 1 failing test cases were found.
27-Oct-2026 20:03:30 Finished task 'Parse tests' with result: Failed
27-Oct-2026 20:03:30 Running post build plugin 'Docker Container Cleanup'
27-Oct-2026 20:03:30
Beginning to execute external process for build 'CASASPECS - Master Test 3.12 - Test Tools Many Linux 2.28 Rocky 9.5 Py3.12 #296 (CASASPECS-MASTERTESTPY312-TTR9P-296)'
... running command line:
/usr/bin/docker rm -f wheel-container-test-153550853
... in: /opt/ci_workspace/casa/bamboo/agent5/xml-data/build-dir/CASASPECS-MASTERTESTPY312-TTR9P
27-Oct-2026 20:03:36 wheel-container-test-153550853
27-Oct-2026 20:03:36 Running post build plugin 'NCover Results Collector'
27-Oct-2026 20:03:36 Running post build plugin 'Build Results Label Collector'
27-Oct-2026 20:03:36 Running post build plugin 'Clover Results Collector'
27-Oct-2026 20:03:36 Running post build plugin 'npm Cache Cleanup'
27-Oct-2026 20:03:36 Running post build plugin 'Artifact Copier'
27-Oct-2026 20:03:36 Publishing an artifact: Workdir
27-Oct-2026 20:03:36 Finished publishing of artifact Non required job artifact Http Compression On : [Workdir], patterns: [work*.tar.gz] anchored at: [wheeldirectory/] in 64.91 ms
27-Oct-2026 20:03:36 Publishing an artifact: XML Directories
27-Oct-2026 20:03:36 Finished publishing of artifact Non required job artifact Http Compression On : [XML Directories], patterns: [**/*.xml] anchored at: [wheeldirectory/] in 17.42 ms
27-Oct-2026 20:03:36 Finalising the build...
27-Oct-2026 20:03:36 Stopping timer.
27-Oct-2026 20:03:36 Build CASASPECS-MASTERTESTPY312-TTR9P-296 completed.
27-Oct-2026 20:03:36 Running on server: post build plugin 'Build Hanging Detection Configuration'
27-Oct-2026 20:03:36 Running on server: post build plugin 'NCover Results Collector'
27-Oct-2026 20:03:36 Running on server: post build plugin 'Build Labeller'
27-Oct-2026 20:03:36 Running on server: post build plugin 'Clover Delta Calculator'
27-Oct-2026 20:03:36 Running on server: post build plugin 'Maven Dependencies Postprocessor'
27-Oct-2026 20:03:36 All post build plugins have finished
27-Oct-2026 20:03:36 Generating build results summary...
27-Oct-2026 20:03:36 Saving build results to disk...
27-Oct-2026 20:03:36 Store variable context...
27-Oct-2026 20:03:36 Finished building CASASPECS-MASTERTESTPY312-TTR9P-296.