Tools and Tasks tests for Python 3.12

Build: #296 failed

Job: Test Tasks Many Linux 2.28 Rocky 8.10 Py3.12 failed

Build log

The build generated 455 lines of output. Download or view full build log.

27-Oct-2026 20:00:25 Build CASASPECS - Master Test 3.12 - Test Tasks Many Linux 2.28 Rocky 8.10 Py3.12 #296 (CASASPECS-MASTERTESTPY312-TTM228PY38-296) is being prepared for building on agent casaci-4.cv.nrao.edu, bamboo version: 9.6.26
27-Oct-2026 20:00:25 Remote agent on host casaci-4.cv.nrao.edu
27-Oct-2026 20:00:25 Build working directory is /opt/ci_workspace/casa/bamboo/agent7/xml-data/build-dir/CASASPECS-MASTERTESTPY312-TTM228PY38
27-Oct-2026 20:00:25 Executing build CASASPECS - Master Test 3.12 - Test Tasks Many Linux 2.28 Rocky 8.10 Py3.12 #296 (CASASPECS-MASTERTESTPY312-TTM228PY38-296)
27-Oct-2026 20:00:25 Starting task 'Source Code Checkout' of type 'com.atlassian.bamboo.plugins.vcs:task.vcs.checkout'
27-Oct-2026 20:00:25 Build always requires a clean checkout
27-Oct-2026 20:00:25 Cleaning build directory '/opt/ci_workspace/casa/bamboo/agent7/xml-data/build-dir/CASASPECS-MASTERTESTPY312-TTM228PY38'
27-Oct-2026 20:00:27 Checking out into /opt/ci_workspace/casa/bamboo/agent7/xml-data/build-dir/CASASPECS-MASTERTESTPY312-TTM228PY38
27-Oct-2026 20:00:27 Updating source code to revision: 188b64ce030a360ced17720a68d5af3bbcffaf87
27-Oct-2026 20:00:27 Fetching 'refs/heads/master' from 'ssh://git@open-bitbucket.nrao.edu:7999/casa/casa6.git'.
27-Oct-2026 20:00:27 Warning: Permanently added '[127.0.0.1]:41873' (RSA) to the list of known hosts.
27-Oct-2026 20:00:27 X11 forwarding request failed on channel 0
27-Oct-2026 20:00:29 Checking out revision 188b64ce030a360ced17720a68d5af3bbcffaf87.
27-Oct-2026 20:00:29 Creating local git repository in '/opt/ci_workspace/casa/bamboo/agent7/xml-data/build-dir/CASASPECS-MASTERTESTPY312-TTM228PY38/.git'.
27-Oct-2026 20:00:29 Cloning into '/opt/ci_workspace/casa/bamboo/agent7/xml-data/build-dir/CASASPECS-MASTERTESTPY312-TTM228PY38'...
27-Oct-2026 20:00:29 done.
27-Oct-2026 20:00:30 Already on 'master'
27-Oct-2026 20:00:30 Your branch is up to date with 'origin/master'.
27-Oct-2026 20:00:30 Submodule 'casatools/casacore' (https://github.com/casacore/casacore.git) registered for path 'casatools/casacore'
27-Oct-2026 20:00:30 Submodule 'casatools/grpc-source' (https://github.com/grpc/grpc) registered for path 'casatools/grpc-source'
27-Oct-2026 20:00:30 Cloning into '/opt/ci_workspace/casa/bamboo/agent7/xml-data/build-dir/CASASPECS-MASTERTESTPY312-TTM228PY38/casatools/casacore'...
27-Oct-2026 20:00:39 Cloning into '/opt/ci_workspace/casa/bamboo/agent7/xml-data/build-dir/CASASPECS-MASTERTESTPY312-TTM228PY38/casatools/grpc-source'...
27-Oct-2026 20:01:00 Submodule path 'casatools/casacore': checked out 'aaf72eb7edd5a5fecefa78ca04713233b7b6ffd6'
27-Oct-2026 20:01:01 Submodule path 'casatools/grpc-source': checked out 'cca868ac8f3641df4003a82b7fc54c921e14f765'
27-Oct-2026 20:01:01 Submodule 'third_party/abseil-cpp' (https://github.com/abseil/abseil-cpp) registered for path 'casatools/grpc-source/third_party/abseil-cpp'
27-Oct-2026 20:01:01 Submodule 'third_party/benchmark' (https://github.com/google/benchmark) registered for path 'casatools/grpc-source/third_party/benchmark'
27-Oct-2026 20:01:01 Submodule 'third_party/bloaty' (https://github.com/google/bloaty.git) registered for path 'casatools/grpc-source/third_party/bloaty'
27-Oct-2026 20:01:01 Submodule 'third_party/boringssl' (https://github.com/google/boringssl.git) registered for path 'casatools/grpc-source/third_party/boringssl'
27-Oct-2026 20:01:01 Submodule 'third_party/boringssl-with-bazel' (https://github.com/google/boringssl.git) registered for path 'casatools/grpc-source/third_party/boringssl-with-bazel'
27-Oct-2026 20:01:01 Submodule 'third_party/cares/cares' (https://github.com/c-ares/c-ares.git) registered for path 'casatools/grpc-source/third_party/cares/cares'
27-Oct-2026 20:01:01 Submodule 'third_party/gflags' (https://github.com/gflags/gflags.git) registered for path 'casatools/grpc-source/third_party/gflags'
27-Oct-2026 20:01:01 Submodule 'third_party/googletest' (https://github.com/google/googletest.git) registered for path 'casatools/grpc-source/third_party/googletest'
27-Oct-2026 20:01:01 Submodule 'third_party/protobuf' (https://github.com/google/protobuf.git) registered for path 'casatools/grpc-source/third_party/protobuf'
27-Oct-2026 20:01:01 Submodule 'third_party/zlib' (https://github.com/madler/zlib) registered for path 'casatools/grpc-source/third_party/zlib'
27-Oct-2026 20:01:01 Cloning into '/opt/ci_workspace/casa/bamboo/agent7/xml-data/build-dir/CASASPECS-MASTERTESTPY312-TTM228PY38/casatools/grpc-source/third_party/abseil-cpp'...
27-Oct-2026 20:01:02 Cloning into '/opt/ci_workspace/casa/bamboo/agent7/xml-data/build-dir/CASASPECS-MASTERTESTPY312-TTM228PY38/casatools/grpc-source/third_party/benchmark'...
27-Oct-2026 20:01:02 Cloning into '/opt/ci_workspace/casa/bamboo/agent7/xml-data/build-dir/CASASPECS-MASTERTESTPY312-TTM228PY38/casatools/grpc-source/third_party/bloaty'...
27-Oct-2026 20:01:03 Cloning into '/opt/ci_workspace/casa/bamboo/agent7/xml-data/build-dir/CASASPECS-MASTERTESTPY312-TTM228PY38/casatools/grpc-source/third_party/boringssl'...
27-Oct-2026 20:01:12 Cloning into '/opt/ci_workspace/casa/bamboo/agent7/xml-data/build-dir/CASASPECS-MASTERTESTPY312-TTM228PY38/casatools/grpc-source/third_party/boringssl-with-bazel'...
27-Oct-2026 20:01:24 Cloning into '/opt/ci_workspace/casa/bamboo/agent7/xml-data/build-dir/CASASPECS-MASTERTESTPY312-TTM228PY38/casatools/grpc-source/third_party/cares/cares'...
27-Oct-2026 20:01:25 Cloning into '/opt/ci_workspace/casa/bamboo/agent7/xml-data/build-dir/CASASPECS-MASTERTESTPY312-TTM228PY38/casatools/grpc-source/third_party/gflags'...
27-Oct-2026 20:01:25 Cloning into '/opt/ci_workspace/casa/bamboo/agent7/xml-data/build-dir/CASASPECS-MASTERTESTPY312-TTM228PY38/casatools/grpc-source/third_party/googletest'...
27-Oct-2026 20:01:27 Cloning into '/opt/ci_workspace/casa/bamboo/agent7/xml-data/build-dir/CASASPECS-MASTERTESTPY312-TTM228PY38/casatools/grpc-source/third_party/protobuf'...
27-Oct-2026 20:01:36 Cloning into '/opt/ci_workspace/casa/bamboo/agent7/xml-data/build-dir/CASASPECS-MASTERTESTPY312-TTM228PY38/casatools/grpc-source/third_party/zlib'...
27-Oct-2026 20:01:37 Submodule path 'casatools/grpc-source/third_party/abseil-cpp': checked out 'cc4bed2d74f7c8717e31f9579214ab52a9c9c610'
27-Oct-2026 20:01:37 Submodule path 'casatools/grpc-source/third_party/benchmark': checked out '5b7683f49e1e9223cf9927b24f6fd3d6bd82e3f8'
27-Oct-2026 20:01:37 Submodule path 'casatools/grpc-source/third_party/bloaty': checked out '73594cde8c9a52a102c4341c244c833aa61b9c06'
27-Oct-2026 20:01:37 Submodule 'third_party/googletest' (https://github.com/google/googletest.git) registered for path 'casatools/grpc-source/third_party/bloaty/third_party/googletest'
27-Oct-2026 20:01:37 Submodule 'third_party/libFuzzer' (https://chromium.googlesource.com/chromium/llvm-project/llvm/lib/Fuzzer) registered for path 'casatools/grpc-source/third_party/bloaty/third_party/libFuzzer'
27-Oct-2026 20:01:37 Submodule 'third_party/re2' (https://github.com/google/re2) registered for path 'casatools/grpc-source/third_party/bloaty/third_party/re2'
27-Oct-2026 20:01:37 Cloning into '/opt/ci_workspace/casa/bamboo/agent7/xml-data/build-dir/CASASPECS-MASTERTESTPY312-TTM228PY38/casatools/grpc-source/third_party/bloaty/third_party/googletest'...
27-Oct-2026 20:01:38 Cloning into '/opt/ci_workspace/casa/bamboo/agent7/xml-data/build-dir/CASASPECS-MASTERTESTPY312-TTM228PY38/casatools/grpc-source/third_party/bloaty/third_party/libFuzzer'...
27-Oct-2026 20:01:38 Cloning into '/opt/ci_workspace/casa/bamboo/agent7/xml-data/build-dir/CASASPECS-MASTERTESTPY312-TTM228PY38/casatools/grpc-source/third_party/bloaty/third_party/re2'...
27-Oct-2026 20:01:39 Submodule path 'casatools/grpc-source/third_party/bloaty/third_party/googletest': checked out 'a2b8a8e07628e5fd60644b6dd99c1b5e7d7f1f47'
27-Oct-2026 20:01:39 Submodule path 'casatools/grpc-source/third_party/bloaty/third_party/libFuzzer': checked out '1b543d6e5073b56be214394890c9193979a3d7e1'
27-Oct-2026 20:01:39 Submodule path 'casatools/grpc-source/third_party/bloaty/third_party/re2': checked out 'c964d9b07816f9b52ca692e23b8b3dba33beec54'
27-Oct-2026 20:01:39 Submodule path 'casatools/grpc-source/third_party/boringssl': checked out 'be2ee342d3781ddb954f91f8a7e660c6f59e87e5'
27-Oct-2026 20:01:39 Submodule path 'casatools/grpc-source/third_party/boringssl-with-bazel': checked out '886e7d75368e3f4fab3f4d0d3584e4abfc557755'
27-Oct-2026 20:01:39 Submodule path 'casatools/grpc-source/third_party/cares/cares': checked out '3be1924221e1326df520f8498d704a5c4c8d0cce'
27-Oct-2026 20:01:39 Submodule path 'casatools/grpc-source/third_party/gflags': checked out '30dbc81fb5ffdc98ea9b14b1918bfe4e8779b26e'
27-Oct-2026 20:01:39 Submodule 'doc' (https://github.com/gflags/gflags.git) registered for path 'casatools/grpc-source/third_party/gflags/doc'
27-Oct-2026 20:01:39 Cloning into '/opt/ci_workspace/casa/bamboo/agent7/xml-data/build-dir/CASASPECS-MASTERTESTPY312-TTM228PY38/casatools/grpc-source/third_party/gflags/doc'...
27-Oct-2026 20:01:40 Submodule path 'casatools/grpc-source/third_party/gflags/doc': checked out '971dd2a4fadac9cdab174c523c22df79efd63aa5'
27-Oct-2026 20:01:40 Submodule path 'casatools/grpc-source/third_party/googletest': checked out 'ec44c6c1675c25b9827aacd08c02433cccde7780'
27-Oct-2026 20:01:40 Submodule path 'casatools/grpc-source/third_party/protobuf': checked out '2761122b810fe8861004ae785cc3ab39f384d342'
27-Oct-2026 20:01:40 Submodule 'third_party/benchmark' (https://github.com/google/benchmark.git) registered for path 'casatools/grpc-source/third_party/protobuf/third_party/benchmark'
27-Oct-2026 20:01:40 Cloning into '/opt/ci_workspace/casa/bamboo/agent7/xml-data/build-dir/CASASPECS-MASTERTESTPY312-TTM228PY38/casatools/grpc-source/third_party/protobuf/third_party/benchmark'...
27-Oct-2026 20:01:40 Submodule path 'casatools/grpc-source/third_party/protobuf/third_party/benchmark': checked out '360e66c1c4777c99402cf8cd535aa510fee16573'
27-Oct-2026 20:01:40 Submodule path 'casatools/grpc-source/third_party/zlib': checked out 'cacf7f1d4e3d44d871b605da3b647f07d718623f'
27-Oct-2026 20:01:40 Updated source code to revision: 188b64ce030a360ced17720a68d5af3bbcffaf87
27-Oct-2026 20:01:40 Finished task 'Source Code Checkout' with result: Success
27-Oct-2026 20:01:40 Running pre-build action: Build Log Labeller Pre Build Action
27-Oct-2026 20:01:40 Running pre-build action: VCS Version Collector
27-Oct-2026 20:01:40 Build CASASPECS - Master Test 3.12 - Test Tasks Many Linux 2.28 Rocky 8.10 Py3.12 #296 (CASASPECS-MASTERTESTPY312-TTM228PY38-296) started building on agent 'casaci-4.cv.nrao.edu' (Remote agent on host casaci-4.cv.nrao.edu)
27-Oct-2026 20:01:40 Starting task 'Update data' of type 'com.atlassian.bamboo.plugins.scripttask:task.builder.script'
27-Oct-2026 20:01:40
Beginning to execute external process for build 'CASASPECS - Master Test 3.12 - Test Tasks Many Linux 2.28 Rocky 8.10 Py3.12 #296 (CASASPECS-MASTERTESTPY312-TTM228PY38-296)'
... running command line:
/opt/ci_workspace/casa/bamboo/agent7/temp/CASASPECS-MASTERTESTPY312-TTM228PY38-296-ScriptBuildTask-4442276193642901004.sh
... in: /opt/ci_workspace/casa/bamboo/agent7/xml-data/build-dir/CASASPECS-MASTERTESTPY312-TTM228PY38
27-Oct-2026 20:01:40 Already up to date.
27-Oct-2026 20:01:40 Already up to date.
27-Oct-2026 20:01:40 Data update complete
27-Oct-2026 20:01:40 Finished task 'Update data' with result: Success
27-Oct-2026 20:01:40
Substituting variable: ${bamboo.repository.branch.name} with master
27-Oct-2026 20:01:40 Starting task 'Create wheeldirectory' of type 'com.atlassian.bamboo.plugins.scripttask:task.builder.script'
27-Oct-2026 20:01:40
Beginning to execute external process for build 'CASASPECS - Master Test 3.12 - Test Tasks Many Linux 2.28 Rocky 8.10 Py3.12 #296 (CASASPECS-MASTERTESTPY312-TTM228PY38-296)'
... running command line:
/opt/ci_workspace/casa/bamboo/agent7/temp/CASASPECS-MASTERTESTPY312-TTM228PY38-296-ScriptBuildTask-8342111020036650246.sh
... in: /opt/ci_workspace/casa/bamboo/agent7/xml-data/build-dir/CASASPECS-MASTERTESTPY312-TTM228PY38
27-Oct-2026 20:01:40 Finished task 'Create wheeldirectory' with result: Success
27-Oct-2026 20:01:40 Starting task 'Get latest wheel' of type 'com.atlassian.bamboo.plugins.bamboo-artifact-downloader-plugin:artifactdownloadertask'
27-Oct-2026 20:01:40 Preparing to download plan result CASASPECS-MASTERBUILDCASALITH-304 artifact: Required shared artifact Http Compression On : [ManyLinux228 Python 3.12 Tool wheel], patterns: [casatools*.whl] anchored at: [source/wheels]
27-Oct-2026 20:01:40 Retrieving artifact ManyLinux228 Python 3.12 Tool wheel for CASASPECS-MASTERBUILDCASALITH-304 using Bamboo server artifact handler
27-Oct-2026 20:01:47 Artifact [ManyLinux228 Python 3.12 Tool wheel] downloaded successfully in 6.586 s to wheeldirectory/
27-Oct-2026 20:01:47 Preparing to download plan result CASASPECS-MASTERBUILDCASALITH-304 artifact: Required shared artifact Http Compression On : [ManyLinux228 Python 3.12 Task wheel], patterns: [casatasks*.whl] anchored at: [source/wheels]
27-Oct-2026 20:01:47 Retrieving artifact ManyLinux228 Python 3.12 Task wheel for CASASPECS-MASTERBUILDCASALITH-304 using Bamboo server artifact handler
27-Oct-2026 20:01:47 Artifact [ManyLinux228 Python 3.12 Task wheel] downloaded successfully in 248.4 ms to wheeldirectory/
27-Oct-2026 20:01:47 Preparing to download plan result CASASPECS-MASTERBUILDCASALITH-304 artifact: Required shared artifact Http Compression On : [ManyLinux228 Python 3.12 Casatestutils], patterns: [casatestutils*.whl] anchored at: [source/wheels]
27-Oct-2026 20:01:47 Retrieving artifact ManyLinux228 Python 3.12 Casatestutils for CASASPECS-MASTERBUILDCASALITH-304 using Bamboo server artifact handler
27-Oct-2026 20:01:47 Artifact [ManyLinux228 Python 3.12 Casatestutils] downloaded successfully in 14.58 ms to wheeldirectory/
27-Oct-2026 20:01:47 Preparing to download plan result CASASPECS-MASTERBUILDCASALITH-304 artifact: Non required shared artifact Http Compression On : [ManyLinux228 Python 3.12 Shell wheel], patterns: [casashell*.whl] anchored at: [source/wheels]
27-Oct-2026 20:01:47 Retrieving artifact ManyLinux228 Python 3.12 Shell wheel for CASASPECS-MASTERBUILDCASALITH-304 using Bamboo server artifact handler
27-Oct-2026 20:01:47 Artifact [ManyLinux228 Python 3.12 Shell wheel] downloaded successfully in 111.8 ms to wheeldirectory/
27-Oct-2026 20:01:47 Finished task 'Get latest wheel' with result: Success
27-Oct-2026 20:01:47
Substituting variable: ${bamboo.agentId} with 153550855
27-Oct-2026 20:01:47
Substituting variable: ${bamboo.agentId} with 153550855
27-Oct-2026 20:01:47 Starting task 'Stop and remove running wheel-container-test' of type 'com.atlassian.bamboo.plugins.scripttask:task.builder.script'
27-Oct-2026 20:01:47
Beginning to execute external process for build 'CASASPECS - Master Test 3.12 - Test Tasks Many Linux 2.28 Rocky 8.10 Py3.12 #296 (CASASPECS-MASTERTESTPY312-TTM228PY38-296)'
... running command line:
/opt/ci_workspace/casa/bamboo/agent7/temp/CASASPECS-MASTERTESTPY312-TTM228PY38-296-ScriptBuildTask-7921258318897443874.sh
... in: /opt/ci_workspace/casa/bamboo/agent7/xml-data/build-dir/CASASPECS-MASTERTESTPY312-TTM228PY38
27-Oct-2026 20:01:47 Error response from daemon: No such container: wheel-container-test-153550855
27-Oct-2026 20:01:47 Error response from daemon: No such container: wheel-container-test-153550855
27-Oct-2026 20:01:47 Removed wheel-container-test
27-Oct-2026 20:01:47 Finished task 'Stop and remove running wheel-container-test' with result: Success
27-Oct-2026 20:01:48
Substituting variable: ${bamboo.rocky8_docker_image} with casa-docker.nrao.edu:5000/casa-test-rocky-8.10:4
27-Oct-2026 20:01:48
Substituting variable: ${bamboo.working.directory} with /opt/ci_workspace/casa/bamboo/agent7/xml-data/build-dir/CASASPECS-MASTERTESTPY312-TTM228PY38
27-Oct-2026 20:01:48
Substituting variable: ${bamboo.agentId} with 153550855
27-Oct-2026 20:01:48 Starting task 'Start container' of type 'com.atlassian.bamboo.plugins.bamboo-docker-plugin:task.docker.cli'
27-Oct-2026 20:01:48 Running image name (casa-docker.nrao.edu:5000/casa-test-rocky-8.10:4)
27-Oct-2026 20:01:48
Beginning to execute external process for build 'CASASPECS - Master Test 3.12 - Test Tasks Many Linux 2.28 Rocky 8.10 Py3.12 #296 (CASASPECS-MASTERTESTPY312-TTM228PY38-296)'
... running command line:
/usr/bin/docker run --volume /opt/ci_workspace/casa/bamboo/agent7/xml-data/build-dir/CASASPECS-MASTERTESTPY312-TTM228PY38/wheeldirectory:/wheeldirectory --volume /opt/casa/data:/opt/casa/data --detach --name wheel-container-test-153550855 casa-docker.nrao.edu:5000/casa-test-rocky-8.10:4 tail -f /dev/null
... in: /opt/ci_workspace/casa/bamboo/agent7/xml-data/build-dir/CASASPECS-MASTERTESTPY312-TTM228PY38
27-Oct-2026 20:01:51 eb7d3d1c74e5e8b902b1f133b0b43d8a83f984b10601179a2e956e0eed83e4e2
27-Oct-2026 20:01:52 Finished task 'Start container' with result: Success
27-Oct-2026 20:01:52
Substituting variable: ${bamboo.agentId} with 153550855
27-Oct-2026 20:01:52
Substituting variable: ${bamboo.planRepository.branchName} with master
27-Oct-2026 20:01:52
Substituting variable: ${bamboo.python_version} with 3.12
27-Oct-2026 20:01:52 Starting task 'Test wheel' of type 'com.atlassian.bamboo.plugins.scripttask:task.builder.script'
27-Oct-2026 20:01:52
Beginning to execute external process for build 'CASASPECS - Master Test 3.12 - Test Tasks Many Linux 2.28 Rocky 8.10 Py3.12 #296 (CASASPECS-MASTERTESTPY312-TTM228PY38-296)'
... running command line:
/opt/ci_workspace/casa/bamboo/agent7/temp/CASASPECS-MASTERTESTPY312-TTM228PY38-296-ScriptBuildTask-10211110712236088094.sh
... in: /opt/ci_workspace/casa/bamboo/agent7/xml-data/build-dir/CASASPECS-MASTERTESTPY312-TTM228PY38
27-Oct-2026 20:01:52 branch: master
27-Oct-2026 20:01:52 Python version: 3.12
27-Oct-2026 20:01:52   % Total    % Received % Xferd  Average Speed   Time    Time     Time  Current
27-Oct-2026 20:01:52                                  Dload  Upload   Total   Spent    Left  Speed
27-Oct-2026 20:01:52
27-Oct-2026 20:01:52   0     0    0     0    0     0      0      0 --:--:-- --:--:-- --:--:--     0
27-Oct-2026 20:01:52 100 6002k  100 6002k    0     0   124M      0 --:--:-- --:--:-- --:--:--  124M
27-Oct-2026 20:01:52 bamboo_jira_components:''
27-Oct-2026 20:01:52 bamboo_testlist:''
27-Oct-2026 20:01:52 Ticket components:
27-Oct-2026 20:01:52 datapath=[ "/opt/casa/data/master", "/opt/casa/data/casatestdata" ]
27-Oct-2026 20:01:52 measurespath="/opt/casa/data/master"
27-Oct-2026 20:01:52 measures_auto_update=False
27-Oct-2026 20:01:52 data_auto_update=False
27-Oct-2026 20:01:52 [467707] Failed to execute script 'atlutil' due to unhandled exception!
27-Oct-2026 20:01:52 Traceback (most recent call last):
27-Oct-2026 20:01:52   File "atlutil.py", line 200, in <module>
27-Oct-2026 20:01:52   File "atlutil.py", line 165, in has_fix_version
27-Oct-2026 20:01:52 KeyError: 'fields'
27-Oct-2026 20:01:52 datapath=[ "/opt/casa/data/master", "/opt/casa/data/casatestdata" ]
27-Oct-2026 20:01:52 measurespath="/opt/casa/data/master"
27-Oct-2026 20:01:52 measures_auto_update=False
27-Oct-2026 20:01:52 data_auto_update=False
27-Oct-2026 20:01:54 Requirement already satisfied: pip in /home/casatest/venv/lib/python3.12/site-packages (24.3.1)
27-Oct-2026 20:01:54 Collecting pip
27-Oct-2026 20:01:55   Downloading pip-26.2.2-py3-none-any.whl.metadata (4.6 kB)
27-Oct-2026 20:01:55 Collecting numpy
27-Oct-2026 20:01:55   Downloading numpy-2.5.4-cp312-cp312-manylinux_2_27_x86_64.manylinux_2_28_x86_64.whl.metadata (6.6 kB)
27-Oct-2026 20:01:55 Collecting matplotlib
27-Oct-2026 20:01:55   Downloading matplotlib-3.11.2-cp312-cp312-manylinux2014_x86_64.manylinux_2_17_x86_64.whl.metadata (80 kB)
27-Oct-2026 20:01:55 Collecting scipy
27-Oct-2026 20:01:55   Downloading scipy-1.18.1-cp312-cp312-manylinux_2_27_x86_64.manylinux_2_28_x86_64.whl.metadata (62 kB)
27-Oct-2026 20:01:55 Collecting setuptools
27-Oct-2026 20:01:55   Downloading setuptools-84.2.1-py3-none-any.whl.metadata (6.6 kB)
27-Oct-2026 20:01:55 Collecting contourpy>=1.0.1 (from matplotlib)
27-Oct-2026 20:01:55   Downloading contourpy-1.4.0-cp312-cp312-manylinux_2_27_x86_64.manylinux_2_28_x86_64.whl.metadata (3.8 kB)
27-Oct-2026 20:01:55 Collecting cycler>=0.10 (from matplotlib)
27-Oct-2026 20:01:55   Downloading cycler-0.12.1-py3-none-any.whl.metadata (3.8 kB)
27-Oct-2026 20:01:56 Collecting fonttools>=4.28.2 (from matplotlib)
27-Oct-2026 20:01:56   Downloading fonttools-4.68.0-cp312-cp312-manylinux2014_x86_64.manylinux_2_17_x86_64.whl.metadata (139 kB)
27-Oct-2026 20:01:56 Collecting kiwisolver>=1.3.1 (from matplotlib)
27-Oct-2026 20:01:56   Downloading kiwisolver-1.5.1-cp312-cp312-manylinux2014_x86_64.manylinux_2_17_x86_64.whl.metadata (5.2 kB)
27-Oct-2026 20:01:56 Collecting packaging>=20.0 (from matplotlib)
27-Oct-2026 20:01:56   Downloading packaging-26.3-py3-none-any.whl.metadata (3.5 kB)
27-Oct-2026 20:01:56 Collecting pillow>=9 (from matplotlib)
27-Oct-2026 20:01:56   Downloading pillow-13.0.0-cp312-cp312-manylinux_2_27_x86_64.manylinux_2_28_x86_64.whl.metadata (9.1 kB)
27-Oct-2026 20:01:56 Collecting pyparsing>=3 (from matplotlib)
27-Oct-2026 20:01:56   Downloading pyparsing-3.3.3-py3-none-any.whl.metadata (5.9 kB)
27-Oct-2026 20:01:56 Collecting python-dateutil>=2.7 (from matplotlib)
27-Oct-2026 20:01:56   Downloading python_dateutil-3.0.0-py2.py3-none-any.whl.metadata (8.2 kB)
27-Oct-2026 20:01:56 Collecting six>=1.6 (from python-dateutil>=2.7->matplotlib)
27-Oct-2026 20:01:56   Downloading six-1.17.0-py2.py3-none-any.whl.metadata (1.7 kB)
27-Oct-2026 20:01:56 Collecting tzdata (from python-dateutil>=2.7->matplotlib)
27-Oct-2026 20:01:56   Downloading tzdata-2026.5-py2.py3-none-any.whl.metadata (1.4 kB)
27-Oct-2026 20:01:56 Downloading pip-26.2.2-py3-none-any.whl (1.8 MB)
27-Oct-2026 20:01:56    ━━━━━━━━━━━━━━━━━━━━━━━━━━━━━━━━━━━━━━━━ 1.8/1.8 MB 42.6 MB/s eta 0:00:00
27-Oct-2026 20:01:56 Downloading numpy-2.5.4-cp312-cp312-manylinux_2_27_x86_64.manylinux_2_28_x86_64.whl (16.7 MB)
27-Oct-2026 20:01:56    ━━━━━━━━━━━━━━━━━━━━━━━━━━━━━━━━━━━━━━━━ 16.7/16.7 MB 237.5 MB/s eta 0:00:00
27-Oct-2026 20:01:56 Downloading matplotlib-3.11.2-cp312-cp312-manylinux2014_x86_64.manylinux_2_17_x86_64.whl (9.9 MB)
27-Oct-2026 20:01:57    ━━━━━━━━━━━━━━━━━━━━━━━━━━━━━━━━━━━━━━━━ 9.9/9.9 MB 173.8 MB/s eta 0:00:00
27-Oct-2026 20:01:57 Downloading scipy-1.18.1-cp312-cp312-manylinux_2_27_x86_64.manylinux_2_28_x86_64.whl (35.3 MB)
27-Oct-2026 20:01:57    ━━━━━━━━━━━━━━━━━━━━━━━━━━━━━━━━━━━━━━━━ 35.3/35.3 MB 206.5 MB/s eta 0:00:00
27-Oct-2026 20:01:57 Downloading setuptools-84.2.1-py3-none-any.whl (876 kB)
27-Oct-2026 20:01:57    ━━━━━━━━━━━━━━━━━━━━━━━━━━━━━━━━━━━━━━━ 876.3/876.3 kB 102.2 MB/s eta 0:00:00
27-Oct-2026 20:01:57 Downloading contourpy-1.4.0-cp312-cp312-manylinux_2_27_x86_64.manylinux_2_28_x86_64.whl (383 kB)
27-Oct-2026 20:01:57 Downloading cycler-0.12.1-py3-none-any.whl (8.3 kB)
27-Oct-2026 20:01:57 Downloading fonttools-4.68.0-cp312-cp312-manylinux2014_x86_64.manylinux_2_17_x86_64.whl (5.4 MB)
27-Oct-2026 20:01:57    ━━━━━━━━━━━━━━━━━━━━━━━━━━━━━━━━━━━━━━━━ 5.4/5.4 MB 140.1 MB/s eta 0:00:00
27-Oct-2026 20:01:57 Downloading kiwisolver-1.5.1-cp312-cp312-manylinux2014_x86_64.manylinux_2_17_x86_64.whl (1.5 MB)
27-Oct-2026 20:01:57    ━━━━━━━━━━━━━━━━━━━━━━━━━━━━━━━━━━━━━━━━ 1.5/1.5 MB 142.0 MB/s eta 0:00:00
27-Oct-2026 20:01:57 Downloading packaging-26.3-py3-none-any.whl (129 kB)
27-Oct-2026 20:01:57 Downloading pillow-13.0.0-cp312-cp312-manylinux_2_27_x86_64.manylinux_2_28_x86_64.whl (7.1 MB)
27-Oct-2026 20:01:57    ━━━━━━━━━━━━━━━━━━━━━━━━━━━━━━━━━━━━━━━━ 7.1/7.1 MB 195.0 MB/s eta 0:00:00
27-Oct-2026 20:01:57 Downloading pyparsing-3.3.3-py3-none-any.whl (126 kB)
27-Oct-2026 20:01:57 Downloading python_dateutil-3.0.0-py2.py3-none-any.whl (94 kB)
27-Oct-2026 20:01:57 Downloading six-1.17.0-py2.py3-none-any.whl (11 kB)
27-Oct-2026 20:01:57 Downloading tzdata-2026.5-py2.py3-none-any.whl (347 kB)
27-Oct-2026 20:01:57 Installing collected packages: tzdata, six, setuptools, pyparsing, pip, pillow, packaging, numpy, kiwisolver, fonttools, cycler, scipy, python-dateutil, contourpy, matplotlib
27-Oct-2026 20:01:58   Attempting uninstall: pip
27-Oct-2026 20:01:58     Found existing installation: pip 24.3.1
27-Oct-2026 20:01:58     Uninstalling pip-24.3.1:
27-Oct-2026 20:01:58       Successfully uninstalled pip-24.3.1
27-Oct-2026 20:02:05 Successfully installed contourpy-1.4.0 cycler-0.12.1 fonttools-4.68.0 kiwisolver-1.5.1 matplotlib-3.11.2 numpy-2.5.4 packaging-26.3 pillow-13.0.0 pip-26.2.2 pyparsing-3.3.3 python-dateutil-3.0.0 scipy-1.18.1 setuptools-84.2.1 six-1.17.0 tzdata-2026.5
27-Oct-2026 20:02:06 Processing ./casatestutils-6.8.0.2-py3-none-any.whl
27-Oct-2026 20:02:06 Collecting pytest>=6.0 (from casatestutils==6.8.0.2)
27-Oct-2026 20:02:06   Downloading pytest-9.2.0-py3-none-any.whl.metadata (7.9 kB)
27-Oct-2026 20:02:06 Collecting astropy (from casatestutils==6.8.0.2)
27-Oct-2026 20:02:06   Downloading astropy-8.0.2-cp311-abi3-manylinux2014_x86_64.manylinux_2_17_x86_64.manylinux_2_28_x86_64.whl.metadata (11 kB)
27-Oct-2026 20:02:06 Collecting iniconfig>=2 (from pytest>=6.0->casatestutils==6.8.0.2)
27-Oct-2026 20:02:06   Downloading iniconfig-2.3.1-py3-none-any.whl.metadata (2.8 kB)
27-Oct-2026 20:02:06 Requirement already satisfied: packaging>=24 in /home/casatest/venv/lib/python3.12/site-packages (from pytest>=6.0->casatestutils==6.8.0.2) (26.3)
27-Oct-2026 20:02:06 Collecting pluggy<2,>=1.6 (from pytest>=6.0->casatestutils==6.8.0.2)
27-Oct-2026 20:02:06   Downloading pluggy-1.7.0-py3-none-any.whl.metadata (5.0 kB)
27-Oct-2026 20:02:06 Collecting pygments>=2.15 (from pytest>=6.0->casatestutils==6.8.0.2)
27-Oct-2026 20:02:06   Downloading pygments-2.21.0-py3-none-any.whl.metadata (2.5 kB)
27-Oct-2026 20:02:06 Collecting astropy-iers-data>=0.2026.9.28.0.59.37 (from astropy->casatestutils==6.8.0.2)
27-Oct-2026 20:02:06   Downloading astropy_iers_data-0.2026.10.19.0.52.1-py3-none-any.whl.metadata (3.4 kB)
27-Oct-2026 20:02:06 Requirement already satisfied: numpy>=2.0 in /home/casatest/venv/lib/python3.12/site-packages (from astropy->casatestutils==6.8.0.2) (2.5.4)
27-Oct-2026 20:02:06 Collecting pyerfa>=2.0.1.3 (from astropy->casatestutils==6.8.0.2)
27-Oct-2026 20:02:06   Downloading pyerfa-2.0.1.5-cp39-abi3-manylinux_2_17_x86_64.manylinux2014_x86_64.whl.metadata (5.7 kB)
27-Oct-2026 20:02:06 Collecting PyYAML>=6.0.0 (from astropy->casatestutils==6.8.0.2)
27-Oct-2026 20:02:06   Downloading pyyaml-6.0.3-cp312-cp312-manylinux2014_x86_64.manylinux_2_17_x86_64.manylinux_2_28_x86_64.whl.metadata (2.4 kB)
27-Oct-2026 20:02:06 Downloading pytest-9.2.0-py3-none-any.whl (411 kB)
27-Oct-2026 20:02:06 Downloading pluggy-1.7.0-py3-none-any.whl (27 kB)
27-Oct-2026 20:02:06 Downloading iniconfig-2.3.1-py3-none-any.whl (7.6 kB)
27-Oct-2026 20:02:06 Downloading pygments-2.21.0-py3-none-any.whl (1.3 MB)
27-Oct-2026 20:02:06    ━━━━━━━━━━━━━━━━━━━━━━━━━━━━━━━━━━━━━━━━ 1.3/1.3 MB 122.6 MB/s  0:00:00
27-Oct-2026 20:02:06 Downloading astropy-8.0.2-cp311-abi3-manylinux2014_x86_64.manylinux_2_17_x86_64.manylinux_2_28_x86_64.whl (10.4 MB)
27-Oct-2026 20:02:06    ━━━━━━━━━━━━━━━━━━━━━━━━━━━━━━━━━━━━━━━━ 10.4/10.4 MB 58.6 MB/s  0:00:00
27-Oct-2026 20:02:06 Downloading astropy_iers_data-0.2026.10.19.0.52.1-py3-none-any.whl (2.0 MB)
27-Oct-2026 20:02:07    ━━━━━━━━━━━━━━━━━━━━━━━━━━━━━━━━━━━━━━━━ 2.0/2.0 MB 65.2 MB/s  0:00:00
27-Oct-2026 20:02:07 Downloading pyerfa-2.0.1.5-cp39-abi3-manylinux_2_17_x86_64.manylinux2014_x86_64.whl (738 kB)
27-Oct-2026 20:02:07    ━━━━━━━━━━━━━━━━━━━━━━━━━━━━━━━━━━━━━━━━ 738.7/738.7 kB 50.5 MB/s  0:00:00
27-Oct-2026 20:02:07 Downloading pyyaml-6.0.3-cp312-cp312-manylinux2014_x86_64.manylinux_2_17_x86_64.manylinux_2_28_x86_64.whl (807 kB)
27-Oct-2026 20:02:07    ━━━━━━━━━━━━━━━━━━━━━━━━━━━━━━━━━━━━━━━━ 807.9/807.9 kB 100.0 MB/s  0:00:00
27-Oct-2026 20:02:07 Installing collected packages: PyYAML, pygments, pyerfa, pluggy, iniconfig, astropy-iers-data, pytest, astropy, casatestutils
27-Oct-2026 20:02:10
27-Oct-2026 20:02:10 Successfully installed PyYAML-6.0.3 astropy-8.0.2 astropy-iers-data-0.2026.10.19.0.52.1 casatestutils-6.8.0.2 iniconfig-2.3.1 pluggy-1.7.0 pyerfa-2.0.1.5 pygments-2.21.0 pytest-9.2.0
27-Oct-2026 20:02:10 Processing ./casatools-6.8.0.2-cp312-cp312-manylinux_2_28_x86_64.whl
27-Oct-2026 20:02:10 Requirement already satisfied: numpy in /home/casatest/venv/lib/python3.12/site-packages (from casatools==6.8.0.2) (2.5.4)
27-Oct-2026 20:02:10 Collecting casaconfig (from casatools==6.8.0.2)
27-Oct-2026 20:02:10   Downloading casaconfig-1.5.2-py3-none-any.whl.metadata (4.0 kB)
27-Oct-2026 20:02:11 Collecting certifi>=2023.5.7 (from casaconfig->casatools==6.8.0.2)
27-Oct-2026 20:02:11   Downloading certifi-2026.10.23-py3-none-any.whl.metadata (2.5 kB)
27-Oct-2026 20:02:11 Downloading casaconfig-1.5.2-py3-none-any.whl (77 kB)
27-Oct-2026 20:02:11 Downloading certifi-2026.10.23-py3-none-any.whl (135 kB)
27-Oct-2026 20:02:11 Installing collected packages: certifi, casaconfig, casatools
27-Oct-2026 20:02:12
27-Oct-2026 20:02:12 Successfully installed casaconfig-1.5.2 casatools-6.8.0.2 certifi-2026.10.23
27-Oct-2026 20:02:12 Processing ./casatasks-6.8.0.2-py3-none-any.whl
27-Oct-2026 20:02:12 Requirement already satisfied: casatools==6.8.0.2 in /home/casatest/venv/lib/python3.12/site-packages (from casatasks==6.8.0.2) (6.8.0.2)
27-Oct-2026 20:02:12 Requirement already satisfied: matplotlib in /home/casatest/venv/lib/python3.12/site-packages (from casatasks==6.8.0.2) (3.11.2)
27-Oct-2026 20:02:12 Requirement already satisfied: scipy in /home/casatest/venv/lib/python3.12/site-packages (from casatasks==6.8.0.2) (1.18.1)
27-Oct-2026 20:02:12 Requirement already satisfied: certifi in /home/casatest/venv/lib/python3.12/site-packages (from casatasks==6.8.0.2) (2026.10.23)
27-Oct-2026 20:02:12 Requirement already satisfied: pyerfa in /home/casatest/venv/lib/python3.12/site-packages (from casatasks==6.8.0.2) (2.0.1.5)
27-Oct-2026 20:02:12 Requirement already satisfied: numpy in /home/casatest/venv/lib/python3.12/site-packages (from casatools==6.8.0.2->casatasks==6.8.0.2) (2.5.4)
27-Oct-2026 20:02:12 Requirement already satisfied: casaconfig in /home/casatest/venv/lib/python3.12/site-packages (from casatools==6.8.0.2->casatasks==6.8.0.2) (1.5.2)
27-Oct-2026 20:02:12 Requirement already satisfied: contourpy>=1.0.1 in /home/casatest/venv/lib/python3.12/site-packages (from matplotlib->casatasks==6.8.0.2) (1.4.0)
27-Oct-2026 20:02:12 Requirement already satisfied: cycler>=0.10 in /home/casatest/venv/lib/python3.12/site-packages (from matplotlib->casatasks==6.8.0.2) (0.12.1)
27-Oct-2026 20:02:12 Requirement already satisfied: fonttools>=4.28.2 in /home/casatest/venv/lib/python3.12/site-packages (from matplotlib->casatasks==6.8.0.2) (4.68.0)
27-Oct-2026 20:02:12 Requirement already satisfied: kiwisolver>=1.3.1 in /home/casatest/venv/lib/python3.12/site-packages (from matplotlib->casatasks==6.8.0.2) (1.5.1)
27-Oct-2026 20:02:12 Requirement already satisfied: packaging>=20.0 in /home/casatest/venv/lib/python3.12/site-packages (from matplotlib->casatasks==6.8.0.2) (26.3)
27-Oct-2026 20:02:12 Requirement already satisfied: pillow>=9 in /home/casatest/venv/lib/python3.12/site-packages (from matplotlib->casatasks==6.8.0.2) (13.0.0)
27-Oct-2026 20:02:12 Requirement already satisfied: pyparsing>=3 in /home/casatest/venv/lib/python3.12/site-packages (from matplotlib->casatasks==6.8.0.2) (3.3.3)
27-Oct-2026 20:02:12 Requirement already satisfied: python-dateutil>=2.7 in /home/casatest/venv/lib/python3.12/site-packages (from matplotlib->casatasks==6.8.0.2) (3.0.0)
27-Oct-2026 20:02:12 Requirement already satisfied: six>=1.6 in /home/casatest/venv/lib/python3.12/site-packages (from python-dateutil>=2.7->matplotlib->casatasks==6.8.0.2) (1.17.0)
27-Oct-2026 20:02:12 Requirement already satisfied: tzdata in /home/casatest/venv/lib/python3.12/site-packages (from python-dateutil>=2.7->matplotlib->casatasks==6.8.0.2) (2026.5)
27-Oct-2026 20:02:12 Installing collected packages: casatasks
27-Oct-2026 20:02:13 Successfully installed casatasks-6.8.0.2
27-Oct-2026 20:02:13 Runtest command: python3.12 runtest.py --ignore_list 'test_casampi,test_task_msview,test_task_imview,test_task_plotms' -t /home/casatest/casa6/casatasks/tests/tasks,/home/casatest/casa6/casatasks/tests/scripts -e /home/casatest/casa6/casatestutils/casatestutils/component_to_test_map.json -j casatasks 2>&1 | tee casatasks_test.log
27-Oct-2026 20:03:31 Your branch is up to date with 'origin/master'.
27-Oct-2026 20:03:31 Already on 'master'
27-Oct-2026 20:03:31 LICENSE
27-Oct-2026 20:03:31 README.md
27-Oct-2026 20:03:31 __init__.py
27-Oct-2026 20:03:31 casatestutils
27-Oct-2026 20:03:31 pyproject.toml
27-Oct-2026 20:03:31 runtest.py
27-Oct-2026 20:03:31 setup.py
27-Oct-2026 20:03:31 testrunner
27-Oct-2026 20:03:31 tests
27-Oct-2026 20:03:31 version
27-Oct-2026 20:03:31 xmlrunner_to_junit.py
27-Oct-2026 20:03:31 Namespace(list=False, verbose=False, dry_run=False, classes=None, file=None, mapfile=<_io.TextIOWrapper name='/home/casatest/casa6/casatestutils/casatestutils/component_to_test_map.json' mode='r' encoding='utf-8'>, branch=None, merge_target=None, pkg=None, work_dir=None, ncores=2, test_paths='/home/casatest/casa6/casatasks/tests/tasks,/home/casatest/casa6/casatasks/tests/scripts', test_list=None, test_config=None, test_group='casatasks', pmode=None, bamboo=False, cachedir=None, ignore_list='test_casampi,test_task_msview,test_task_imview,test_task_plotms', run_skipped=False, only_skipped=False)
27-Oct-2026 20:03:31
27-Oct-2026 20:03:31 Operating system: Linux
27-Oct-2026 20:03:31
27-Oct-2026 20:03:31 Testing Components['casatasks']
27-Oct-2026 20:03:31
27-Oct-2026 20:03:31 Arguments Sent Direct To Pytest :  []
27-Oct-2026 20:03:31
27-Oct-2026 20:03:31 Tests to Ignore:  ['test_casampi', 'test_task_msview', 'test_task_imview', 'test_task_plotms']
27-Oct-2026 20:03:31 Running 127 Test(s)
27-Oct-2026 20:03:31 Cleaning: /home/casatest/casa6/casatestutils/nosedir/
27-Oct-2026 20:03:31 Tests: ['/home/casatest/casa6/casatasks/tests/scripts/test_casaxmlutil.py', '/home/casatest/casa6/casatasks/tests/scripts/test_flaghelper.py', '/home/casatest/casa6/casatasks/tests/scripts/test_imagerhelpers_gclean.py', '/home/casatest/casa6/casatasks/tests/scripts/test_jyperk.py', '/home/casatest/casa6/casatasks/tests/tasks/test_task_accor.py', '/home/casatest/casa6/casatasks/tests/tasks/test_task_appendantab.py', '/home/casatest/casa6/casatasks/tests/tasks/test_task_applycal.py', '/home/casatest/casa6/casatasks/tests/tasks/test_task_asdmsummary.py', '/home/casatest/casa6/casatasks/tests/tasks/test_task_bandpass.py', '/home/casatest/casa6/casatasks/tests/tasks/test_task_blcal.py', '/home/casatest/casa6/casatasks/tests/tasks/test_task_calstat.py', '/home/casatest/casa6/casatasks/tests/tasks/test_task_clearcal.py', '/home/casatest/casa6/casatasks/tests/tasks/test_task_clearstat.py', '/home/casatest/casa6/casatasks/tests/tasks/test_task_concat.py', '/home/casatest/casa6/casatasks/tests/tasks/test_task_conjugatevis.py', '/home/casatest/casa6/casatasks/tests/tasks/test_task_cvel.py', '/home/casatest/casa6/casatasks/tests/tasks/test_task_cvel2.py', '/home/casatest/casa6/casatasks/tests/tasks/test_task_deconvolve.py', '/home/casatest/casa6/casatasks/tests/tasks/test_task_defintent.py', '/home/casatest/casa6/casatasks/tests/tasks/test_task_delmod.py', '/home/casatest/casa6/casatasks/tests/tasks/test_task_exportantab.py', '/home/casatest/casa6/casatasks/tests/tasks/test_task_exportasdm.py', '/home/casatest/casa6/casatasks/tests/tasks/test_task_exportfits.py', '/home/casatest/casa6/casatasks/tests/tasks/test_task_exportuvfits.py', '/home/casatest/casa6/casatasks/tests/tasks/test_task_feather.py', '/home/casatest/casa6/casatasks/tests/tasks/test_task_fixplanets.py', '/home/casatest/casa6/casatasks/tests/tasks/test_task_fixvis.py', '/home/casatest/casa6/casatasks/tests/tasks/test_task_flagcmd.py', '/home/casatest/casa6/casatasks/tests/tasks/test_task_flagdata.py', '/home/casatest/casa6/casatasks/tests/tasks/test_task_flagmanager.py', '/home/casatest/casa6/casatasks/tests/tasks/test_task_fluxscale.py', '/home/casatest/casa6/casatasks/tests/tasks/test_task_fringefit.py', '/home/casatest/casa6/casatasks/tests/tasks/test_task_ft.py', '/home/casatest/casa6/casatasks/tests/tasks/test_task_gaincal.py', '/home/casatest/casa6/casatasks/tests/tasks/test_task_gencal.py', '/home/casatest/casa6/casatasks/tests/tasks/test_task_getantposalma.py', '/home/casatest/casa6/casatasks/tests/tasks/test_task_getcalmodvla.py', '/home/casatest/casa6/casatasks/tests/tasks/test_task_getephemtable.py', '/home/casatest/casa6/casatasks/tests/tasks/test_task_getjyperkalma.py', '/home/casatest/casa6/casatasks/tests/tasks/test_task_hanningsmooth.py', '/home/casatest/casa6/casatasks/tests/tasks/test_task_imbaseline.py', '/home/casatest/casa6/casatasks/tests/tasks/test_task_imcollapse.py', '/home/casatest/casa6/casatasks/tests/tasks/test_task_imcontsub.py', '/home/casatest/casa6/casatasks/tests/tasks/test_task_imdev.py', '/home/casatest/casa6/casatasks/tests/tasks/test_task_imfit.py', '/home/casatest/casa6/casatasks/tests/tasks/test_task_imhead.py', '/home/casatest/casa6/casatasks/tests/tasks/test_task_imhistory.py', '/home/casatest/casa6/casatasks/tests/tasks/test_task_immath.py', '/home/casatest/casa6/casatasks/tests/tasks/test_task_immoments.py', '/home/casatest/casa6/casatasks/tests/tasks/test_task_impbcor.py', '/home/casatest/casa6/casatasks/tests/tasks/test_task_importasap.py', '/home/casatest/casa6/casatasks/tests/tasks/test_task_importasdm.py', '/home/casatest/casa6/casatasks/tests/tasks/test_task_importatca.py', '/home/casatest/casa6/casatasks/tests/tasks/test_task_importfitsidi.py', '/home/casatest/casa6/casatasks/tests/tasks/test_task_importmiriad.py', '/home/casatest/casa6/casatasks/tests/tasks/test_task_importnro.py', '/home/casatest/casa6/casatasks/tests/tasks/test_task_importuvfits.py', '/home/casatest/casa6/casatasks/tests/tasks/test_task_importvla.py', '/home/casatest/casa6/casatasks/tests/tasks/test_task_impv.py', '/home/casatest/casa6/casatasks/tests/tasks/test_task_imrebin.py', '/home/casatest/casa6/casatasks/tests/tasks/test_task_imreframe.py', '/home/casatest/casa6/casatasks/tests/tasks/test_task_imregrid.py', '/home/casatest/casa6/casatasks/tests/tasks/test_task_imsmooth.py', '/home/casatest/casa6/casatasks/tests/tasks/test_task_imstat.py', '/home/casatest/casa6/casatasks/tests/tasks/test_task_imsubimage.py', '/home/casatest/casa6/casatasks/tests/tasks/test_task_imtrans.py', '/home/casatest/casa6/casatasks/tests/tasks/test_task_imval.py', '/home/casatest/casa6/casatasks/tests/tasks/test_task_initweights.py', '/home/casatest/casa6/casatasks/tests/tasks/test_task_listcal.py', '/home/casatest/casa6/casatasks/tests/tasks/test_task_listfits.py', '/home/casatest/casa6/casatasks/tests/tasks/test_task_listhistory.py', '/home/casatest/casa6/casatasks/tests/tasks/test_task_listobs.py', '/home/casatest/casa6/casatasks/tests/tasks/test_task_listpartition.py', '/home/casatest/casa6/casatasks/tests/tasks/test_task_listsdm.py', '/home/casatest/casa6/casatasks/tests/tasks/test_task_listvis.py', '/home/casatest/casa6/casatasks/tests/tasks/test_task_makemask.py', '/home/casatest/casa6/casatasks/tests/tasks/test_task_mstransform.py', '/home/casatest/casa6/casatasks/tests/tasks/test_task_mstransform_mms.py', '/home/casatest/casa6/casatasks/tests/tasks/test_task_msuvbinflag.py', '/home/casatest/casa6/casatasks/tests/tasks/test_task_nrobeamaverage.py', '/home/casatest/casa6/casatasks/tests/tasks/test_task_partition.py', '/home/casatest/casa6/casatasks/tests/tasks/test_task_pccor.py', '/home/casatest/casa6/casatasks/tests/tasks/test_task_phaseshift.py', '/home/casatest/casa6/casatasks/tests/tasks/test_task_plotants.py', '/home/casatest/casa6/casatasks/tests/tasks/test_task_plotbandpass.py', '/home/casatest/casa6/casatasks/tests/tasks/test_task_plotprofilemap.py', '/home/casatest/casa6/casatasks/tests/tasks/test_task_plotweather.py', '/home/casatest/casa6/casatasks/tests/tasks/test_task_polcal.py', '/home/casatest/casa6/casatasks/tests/tasks/test_task_polfromgain.py', '/home/casatest/casa6/casatasks/tests/tasks/test_task_predictcomp.py', '/home/casatest/casa6/casatasks/tests/tasks/test_task_rerefant.py', '/home/casatest/casa6/casatasks/tests/tasks/test_task_rmfit.py', '/home/casatest/casa6/casatasks/tests/tasks/test_task_rmtables.py', '/home/casatest/casa6/casatasks/tests/tasks/test_task_sdatmcor.py', '/home/casatest/casa6/casatasks/tests/tasks/test_task_sdbaseline.py', '/home/casatest/casa6/casatasks/tests/tasks/test_task_sdcal.py', '/home/casatest/casa6/casatasks/tests/tasks/test_task_sdfit.py', '/home/casatest/casa6/casatasks/tests/tasks/test_task_sdfixscan.py', '/home/casatest/casa6/casatasks/tests/tasks/test_task_sdgaincal.py', '/home/casatest/casa6/casatasks/tests/tasks/test_task_sdintimaging.py', '/home/casatest/casa6/casatasks/tests/tasks/test_task_sdpolaverage.py', '/home/casatest/casa6/casatasks/tests/tasks/test_task_sdsidebandsplit.py', '/home/casatest/casa6/casatasks/tests/tasks/test_task_sdsmooth.py', '/home/casatest/casa6/casatasks/tests/tasks/test_task_sdtimeaverage.py', '/home/casatest/casa6/casatasks/tests/tasks/test_task_setjy.py', '/home/casatest/casa6/casatasks/tests/tasks/test_task_simanalyze.py', '/home/casatest/casa6/casatasks/tests/tasks/test_task_simobserve.py', '/home/casatest/casa6/casatasks/tests/tasks/test_task_slsearch.py', '/home/casatest/casa6/casatasks/tests/tasks/test_task_smoothcal.py', '/home/casatest/casa6/casatasks/tests/tasks/test_task_specfit.py', '/home/casatest/casa6/casatasks/tests/tasks/test_task_specflux.py', '/home/casatest/casa6/casatasks/tests/tasks/test_task_specsmooth.py', '/home/casatest/casa6/casatasks/tests/tasks/test_task_splattotable.py', '/home/casatest/casa6/casatasks/tests/tasks/test_task_split.py', '/home/casatest/casa6/casatasks/tests/tasks/test_task_spxfit.py', '/home/casatest/casa6/casatasks/tests/tasks/test_task_statwt.py', '/home/casatest/casa6/casatasks/tests/tasks/test_task_tclean.py', '/home/casatest/casa6/casatasks/tests/tasks/test_task_testconcat.py', '/home/casatest/casa6/casatasks/tests/tasks/test_task_tsdimaging.py', '/home/casatest/casa6/casatasks/tests/tasks/test_task_uvcontsub.py', '/home/casatest/casa6/casatasks/tests/tasks/test_task_uvcontsub_old.py', '/home/casatest/casa6/casatasks/tests/tasks/test_task_uvmodelfit.py', '/home/casatest/casa6/casatasks/tests/tasks/test_task_virtualconcat.py', '/home/casatest/casa6/casatasks/tests/tasks/test_task_vishead.py', '/home/casatest/casa6/casatasks/tests/tasks/test_task_visstat.py', '/home/casatest/casa6/casatasks/tests/tasks/test_task_wvrgcal.py', '/home/casatest/casa6/casatasks/tests/tasks/test_task_zenithdelaycal.py']============================= test session starts ==============================
27-Oct-2026 20:03:31 platform linux -- Python 3.12.9, pytest-9.2.0, pluggy-1.7.0 -- /home/casatest/venv/bin/python3.12
27-Oct-2026 20:03:31 cachedir: .pytest_cache
27-Oct-2026 20:03:31 rootdir: /home/casatest/casa6/casatestutils/nosedir/test_task_getantposalma
27-Oct-2026 20:03:31 configfile: pytest.ini
27-Oct-2026 20:03:33 collecting ... collected 4 items
27-Oct-2026 20:03:33 INTERNALERROR> Traceback (most recent call last):
27-Oct-2026 20:03:33 INTERNALERROR>   File "/home/casatest/venv/lib/python3.12/site-packages/_pytest/main.py", line 333, in wrap_session
27-Oct-2026 20:03:33 INTERNALERROR>     session.exitstatus = doit(config, session) or 0
27-Oct-2026 20:03:33 INTERNALERROR>                          ^^^^^^^^^^^^^^^^^^^^^
27-Oct-2026 20:03:33 INTERNALERROR>   File "/home/casatest/venv/lib/python3.12/site-packages/_pytest/main.py", line 387, in _main
27-Oct-2026 20:03:33 INTERNALERROR>     config.hook.pytest_runtestloop(session=session)
27-Oct-2026 20:03:33 INTERNALERROR>   File "/home/casatest/venv/lib/python3.12/site-packages/pluggy/_caller.py", line 197, in __call__
27-Oct-2026 20:03:33 INTERNALERROR>     return self._hookexec(
27-Oct-2026 20:03:33 INTERNALERROR>            ^^^^^^^^^^^^^^^
27-Oct-2026 20:03:33 INTERNALERROR>   File "/home/casatest/venv/lib/python3.12/site-packages/pluggy/_manager.py", line 183, in _hookexec
27-Oct-2026 20:03:33 INTERNALERROR>     return self._inner_hookexec(hook_name, methods, kwargs, firstresult)
27-Oct-2026 20:03:33 INTERNALERROR>            ^^^^^^^^^^^^^^^^^^^^^^^^^^^^^^^^^^^^^^^^^^^^^^^^^^^^^^^^^^^^^
27-Oct-2026 20:03:33 INTERNALERROR>   File "/home/casatest/venv/lib/python3.12/site-packages/pluggy/_execution.py", line 195, in _multicall
27-Oct-2026 20:03:33 INTERNALERROR>     raise exception
27-Oct-2026 20:03:33 INTERNALERROR>   File "/home/casatest/venv/lib/python3.12/site-packages/pluggy/_execution.py", line 167, in _multicall
27-Oct-2026 20:03:33 INTERNALERROR>     teardown.throw(exception)
27-Oct-2026 20:03:33 INTERNALERROR>   File "/home/casatest/venv/lib/python3.12/site-packages/_pytest/logging.py", line 829, in pytest_runtestloop
27-Oct-2026 20:03:33 INTERNALERROR>     return (yield)  # Run all the tests.
27-Oct-2026 20:03:33 INTERNALERROR>             ^^^^^
27-Oct-2026 20:03:33 INTERNALERROR>   File "/home/casatest/venv/lib/python3.12/site-packages/pluggy/_execution.py", line 167, in _multicall
27-Oct-2026 20:03:33 INTERNALERROR>     teardown.throw(exception)
27-Oct-2026 20:03:33 INTERNALERROR>   File "/home/casatest/venv/lib/python3.12/site-packages/_pytest/terminal.py", line 723, in pytest_runtestloop
27-Oct-2026 20:03:33 INTERNALERROR>     result = yield
27-Oct-2026 20:03:33 INTERNALERROR>              ^^^^^
27-Oct-2026 20:03:33 INTERNALERROR>   File "/home/casatest/venv/lib/python3.12/site-packages/pluggy/_execution.py", line 147, in _multicall
27-Oct-2026 20:03:33 INTERNALERROR>     res = hook_impl.function(*args)
27-Oct-2026 20:03:33 INTERNALERROR>           ^^^^^^^^^^^^^^^^^^^^^^^^^
27-Oct-2026 20:03:33 INTERNALERROR>   File "/home/casatest/venv/lib/python3.12/site-packages/_pytest/main.py", line 411, in pytest_runtestloop
27-Oct-2026 20:03:33 INTERNALERROR>     item.config.hook.pytest_runtest_protocol(item=item, nextitem=nextitem)
27-Oct-2026 20:03:33 INTERNALERROR>   File "/home/casatest/venv/lib/python3.12/site-packages/pluggy/_caller.py", line 197, in __call__
27-Oct-2026 20:03:33 INTERNALERROR>     return self._hookexec(
27-Oct-2026 20:03:33 INTERNALERROR>            ^^^^^^^^^^^^^^^
27-Oct-2026 20:03:33 INTERNALERROR>   File "/home/casatest/venv/lib/python3.12/site-packages/pluggy/_manager.py", line 183, in _hookexec
27-Oct-2026 20:03:33 INTERNALERROR>     return self._inner_hookexec(hook_name, methods, kwargs, firstresult)
27-Oct-2026 20:03:33 INTERNALERROR>            ^^^^^^^^^^^^^^^^^^^^^^^^^^^^^^^^^^^^^^^^^^^^^^^^^^^^^^^^^^^^^
27-Oct-2026 20:03:33 INTERNALERROR>   File "/home/casatest/venv/lib/python3.12/site-packages/pluggy/_execution.py", line 195, in _multicall
27-Oct-2026 20:03:33 INTERNALERROR>     raise exception
27-Oct-2026 20:03:33 INTERNALERROR>   File "/home/casatest/venv/lib/python3.12/site-packages/pluggy/_execution.py", line 167, in _multicall
27-Oct-2026 20:03:33 INTERNALERROR>     teardown.throw(exception)
27-Oct-2026 20:03:33 INTERNALERROR>   File "/home/casatest/venv/lib/python3.12/site-packages/_pytest/warnings.py", line 75, in pytest_runtest_protocol
27-Oct-2026 20:03:33 INTERNALERROR>     return (yield)
27-Oct-2026 20:03:33 INTERNALERROR>             ^^^^^
27-Oct-2026 20:03:33 INTERNALERROR>   File "/home/casatest/venv/lib/python3.12/site-packages/pluggy/_execution.py", line 167, in _multicall
27-Oct-2026 20:03:33 INTERNALERROR>     teardown.throw(exception)
27-Oct-2026 20:03:33 INTERNALERROR>   File "/home/casatest/venv/lib/python3.12/site-packages/_pytest/assertion/__init__.py", line 212, in pytest_runtest_protocol
27-Oct-2026 20:03:33 INTERNALERROR>     return (yield)
27-Oct-2026 20:03:33 INTERNALERROR>             ^^^^^
27-Oct-2026 20:03:33 INTERNALERROR>   File "/home/casatest/venv/lib/python3.12/site-packages/pluggy/_execution.py", line 167, in _multicall
27-Oct-2026 20:03:33 INTERNALERROR>     teardown.throw(exception)
27-Oct-2026 20:03:33 INTERNALERROR>   File "/home/casatest/venv/lib/python3.12/site-packages/_pytest/unittest.py", line 610, in pytest_runtest_protocol
27-Oct-2026 20:03:33 INTERNALERROR>     return (yield)
27-Oct-2026 20:03:33 INTERNALERROR>             ^^^^^
27-Oct-2026 20:03:33 INTERNALERROR>   File "/home/casatest/venv/lib/python3.12/site-packages/pluggy/_execution.py", line 167, in _multicall
27-Oct-2026 20:03:33 INTERNALERROR>     teardown.throw(exception)
27-Oct-2026 20:03:33 INTERNALERROR>   File "/home/casatest/venv/lib/python3.12/site-packages/_pytest/faulthandler.py", line 102, in pytest_runtest_protocol
27-Oct-2026 20:03:33 INTERNALERROR>     return (yield)
27-Oct-2026 20:03:33 INTERNALERROR>             ^^^^^
27-Oct-2026 20:03:33 INTERNALERROR>   File "/home/casatest/venv/lib/python3.12/site-packages/pluggy/_execution.py", line 147, in _multicall
27-Oct-2026 20:03:33 INTERNALERROR>     res = hook_impl.function(*args)
27-Oct-2026 20:03:33 INTERNALERROR>           ^^^^^^^^^^^^^^^^^^^^^^^^^
27-Oct-2026 20:03:33 INTERNALERROR>   File "/home/casatest/casa6/casatestutils/nosedir/test_task_getantposalma/conftest.py", line 24, in pytest_runtest_protocol
27-Oct-2026 20:03:33 INTERNALERROR>     self.funcn = item._nodeid
27-Oct-2026 20:03:33 INTERNALERROR>                  ^^^^^^^^^^^^
27-Oct-2026 20:03:33 INTERNALERROR> AttributeError: 'TestCaseFunction' object has no attribute '_nodeid'. Did you mean: 'nodeid'?
27-Oct-2026 20:03:33
27-Oct-2026 20:03:33 ============================== 1 warning in 1.52s ==============================
27-Oct-2026 20:03:33 Traceback (most recent call last):
27-Oct-2026 20:03:33   File "/home/casatest/casa6/casatestutils/runtest.py", line 1526, in <module>
27-Oct-2026 20:03:33     run(
27-Oct-2026 20:03:33   File "/home/casatest/casa6/casatestutils/runtest.py", line 1170, in run
27-Oct-2026 20:03:33     setup_and_run(cmd, workdir, workpath, dirname, DRY_RUN, pytest_args )
27-Oct-2026 20:03:33   File "/home/casatest/casa6/casatestutils/runtest.py", line 1016, in setup_and_run
27-Oct-2026 20:03:33     update_xml(xmlfile, result, name=os.getcwd().split("/")[-1])
27-Oct-2026 20:03:33   File "/home/casatest/casa6/casatestutils/runtest.py", line 581, in update_xml
27-Oct-2026 20:03:33     testclass = element.attrib["classname"].split(".")[1]
27-Oct-2026 20:03:33                 ~~~~~~~~~~~~~~~~~~~~~~~~~~~~~~~~~~~~~~^^^
27-Oct-2026 20:03:33 IndexError: list index out of range
27-Oct-2026 20:03:33
27-Oct-2026 20:03:33
27-Oct-2026 20:03:33 Setting Working Directory: /home/casatest/casa6/casatestutils/nosedir/test_task_getantposalma/
27-Oct-2026 20:03:33 Test Directory: /home/casatest/casa6/casatestutils/nosedir/test_task_getantposalma
27-Oct-2026 20:03:33
27-Oct-2026 20:03:33 Running Command: pytest --junitxml=/home/casatest/casa6/casatestutils/nosedir/xml/test_task_getantposalma/nose.xml -s --disable-pytest-warnings --verbose -ra --tb=short /home/casatest/casa6/casatestutils/nosedir/test_task_getantposalma/
27-Oct-2026 20:03:35 total 80644
27-Oct-2026 20:03:35 -rw-r--r-- 1 casaci 15001  1072247 Oct 28 00:01 casashell-6.8.0.2-py3-none-any.whl
27-Oct-2026 20:03:35 -rw-r--r-- 1 casaci 15001  1951039 Oct 28 00:01 casatasks-6.8.0.2-py3-none-any.whl
27-Oct-2026 20:03:35 -rw-r--r-- 1 casaci root     16060 Oct 28 00:03 casatasks_test.log
27-Oct-2026 20:03:35 -rw-r--r-- 1 casaci 15001   161031 Oct 28 00:01 casatestutils-6.8.0.2-py3-none-any.whl
27-Oct-2026 20:03:35 -rw-r--r-- 1 casaci 15001 79357138 Oct 28 00:01 casatools-6.8.0.2-cp312-cp312-manylinux_2_28_x86_64.whl
27-Oct-2026 20:03:35 -rw-r--r-- 1 casaci root       870 Oct 28 00:03 requirements.txt
27-Oct-2026 20:03:35 -rw-r--r-- 1 casaci root      4364 Oct 28 00:03 test_task_getantposalma.xml
27-Oct-2026 20:03:35 Finished task 'Test wheel' with result: Success
27-Oct-2026 20:03:35 Starting task 'Inject is_641' of type 'com.atlassian.bamboo.plugins.bamboo-variable-inject-plugin:inject'
27-Oct-2026 20:03:35 Injected variable bamboo.inject.is_641=False in LOCAL scope
27-Oct-2026 20:03:35 Finished task 'Inject is_641' with result: Success
27-Oct-2026 20:03:35
Substituting variable: ${bamboo.planRepository.branchName} with master
27-Oct-2026 20:03:35
Substituting variable: ${bamboo.python_version} with 3.12
27-Oct-2026 20:03:35
Substituting variable: ${bamboo.agentId} with 153550855
27-Oct-2026 20:03:35
Substituting variable: ${bamboo.agentId} with 153550855
27-Oct-2026 20:03:35
Substituting variable: ${bamboo.agentId} with 153550855
27-Oct-2026 20:03:35
Substituting variable: ${bamboo.agentId} with 153550855
27-Oct-2026 20:03:35 Starting task 'Tar work directory' of type 'com.atlassian.bamboo.plugins.scripttask:task.builder.script'
27-Oct-2026 20:03:35
Beginning to execute external process for build 'CASASPECS - Master Test 3.12 - Test Tasks Many Linux 2.28 Rocky 8.10 Py3.12 #296 (CASASPECS-MASTERTESTPY312-TTM228PY38-296)'
... running command line:
/opt/ci_workspace/casa/bamboo/agent7/temp/CASASPECS-MASTERTESTPY312-TTM228PY38-296-ScriptBuildTask-12023070048964343086.sh
... in: /opt/ci_workspace/casa/bamboo/agent7/xml-data/build-dir/CASASPECS-MASTERTESTPY312-TTM228PY38
27-Oct-2026 20:03:35 Package working directory
27-Oct-2026 20:03:35 nosedir/
27-Oct-2026 20:03:35 nosedir/test_task_getantposalma/
27-Oct-2026 20:03:35 nosedir/test_task_getantposalma/test_task_getantposalma.py
27-Oct-2026 20:03:35 nosedir/test_task_getantposalma/pytest.ini
27-Oct-2026 20:03:35 nosedir/test_task_getantposalma/conftest.py
27-Oct-2026 20:03:35 nosedir/test_task_getantposalma/casa-20261028-000332.log
27-Oct-2026 20:03:35 nosedir/xml/
27-Oct-2026 20:03:35 nosedir/xml/test_task_getantposalma/
27-Oct-2026 20:03:35 nosedir/xml/test_task_getantposalma/nose.xml
27-Oct-2026 20:03:35 nosedir/requirements.txt
27-Oct-2026 20:03:35 total 80652
27-Oct-2026 20:03:35 -rw-r--r-- 1 casaci 15001  1072247 Oct 28 00:01 casashell-6.8.0.2-py3-none-any.whl
27-Oct-2026 20:03:35 -rw-r--r-- 1 casaci 15001  1951039 Oct 28 00:01 casatasks-6.8.0.2-py3-none-any.whl
27-Oct-2026 20:03:35 -rw-r--r-- 1 casaci root     16060 Oct 28 00:03 casatasks_test.log
27-Oct-2026 20:03:35 -rw-r--r-- 1 casaci 15001   161031 Oct 28 00:01 casatestutils-6.8.0.2-py3-none-any.whl
27-Oct-2026 20:03:35 -rw-r--r-- 1 casaci 15001 79357138 Oct 28 00:01 casatools-6.8.0.2-cp312-cp312-manylinux_2_28_x86_64.whl
27-Oct-2026 20:03:35 -rw-r--r-- 1 casaci root       870 Oct 28 00:03 requirements.txt
27-Oct-2026 20:03:35 -rw-r--r-- 1 casaci root      4364 Oct 28 00:03 test_task_getantposalma.xml
27-Oct-2026 20:03:35 -rw-r--r-- 1 casaci root      6034 Oct 28 00:03 work-manylinux_228_casatasks-3.12.tar.gz
27-Oct-2026 20:03:35 Done packaging working directory
27-Oct-2026 20:03:35 Finished task 'Tar work directory' with result: Success
27-Oct-2026 20:03:35 Starting task 'Parse tests' of type 'com.atlassian.bamboo.plugins.testresultparser:task.testresultparser.junit'
27-Oct-2026 20:03:35 Parsing test results under /opt/ci_workspace/casa/bamboo/agent7/xml-data/build-dir/CASASPECS-MASTERTESTPY312-TTM228PY38...
27-Oct-2026 20:03:35 Failing task since 1 failing test cases were found.
27-Oct-2026 20:03:35 Finished task 'Parse tests' with result: Failed
27-Oct-2026 20:03:35 Running post build plugin 'Docker Container Cleanup'
27-Oct-2026 20:03:35
Beginning to execute external process for build 'CASASPECS - Master Test 3.12 - Test Tasks Many Linux 2.28 Rocky 8.10 Py3.12 #296 (CASASPECS-MASTERTESTPY312-TTM228PY38-296)'
... running command line:
/usr/bin/docker rm -f wheel-container-test-153550855
... in: /opt/ci_workspace/casa/bamboo/agent7/xml-data/build-dir/CASASPECS-MASTERTESTPY312-TTM228PY38
27-Oct-2026 20:03:37 wheel-container-test-153550855
27-Oct-2026 20:03:37 Running post build plugin 'NCover Results Collector'
27-Oct-2026 20:03:37 Running post build plugin 'Build Results Label Collector'
27-Oct-2026 20:03:37 Running post build plugin 'Clover Results Collector'
27-Oct-2026 20:03:37 Running post build plugin 'npm Cache Cleanup'
27-Oct-2026 20:03:37 Running post build plugin 'Artifact Copier'
27-Oct-2026 20:03:37 Publishing an artifact: Workdir
27-Oct-2026 20:03:37 Finished publishing of artifact Non required job artifact Http Compression On : [Workdir], patterns: [work*.tar.gz] anchored at: [wheeldirectory/] in 57.57 ms
27-Oct-2026 20:03:37 Publishing an artifact: requirements.txt
27-Oct-2026 20:03:37 Finished publishing of artifact Non required job artifact Http Compression On : [requirements.txt], patterns: [requirements.txt] anchored at: [wheeldirectory/] in 15.59 ms
27-Oct-2026 20:03:37 Publishing an artifact: XML Directories
27-Oct-2026 20:03:37 Finished publishing of artifact Non required job artifact Http Compression On : [XML Directories], patterns: [**/*.xml] anchored at: [wheeldirectory/] in 14.83 ms
27-Oct-2026 20:03:37 Finalising the build...
27-Oct-2026 20:03:37 Stopping timer.
27-Oct-2026 20:03:37 Build CASASPECS-MASTERTESTPY312-TTM228PY38-296 completed.
27-Oct-2026 20:03:37 Running on server: post build plugin 'Build Hanging Detection Configuration'
27-Oct-2026 20:03:37 Running on server: post build plugin 'NCover Results Collector'
27-Oct-2026 20:03:37 Running on server: post build plugin 'Build Labeller'
27-Oct-2026 20:03:37 Running on server: post build plugin 'Clover Delta Calculator'
27-Oct-2026 20:03:37 Running on server: post build plugin 'Maven Dependencies Postprocessor'
27-Oct-2026 20:03:37 All post build plugins have finished
27-Oct-2026 20:03:37 Generating build results summary...
27-Oct-2026 20:03:37 Saving build results to disk...
27-Oct-2026 20:03:37 Store variable context...
27-Oct-2026 20:03:37 Finished building CASASPECS-MASTERTESTPY312-TTM228PY38-296.