Tools and Tasks tests for Python 3.12
Build: #296 failed
Job: Test Tools Many Linux 2.28 Rocky 8.10 Py3.12 failed
Job result summary
- Completed
- Duration
- 3 minutes
- Agent
- casaci-4.cv.nrao.edu test agent3
- Revision
-
188b64ce030a360ced17720a68d5af3bbcffaf87
- Total tests
- 1
- Fixed in
- #297 (Child of CASASPECS-MASTERBUILDCASALITH-305)
Tests
- 1 test in total
- 1 test failed
- 1 failure is new
- < 1 second taken in total.
| Status | Test | Duration | |
|---|---|---|---|
| Collapse |
pytest
internal
|
< 1 sec | |
internal error
Traceback (most recent call last):
File "/home/casatest/venv/lib/python3.12/site-packages/_pytest/main.py", line 333, in wrap_session
session.exitstatus = doit(config, session) or 0
^^^^^^^^^^^^^^^^^^^^^
File "/home/casatest/venv/lib/python3.12/site-packages/_pytest/main.py", line 387, in _main
config.hook.pytest_runtestloop(session=session)
File "/home/casatest/venv/lib/python3.12/site-packages/pluggy/_caller.py", line 197, in __call__
(57 more lines...)
|
|||
Error summary
The build generated some errors. See the full build log for more details.
Error response from daemon: No such container: wheel-container-test-153550851
Error response from daemon: No such container: wheel-container-test-153550851
% Total % Received % Xferd Average Speed Time Time Time Current
Dload Upload Total Spent Left Speed
0 0 0 0 0 0 0 0 --:--:-- --:--:-- --:--:-- 0
100 6002k 100 6002k 0 0 108M 0 --:--:-- --:--:-- --:--:-- 108M
[467700] Failed to execute script 'atlutil' due to unhandled exception!
Traceback (most recent call last):
File "atlutil.py", line 200, in <module>
File "atlutil.py", line 165, in has_fix_version
KeyError: 'fields'
Already on 'master'
% Total % Received % Xferd Average Speed Time Time Time Current
Dload Upload Total Spent Left Speed
0 0 0 0 0 0 0 0 --:--:-- --:--:-- --:--:-- 0
100 669 0 669 0 0 51461 0 --:--:-- --:--:-- --:--:-- 51461
Traceback (most recent call last):
File "/home/casatest/casa6/casatestutils/runtest.py", line 1526, in <module>
run(
File "/home/casatest/casa6/casatestutils/runtest.py", line 1135, in run
setup_and_run(cmd, workdir, workpath, dirname, DRY_RUN , pytest_args)
File "/home/casatest/casa6/casatestutils/runtest.py", line 1016, in setup_and_run
update_xml(xmlfile, result, name=os.getcwd().split("/")[-1])
File "/home/casatest/casa6/casatestutils/runtest.py", line 581, in update_xml
testclass = element.attrib["classname"].split(".")[1]
~~~~~~~~~~~~~~~~~~~~~~~~~~~~~~~~~~~~~~^^^
IndexError: list index out of range
tar: nosedir: Cannot stat: No such file or directory
tar: Exiting with failure status due to previous errors
Error response from daemon: No such container: wheel-container-test-153550851
% Total % Received % Xferd Average Speed Time Time Time Current
Dload Upload Total Spent Left Speed
0 0 0 0 0 0 0 0 --:--:-- --:--:-- --:--:-- 0
100 6002k 100 6002k 0 0 108M 0 --:--:-- --:--:-- --:--:-- 108M
[467700] Failed to execute script 'atlutil' due to unhandled exception!
Traceback (most recent call last):
File "atlutil.py", line 200, in <module>
File "atlutil.py", line 165, in has_fix_version
KeyError: 'fields'
Already on 'master'
% Total % Received % Xferd Average Speed Time Time Time Current
Dload Upload Total Spent Left Speed
0 0 0 0 0 0 0 0 --:--:-- --:--:-- --:--:-- 0
100 669 0 669 0 0 51461 0 --:--:-- --:--:-- --:--:-- 51461
Traceback (most recent call last):
File "/home/casatest/casa6/casatestutils/runtest.py", line 1526, in <module>
run(
File "/home/casatest/casa6/casatestutils/runtest.py", line 1135, in run
setup_and_run(cmd, workdir, workpath, dirname, DRY_RUN , pytest_args)
File "/home/casatest/casa6/casatestutils/runtest.py", line 1016, in setup_and_run
update_xml(xmlfile, result, name=os.getcwd().split("/")[-1])
File "/home/casatest/casa6/casatestutils/runtest.py", line 581, in update_xml
testclass = element.attrib["classname"].split(".")[1]
~~~~~~~~~~~~~~~~~~~~~~~~~~~~~~~~~~~~~~^^^
IndexError: list index out of range
tar: nosedir: Cannot stat: No such file or directory
tar: Exiting with failure status due to previous errors