Tools and Tasks tests for Python 3.12
Build: #296 failed
Job: Test Tools ARM macOS 26 Py3.12 failed
Job result summary
- Completed
- Duration
- 5 minutes
- Agent
- cbt-macos26-test-m4-2
- Revision
-
188b64ce030a360ced17720a68d5af3bbcffaf87
- Total tests
- 1
- Fixed in
- #297 (Child of CASASPECS-MASTERBUILDCASALITH-305)
Tests
- 1 test in total
- 1 test failed
- 1 failure is new
- < 1 second taken in total.
| Status | Test | Duration | |
|---|---|---|---|
| Collapse |
pytest
internal
|
< 1 sec | |
internal error
Traceback (most recent call last):
File "/Users/casaci/bamboohome/xml-data/build-dir/CASASPECS-MASTERTESTPY312-TTOARM26PY312/casa6testenv/lib/python3.12/site-packages/_pytest/main.py", line 333, in wrap_session
session.exitstatus = doit(config, session) or 0
^^^^^^^^^^^^^^^^^^^^^
File "/Users/casaci/bamboohome/xml-data/build-dir/CASASPECS-MASTERTESTPY312-TTOARM26PY312/casa6testenv/lib/python3.12/site-packages/_pytest/main.py", line 387, in _main
config.hook.pytest_runtestloop(session=session)
File "/Users/casaci/bamboohome/xml-data/build-dir/CASASPECS-MASTERTESTPY312-TTOARM26PY312/casa6testenv/lib/python3.12/site-packages/pluggy/_caller.py", line 197, in __call__
(57 more lines...)
|
|||
Error summary
The build generated some errors. See the full build log for more details.
% Total % Received % Xferd Average Speed Time Time Time Current
Dload Upload Total Spent Left Speed
0 0 0 0 0 0 0 0 --:--:-- --:--:-- --:--:-- 0
0 6554k 0 15890 0 0 106k 0 0:01:01 --:--:-- 0:01:01 106k
100 6554k 100 6554k 0 0 19.3M 0 --:--:-- --:--:-- --:--:-- 19.3M
arch: posix_spawnp: ./atlutil: Bad CPU type in executable
Already on 'master'
% Total % Received % Xferd Average Speed Time Time Time Current
Dload Upload Total Spent Left Speed
0 0 0 0 0 0 0 0 --:--:-- --:--:-- --:--:-- 0
100 669 0 669 0 0 54253 0 --:--:-- --:--:-- --:--:-- 55750
Traceback (most recent call last):
File "/Users/casaci/bamboohome/xml-data/build-dir/CASASPECS-MASTERTESTPY312-TTOARM26PY312/casa6/casatestutils/runtest.py", line 1526, in <module>
run(
File "/Users/casaci/bamboohome/xml-data/build-dir/CASASPECS-MASTERTESTPY312-TTOARM26PY312/casa6/casatestutils/runtest.py", line 1135, in run
setup_and_run(cmd, workdir, workpath, dirname, DRY_RUN , pytest_args)
File "/Users/casaci/bamboohome/xml-data/build-dir/CASASPECS-MASTERTESTPY312-TTOARM26PY312/casa6/casatestutils/runtest.py", line 1016, in setup_and_run
update_xml(xmlfile, result, name=os.getcwd().split("/")[-1])
File "/Users/casaci/bamboohome/xml-data/build-dir/CASASPECS-MASTERTESTPY312-TTOARM26PY312/casa6/casatestutils/runtest.py", line 581, in update_xml
testclass = element.attrib["classname"].split(".")[1]
~~~~~~~~~~~~~~~~~~~~~~~~~~~~~~~~~~~~~~^^^
IndexError: list index out of range
a nosedir
a nosedir/xml
a nosedir/test_tool_linearmosaic
a nosedir/test_tool_linearmosaic/conftest.py
a nosedir/test_tool_linearmosaic/pytest.ini
a nosedir/test_tool_linearmosaic/casa-20261028-000555.log
a nosedir/test_tool_linearmosaic/test_tool_linearmosaic.py
a nosedir/xml/test_tool_linearmosaic
a nosedir/xml/test_tool_linearmosaic/nose.xml
Dload Upload Total Spent Left Speed
0 0 0 0 0 0 0 0 --:--:-- --:--:-- --:--:-- 0
0 6554k 0 15890 0 0 106k 0 0:01:01 --:--:-- 0:01:01 106k
100 6554k 100 6554k 0 0 19.3M 0 --:--:-- --:--:-- --:--:-- 19.3M
arch: posix_spawnp: ./atlutil: Bad CPU type in executable
Already on 'master'
% Total % Received % Xferd Average Speed Time Time Time Current
Dload Upload Total Spent Left Speed
0 0 0 0 0 0 0 0 --:--:-- --:--:-- --:--:-- 0
100 669 0 669 0 0 54253 0 --:--:-- --:--:-- --:--:-- 55750
Traceback (most recent call last):
File "/Users/casaci/bamboohome/xml-data/build-dir/CASASPECS-MASTERTESTPY312-TTOARM26PY312/casa6/casatestutils/runtest.py", line 1526, in <module>
run(
File "/Users/casaci/bamboohome/xml-data/build-dir/CASASPECS-MASTERTESTPY312-TTOARM26PY312/casa6/casatestutils/runtest.py", line 1135, in run
setup_and_run(cmd, workdir, workpath, dirname, DRY_RUN , pytest_args)
File "/Users/casaci/bamboohome/xml-data/build-dir/CASASPECS-MASTERTESTPY312-TTOARM26PY312/casa6/casatestutils/runtest.py", line 1016, in setup_and_run
update_xml(xmlfile, result, name=os.getcwd().split("/")[-1])
File "/Users/casaci/bamboohome/xml-data/build-dir/CASASPECS-MASTERTESTPY312-TTOARM26PY312/casa6/casatestutils/runtest.py", line 581, in update_xml
testclass = element.attrib["classname"].split(".")[1]
~~~~~~~~~~~~~~~~~~~~~~~~~~~~~~~~~~~~~~^^^
IndexError: list index out of range
a nosedir
a nosedir/xml
a nosedir/test_tool_linearmosaic
a nosedir/test_tool_linearmosaic/conftest.py
a nosedir/test_tool_linearmosaic/pytest.ini
a nosedir/test_tool_linearmosaic/casa-20261028-000555.log
a nosedir/test_tool_linearmosaic/test_tool_linearmosaic.py
a nosedir/xml/test_tool_linearmosaic
a nosedir/xml/test_tool_linearmosaic/nose.xml