Build: #189 failed

Job: Test Tasks Many Linux 2.28 Rocky 8.10 Py3.12 failed

Build log

The build generated 66,155 lines of output.   The output is too long and has been truncated to the last 1,000 lines. Download or view full build log.

24-Oct-2026 12:21:47 2026-10-24 12:21:48        SEVERE        sdcal::::casa+            raise RuntimeError('Output file name must be specified.')
24-Oct-2026 12:21:47 2026-10-24 12:21:48        SEVERE        sdcal::::casa+        RuntimeError: Output file name must be specified.
24-Oct-2026 12:21:47 2026-10-24 12:21:48        SEVERE        sdcal::::casa        Output file name must be specified.
24-Oct-2026 12:21:47 2026-10-24 12:21:48        SEVERE        sdcal::::casa        Task sdcal raised an exception of class RuntimeError with the following message: Output file name must be specified.
24-Oct-2026 12:21:47
24-Oct-2026 12:21:47 test_ps04 --- empty outfile.
24-Oct-2026 12:21:47 PASSED
24-Oct-2026 12:21:47
24-Oct-2026 12:21:47 test_task_sdcal.py::sdcal_test_ps::test_ps05 2026-10-24 12:21:48        WARN        sdcal::calibrater::setvi(bool,bool)        Already using OLD VisibilityIterator.
24-Oct-2026 12:21:48
24-Oct-2026 12:21:48 test_ps05 --- position switch calibration ('ps').
24-Oct-2026 12:21:48 PASSED
24-Oct-2026 12:21:48
24-Oct-2026 12:21:48 test_task_sdcal.py::sdcal_test_ps::test_ps05M 2026-10-24 12:21:48        WARN        ParallelDataHelper::getPartitionMap::casa        Number of subMSs (8) is greater than available scan,ddi pairs (4), setting nsubms to 4
24-Oct-2026 12:21:52 2026-10-24 12:21:52        WARN        sdcal::calibrater::setvi(bool,bool)        Already using OLD VisibilityIterator.
24-Oct-2026 12:21:52
24-Oct-2026 12:21:52 test_ps05M --- position switch calibration ('ps') for MMS.
24-Oct-2026 12:21:52 PASSED
24-Oct-2026 12:21:52
24-Oct-2026 12:21:52 test_task_sdcal.py::sdcal_test_ps::test_ps06 2026-10-24 12:21:53        WARN        sdcal::calibrater::setvi(bool,bool)        Already using OLD VisibilityIterator.
24-Oct-2026 12:21:52
24-Oct-2026 12:21:52 test_ps06 --- position switch calibration ('ps') with data selection.
24-Oct-2026 12:21:52 PASSED
24-Oct-2026 12:21:52
24-Oct-2026 12:21:53 test_task_sdcal.py::sdcal_test_ps::test_ps07 2026-10-24 12:21:53        WARN        sdcal::calibrater::setvi(bool,bool)        Already using OLD VisibilityIterator.
24-Oct-2026 12:21:53
24-Oct-2026 12:21:53 test_ps07 --- outfile exists (overwrite=True).
24-Oct-2026 12:21:53 PASSED
24-Oct-2026 12:21:53
24-Oct-2026 12:21:53 test_task_sdcal.py::sdcal_test_ps::test_ps08 2026-10-24 12:21:54        WARN        sdcal::calibrater::setvi(bool,bool)        Already using OLD VisibilityIterator.
24-Oct-2026 12:21:53 2026-10-24 12:21:54        SEVERE        sdcal::Calibrater::solve        Caught exception: Too many edge points (2 out of 1 points)
24-Oct-2026 12:21:53 2026-10-24 12:21:54        SEVERE        sdcal::::        Exception Reported: Error in Calibrater::solve.
24-Oct-2026 12:21:53 2026-10-24 12:21:54        SEVERE        sdcal::::casa        Traceback (most recent call last):
24-Oct-2026 12:21:53 2026-10-24 12:21:54        SEVERE        sdcal::::casa+                     ^^^^^^^^^^^^^^^^^^^^^
24-Oct-2026 12:21:53 2026-10-24 12:21:54        SEVERE        sdcal::::casa+          File "/home/casatest/venv/lib/python3.12/site-packages/casatasks/private/task_sdcal.py", line 157, in sdcal
24-Oct-2026 12:21:53 2026-10-24 12:21:54        SEVERE        sdcal::::casa+            cb.solve()
24-Oct-2026 12:21:53 2026-10-24 12:21:54        SEVERE        sdcal::::casa+          File "/home/casatest/venv/lib/python3.12/site-packages/casatools/calibrater.py", line 485, in solve
24-Oct-2026 12:21:53 2026-10-24 12:21:54        SEVERE        sdcal::::casa+            return self._swigobj.solve()
24-Oct-2026 12:21:53 2026-10-24 12:21:54        SEVERE        sdcal::::casa+                   ^^^^^^^^^^^^^^^^^^^^^
24-Oct-2026 12:21:53 2026-10-24 12:21:54        SEVERE        sdcal::::casa+          File "/home/casatest/venv/lib/python3.12/site-packages/casatools/__casac__/calibrater.py", line 1133, in solve
24-Oct-2026 12:21:53 2026-10-24 12:21:54        SEVERE        sdcal::::casa+            return _calibrater.calibrater_solve(self)
24-Oct-2026 12:21:53 2026-10-24 12:21:54        SEVERE        sdcal::::casa+                   ^^^^^^^^^^^^^^^^^^^^^^^^^^^^^^^^^^
24-Oct-2026 12:21:53 2026-10-24 12:21:54        SEVERE        sdcal::::casa+        RuntimeError: Error in Calibrater::solve.
24-Oct-2026 12:21:53 2026-10-24 12:21:54        SEVERE        sdcal::::casa        Error in Calibrater::solve.
24-Oct-2026 12:21:53 2026-10-24 12:21:54        SEVERE        sdcal::::casa        Task sdcal raised an exception of class RuntimeError with the following message: Error in Calibrater::solve.
24-Oct-2026 12:21:53
24-Oct-2026 12:21:53 test_ps08 --- inappropriate calmode ('otfraster').
24-Oct-2026 12:21:53 PASSED
24-Oct-2026 12:21:53
24-Oct-2026 12:21:53 test_task_sdcal.py::sdcal_test_bug_fix_cas_12712::test_cas_12712_01 2026-10-24 12:21:54        WARN        sdcal::calibrater::setvi(bool,bool)        Already using OLD VisibilityIterator.
24-Oct-2026 12:21:53
24-Oct-2026 12:21:53 PASSED
24-Oct-2026 12:21:53
24-Oct-2026 12:21:54 test_task_sdcal.py::sdcal_test_otfraster::test_otfraster00 2026-10-24 12:21:54        WARN        sdcal::calibrater::setvi(bool,bool)        Already using OLD VisibilityIterator.
24-Oct-2026 12:21:54 2026-10-24 12:21:54        SEVERE        sdcal::sdcal::casa        could not convert string to float: 'auto'
24-Oct-2026 12:21:54 2026-10-24 12:21:54        SEVERE        sdcal::::casa        Traceback (most recent call last):
24-Oct-2026 12:21:54 2026-10-24 12:21:54        SEVERE        sdcal::::casa+          File "/home/casatest/venv/lib/python3.12/site-packages/casatasks/private/task_sdcal.py", line 187, in to_numeric_fraction
24-Oct-2026 12:21:54 2026-10-24 12:21:54        SEVERE        sdcal::::casa+            fraction_numeric = float(fraction)
24-Oct-2026 12:21:54 2026-10-24 12:21:54        SEVERE        sdcal::::casa+                               ^^^^^^^^^^^^^^^
24-Oct-2026 12:21:54 2026-10-24 12:21:54        SEVERE        sdcal::::casa+        ValueError: could not convert string to float: 'auto'
24-Oct-2026 12:21:54 2026-10-24 12:21:54        SEVERE        sdcal::::casa+        
24-Oct-2026 12:21:54 2026-10-24 12:21:54        SEVERE        sdcal::::casa+        During handling of the above exception, another exception occurred:
24-Oct-2026 12:21:54 2026-10-24 12:21:54        SEVERE        sdcal::::casa+        
24-Oct-2026 12:21:54 2026-10-24 12:21:54        SEVERE        sdcal::::casa+        Traceback (most recent call last):
24-Oct-2026 12:21:54 2026-10-24 12:21:54        SEVERE        sdcal::::casa+                     ^^^^^^^^^^^^^^^^^^^^^
24-Oct-2026 12:21:54 2026-10-24 12:21:54        SEVERE        sdcal::::casa+          File "/home/casatest/venv/lib/python3.12/site-packages/casatasks/private/task_sdcal.py", line 149, in sdcal
24-Oct-2026 12:21:54 2026-10-24 12:21:54        SEVERE        sdcal::::casa+            fraction_numeric = to_numeric_fraction(fraction)
24-Oct-2026 12:21:54 2026-10-24 12:21:54        SEVERE        sdcal::::casa+                               ^^^^^^^^^^^^^^^^^^^^^^^^^^^^^
24-Oct-2026 12:21:54 2026-10-24 12:21:54        SEVERE        sdcal::::casa+          File "/home/casatest/venv/lib/python3.12/site-packages/casatasks/private/task_sdcal.py", line 192, in to_numeric_fraction
24-Oct-2026 12:21:54 2026-10-24 12:21:54        SEVERE        sdcal::::casa+            raise RuntimeError('Invalid fraction value (original error message: "%s")' % (str(e)))
24-Oct-2026 12:21:54 2026-10-24 12:21:54        SEVERE        sdcal::::casa+        RuntimeError: Invalid fraction value (original error message: "could not convert string to float: 'auto'")
24-Oct-2026 12:21:54 2026-10-24 12:21:54        SEVERE        sdcal::::casa        Invalid fraction value (original error message: "could not convert string to float: 'auto'")
24-Oct-2026 12:21:54 2026-10-24 12:21:54        SEVERE        sdcal::::casa        Task sdcal raised an exception of class RuntimeError with the following message: Invalid fraction value (original error message: "could not convert string to float: 'auto'")
24-Oct-2026 12:21:54
24-Oct-2026 12:21:54 PASSED
24-Oct-2026 12:21:54
24-Oct-2026 12:21:54 test_task_sdcal.py::sdcal_test_otfraster::test_otfraster01 2026-10-24 12:21:54        WARN        sdcal::calibrater::setvi(bool,bool)        Already using OLD VisibilityIterator.
24-Oct-2026 12:21:54 2026-10-24 12:21:54        SEVERE        sdcal::::casa        Traceback (most recent call last):
24-Oct-2026 12:21:54 2026-10-24 12:21:54        SEVERE        sdcal::::casa+                     ^^^^^^^^^^^^^^^^^^^^^
24-Oct-2026 12:21:54 2026-10-24 12:21:54        SEVERE        sdcal::::casa+          File "/home/casatest/venv/lib/python3.12/site-packages/casatasks/private/task_sdcal.py", line 151, in sdcal
24-Oct-2026 12:21:54 2026-10-24 12:21:54        SEVERE        sdcal::::casa+            raise ValueError('Too many edge points. fraction must be < 0.5.')
24-Oct-2026 12:21:54 2026-10-24 12:21:54        SEVERE        sdcal::::casa+        ValueError: Too many edge points. fraction must be < 0.5.
24-Oct-2026 12:21:54 2026-10-24 12:21:54        SEVERE        sdcal::::casa        Too many edge points. fraction must be < 0.5.
24-Oct-2026 12:21:54 2026-10-24 12:21:54        SEVERE        sdcal::::casa        Task sdcal raised an exception of class ValueError with the following message: Too many edge points. fraction must be < 0.5.
24-Oct-2026 12:21:54
24-Oct-2026 12:21:54 test_otfraster01 --- too many edge points (fraction 0.5).
24-Oct-2026 12:21:54 PASSED
24-Oct-2026 12:21:54
24-Oct-2026 12:21:54 test_task_sdcal.py::sdcal_test_otfraster::test_otfraster02 2026-10-24 12:21:54        WARN        sdcal::calibrater::setvi(bool,bool)        Already using OLD VisibilityIterator.
24-Oct-2026 12:21:54 2026-10-24 12:21:54        SEVERE        sdcal::::casa        Traceback (most recent call last):
24-Oct-2026 12:21:54 2026-10-24 12:21:54        SEVERE        sdcal::::casa+                     ^^^^^^^^^^^^^^^^^^^^^
24-Oct-2026 12:21:54 2026-10-24 12:21:54        SEVERE        sdcal::::casa+          File "/home/casatest/venv/lib/python3.12/site-packages/casatasks/private/task_sdcal.py", line 151, in sdcal
24-Oct-2026 12:21:54 2026-10-24 12:21:54        SEVERE        sdcal::::casa+            raise ValueError('Too many edge points. fraction must be < 0.5.')
24-Oct-2026 12:21:54 2026-10-24 12:21:54        SEVERE        sdcal::::casa+        ValueError: Too many edge points. fraction must be < 0.5.
24-Oct-2026 12:21:54 2026-10-24 12:21:54        SEVERE        sdcal::::casa        Too many edge points. fraction must be < 0.5.
24-Oct-2026 12:21:54 2026-10-24 12:21:54        SEVERE        sdcal::::casa        Task sdcal raised an exception of class ValueError with the following message: Too many edge points. fraction must be < 0.5.
24-Oct-2026 12:21:54
24-Oct-2026 12:21:54 test_otfraster02 --- too many edge points (fraction 50%).
24-Oct-2026 12:21:54 PASSED
24-Oct-2026 12:21:54
24-Oct-2026 12:21:54 test_task_sdcal.py::sdcal_test_otfraster::test_otfraster03 2026-10-24 12:21:54        WARN        sdcal::calibrater::setvi(bool,bool)        Already using OLD VisibilityIterator.
24-Oct-2026 12:21:54 2026-10-24 12:21:54        SEVERE        sdcal::Calibrater::solve        Caught exception: Too many edge points (20000 out of 9 points)
24-Oct-2026 12:21:54 2026-10-24 12:21:54        SEVERE        sdcal::::        Exception Reported: Error in Calibrater::solve.
24-Oct-2026 12:21:54 2026-10-24 12:21:54        SEVERE        sdcal::::casa        Traceback (most recent call last):
24-Oct-2026 12:21:54 2026-10-24 12:21:54        SEVERE        sdcal::::casa+                     ^^^^^^^^^^^^^^^^^^^^^
24-Oct-2026 12:21:54 2026-10-24 12:21:54        SEVERE        sdcal::::casa+          File "/home/casatest/venv/lib/python3.12/site-packages/casatasks/private/task_sdcal.py", line 157, in sdcal
24-Oct-2026 12:21:54 2026-10-24 12:21:54        SEVERE        sdcal::::casa+            cb.solve()
24-Oct-2026 12:21:54 2026-10-24 12:21:54        SEVERE        sdcal::::casa+          File "/home/casatest/venv/lib/python3.12/site-packages/casatools/calibrater.py", line 485, in solve
24-Oct-2026 12:21:54 2026-10-24 12:21:54        SEVERE        sdcal::::casa+            return self._swigobj.solve()
24-Oct-2026 12:21:54 2026-10-24 12:21:54        SEVERE        sdcal::::casa+                   ^^^^^^^^^^^^^^^^^^^^^
24-Oct-2026 12:21:54 2026-10-24 12:21:54        SEVERE        sdcal::::casa+          File "/home/casatest/venv/lib/python3.12/site-packages/casatools/__casac__/calibrater.py", line 1133, in solve
24-Oct-2026 12:21:54 2026-10-24 12:21:54        SEVERE        sdcal::::casa+            return _calibrater.calibrater_solve(self)
24-Oct-2026 12:21:54 2026-10-24 12:21:54        SEVERE        sdcal::::casa+                   ^^^^^^^^^^^^^^^^^^^^^^^^^^^^^^^^^^
24-Oct-2026 12:21:54 2026-10-24 12:21:54        SEVERE        sdcal::::casa+        RuntimeError: Error in Calibrater::solve.
24-Oct-2026 12:21:54 2026-10-24 12:21:54        SEVERE        sdcal::::casa        Error in Calibrater::solve.
24-Oct-2026 12:21:54 2026-10-24 12:21:54        SEVERE        sdcal::::casa        Task sdcal raised an exception of class RuntimeError with the following message: Error in Calibrater::solve.
24-Oct-2026 12:21:54
24-Oct-2026 12:21:54 test_otfraster03 --- too many edge points (noff 100000).
24-Oct-2026 12:21:54 PASSED
24-Oct-2026 12:21:54
24-Oct-2026 12:21:54 test_task_sdcal.py::sdcal_test_otfraster::test_otfraster06 2026-10-24 12:21:55        WARN        sdcal::calibrater::setvi(bool,bool)        Already using OLD VisibilityIterator.
24-Oct-2026 12:21:54 2026-10-24 12:21:55        SEVERE        sdcal::Calibrater::solve        Caught exception: No reference integration found in user-selected data. Please double-check your data selection criteria.
24-Oct-2026 12:21:54 2026-10-24 12:21:55        SEVERE        sdcal::::        Exception Reported: Error in Calibrater::solve.
24-Oct-2026 12:21:54 2026-10-24 12:21:55        SEVERE        sdcal::::casa        Traceback (most recent call last):
24-Oct-2026 12:21:54 2026-10-24 12:21:55        SEVERE        sdcal::::casa+                     ^^^^^^^^^^^^^^^^^^^^^
24-Oct-2026 12:21:54 2026-10-24 12:21:55        SEVERE        sdcal::::casa+          File "/home/casatest/venv/lib/python3.12/site-packages/casatasks/private/task_sdcal.py", line 157, in sdcal
24-Oct-2026 12:21:54 2026-10-24 12:21:55        SEVERE        sdcal::::casa+            cb.solve()
24-Oct-2026 12:21:54 2026-10-24 12:21:55        SEVERE        sdcal::::casa+          File "/home/casatest/venv/lib/python3.12/site-packages/casatools/calibrater.py", line 485, in solve
24-Oct-2026 12:21:54 2026-10-24 12:21:55        SEVERE        sdcal::::casa+            return self._swigobj.solve()
24-Oct-2026 12:21:54 2026-10-24 12:21:55        SEVERE        sdcal::::casa+                   ^^^^^^^^^^^^^^^^^^^^^
24-Oct-2026 12:21:54 2026-10-24 12:21:55        SEVERE        sdcal::::casa+          File "/home/casatest/venv/lib/python3.12/site-packages/casatools/__casac__/calibrater.py", line 1133, in solve
24-Oct-2026 12:21:54 2026-10-24 12:21:55        SEVERE        sdcal::::casa+            return _calibrater.calibrater_solve(self)
24-Oct-2026 12:21:54 2026-10-24 12:21:55        SEVERE        sdcal::::casa+                   ^^^^^^^^^^^^^^^^^^^^^^^^^^^^^^^^^^
24-Oct-2026 12:21:54 2026-10-24 12:21:55        SEVERE        sdcal::::casa+        RuntimeError: Error in Calibrater::solve.
24-Oct-2026 12:21:54 2026-10-24 12:21:55        SEVERE        sdcal::::casa        Error in Calibrater::solve.
24-Oct-2026 12:21:54 2026-10-24 12:21:55        SEVERE        sdcal::::casa        Task sdcal raised an exception of class RuntimeError with the following message: Error in Calibrater::solve.
24-Oct-2026 12:21:54
24-Oct-2026 12:21:54 test_otfraster06 --- inappropriate calibration mode ('ps').
24-Oct-2026 12:21:54 PASSED
24-Oct-2026 12:21:54
24-Oct-2026 12:21:54 test_task_sdcal.py::sdcal_test_otfraster::test_otfraster07 2026-10-24 12:21:55        WARN        sdcal::calibrater::setvi(bool,bool)        Already using OLD VisibilityIterator.
24-Oct-2026 12:21:56
24-Oct-2026 12:21:56 test_otfraster07 --- OTF raster calibration ('otfraster') with default setting.
24-Oct-2026 12:21:56 PASSED
24-Oct-2026 12:21:56
24-Oct-2026 12:21:57 test_task_sdcal.py::sdcal_test_otfraster::test_otfraster07M 2026-10-24 12:21:57        WARN        ParallelDataHelper::getPartitionMap::casa        Number of subMSs (8) is greater than available scan,ddi pairs (4), setting nsubms to 4
24-Oct-2026 12:22:01 2026-10-24 12:22:01        WARN        sdcal::calibrater::setvi(bool,bool)        Already using OLD VisibilityIterator.
24-Oct-2026 12:22:03
24-Oct-2026 12:22:03 test_otfraster07M --- OTF raster calibration ('otfraster') with default setting (MMS).
24-Oct-2026 12:22:03 PASSED
24-Oct-2026 12:22:03
24-Oct-2026 12:22:03 test_task_sdcal.py::sdcal_test_otfraster::test_otfraster08 2026-10-24 12:22:04        WARN        sdcal::calibrater::setvi(bool,bool)        Already using OLD VisibilityIterator.
24-Oct-2026 12:22:06
24-Oct-2026 12:22:06 test_otfraster08 --- OTF raster calibration ('otfraster') with string fraction (numeric value).
24-Oct-2026 12:22:06 PASSED
24-Oct-2026 12:22:06
24-Oct-2026 12:22:06 test_task_sdcal.py::sdcal_test_otfraster::test_otfraster09 2026-10-24 12:22:06        WARN        sdcal::calibrater::setvi(bool,bool)        Already using OLD VisibilityIterator.
24-Oct-2026 12:22:08
24-Oct-2026 12:22:08 test_otfraster09 --- OTF raster calibration ('otfraster') with string fraction (percentage).
24-Oct-2026 12:22:08 PASSED
24-Oct-2026 12:22:08
24-Oct-2026 12:22:08 test_task_sdcal.py::sdcal_test_otfraster::test_otfraster10 2026-10-24 12:22:09        WARN        sdcal::calibrater::setvi(bool,bool)        Already using OLD VisibilityIterator.
24-Oct-2026 12:22:10
24-Oct-2026 12:22:10 test_otfraster10 --- OTF raster calibration ('otfraster') with numeric fraction.
24-Oct-2026 12:22:10 PASSED
24-Oct-2026 12:22:10
24-Oct-2026 12:22:10 test_task_sdcal.py::sdcal_test_otfraster::test_otfraster11 2026-10-24 12:22:10        WARN        sdcal::calibrater::setvi(bool,bool)        Already using OLD VisibilityIterator.
24-Oct-2026 12:22:12
24-Oct-2026 12:22:12 test_otfraster11 --- OTF raster calibration ('otfraster') with auto detection.
24-Oct-2026 12:22:12 PASSED
24-Oct-2026 12:22:12
24-Oct-2026 12:22:12 test_task_sdcal.py::sdcal_test_otfraster::test_otfraster12 2026-10-24 12:22:12        WARN        sdcal::calibrater::setvi(bool,bool)        Already using OLD VisibilityIterator.
24-Oct-2026 12:22:14
24-Oct-2026 12:22:14 test_otfraster12 --- OTF raster calibration ('otfraster') with custom noff.
24-Oct-2026 12:22:14 PASSED
24-Oct-2026 12:22:14
24-Oct-2026 12:22:14 test_task_sdcal.py::sdcal_test_otfraster::test_otfraster13 2026-10-24 12:22:15        WARN        sdcal::calibrater::setvi(bool,bool)        Already using OLD VisibilityIterator.
24-Oct-2026 12:22:16
24-Oct-2026 12:22:16 test_otfraster13 --- check if noff takes priority over fraction.
24-Oct-2026 12:22:16 PASSED
24-Oct-2026 12:22:16
24-Oct-2026 12:22:16 test_task_sdcal.py::sdcal_test_otf::test_otf01 2026-10-24 12:22:17        WARN        sdcal::calibrater::setvi(bool,bool)        Already using OLD VisibilityIterator.
24-Oct-2026 12:22:16
24-Oct-2026 12:22:16 test_otf01 --- Compute calibration table. calmode='otf' ms=squares.dec60_cs.ms.
24-Oct-2026 12:22:16 PASSED
24-Oct-2026 12:22:16
24-Oct-2026 12:22:16 test_task_sdcal.py::sdcal_test_otf::test_otf02 2026-10-24 12:22:17        WARN        sdcal::calibrater::setvi(bool,bool)        Already using OLD VisibilityIterator.
24-Oct-2026 12:22:17
24-Oct-2026 12:22:17 test_otf02 --- Compute calibration table. calmode='otf' ms=squares.dec60_cs.ms edges_fraction=20%.
24-Oct-2026 12:22:17 PASSED
24-Oct-2026 12:22:17
24-Oct-2026 12:22:17 test_task_sdcal.py::sdcal_test_otf::test_otf03 2026-10-24 12:22:17        WARN        sdcal::calibrater::setvi(bool,bool)        Already using OLD VisibilityIterator.
24-Oct-2026 12:22:17
24-Oct-2026 12:22:17 test_otf03 --- Compute calibration table. calmode='otf' ms=lissajous.ms.
24-Oct-2026 12:22:17 PASSED
24-Oct-2026 12:22:17
24-Oct-2026 12:22:17 test_task_sdcal.py::sdcal_test_otf::test_otf03M 2026-10-24 12:22:18        WARN        ParallelDataHelper::getPartitionMap::casa        Number of subMSs (8) is greater than available scan,ddi pairs (4), setting nsubms to 4
24-Oct-2026 12:22:20 2026-10-24 12:22:20        WARN        sdcal::calibrater::setvi(bool,bool)        Already using OLD VisibilityIterator.
24-Oct-2026 12:22:20
24-Oct-2026 12:22:20 test_otf03 --- Compute calibration table. calmode='otf' ms=lissajous.ms (MMS).
24-Oct-2026 12:22:20 PASSED
24-Oct-2026 12:22:20
24-Oct-2026 12:22:20 test_task_sdcal.py::sdcal_test_otf::test_otf04 2026-10-24 12:22:21        WARN        sdcal::calibrater::setvi(bool,bool)        Already using OLD VisibilityIterator.
24-Oct-2026 12:22:21
24-Oct-2026 12:22:21 test_otf04 --- Compute calibration table. calmode='otf' ms=lissajous.ms edges_fraction=20%.
24-Oct-2026 12:22:21 PASSED
24-Oct-2026 12:22:21
24-Oct-2026 12:22:21 test_task_sdcal.py::sdcal_test_otf::test_otf05 2026-10-24 12:22:21        WARN        sdcal::calibrater::setvi(bool,bool)        Already using OLD VisibilityIterator.
24-Oct-2026 12:22:21 The following MS spws have no corresponding cal spws in squares.dec60_cs.edges_fraction_0.1.ms_caltable: 0 1 2 3
24-Oct-2026 12:22:21 2026-10-24 12:22:21        WARN        sdcal::CTPatchedInterp::interpolate        In caltable squares.dec60_cs.edges_fraction_0.1.ms_caltable (SDSKY_OTF):
24-Oct-2026 12:22:21 2026-10-24 12:22:21        WARN        sdcal::CTPatchedInterp::interpolate+         Insufficient solution channel sampling (nchan=1) for frequency-dependent LINEAR interpolation
24-Oct-2026 12:22:21 2026-10-24 12:22:21        WARN        sdcal::CTPatchedInterp::interpolate+         of calibration for MS spw=4; using NEAREST instead.
24-Oct-2026 12:22:21 2026-10-24 12:22:21        WARN        sdcal::calibrater::setvi(bool,bool)        Already using OLD VisibilityIterator.
24-Oct-2026 12:22:21 2026-10-24 12:22:21        WARN        sdcal::calibrater::setvi(bool,bool)        Already using OLD VisibilityIterator.
24-Oct-2026 12:22:21 The following MS spws have no corresponding cal spws in __sdcal_composite_mode_otf_097.tab: 0 1 2 3
24-Oct-2026 12:22:21 2026-10-24 12:22:21        WARN        sdcal::CTPatchedInterp::interpolate        In caltable __sdcal_composite_mode_otf_097.tab (SDSKY_OTF):
24-Oct-2026 12:22:21 2026-10-24 12:22:21        WARN        sdcal::CTPatchedInterp::interpolate+         Insufficient solution channel sampling (nchan=1) for frequency-dependent LINEAR interpolation
24-Oct-2026 12:22:21 2026-10-24 12:22:21        WARN        sdcal::CTPatchedInterp::interpolate+         of calibration for MS spw=4; using NEAREST instead.
24-Oct-2026 12:22:21
24-Oct-2026 12:22:21 test_otf05 --- Sky calibration. calmode='otf,apply' ms=squares.dec60_cs.ms.
24-Oct-2026 12:22:21 PASSED
24-Oct-2026 12:22:21
24-Oct-2026 12:22:21 test_task_sdcal.py::sdcal_test_otf::test_otf06 2026-10-24 12:22:22        WARN        sdcal::calibrater::setvi(bool,bool)        Already using OLD VisibilityIterator.
24-Oct-2026 12:22:21 The following MS spws have no corresponding cal spws in lissajous.edges_new_fraction_0.1.ms_caltable: 0 1 2 3
24-Oct-2026 12:22:21 2026-10-24 12:22:22        WARN        sdcal::CTPatchedInterp::interpolate        In caltable lissajous.edges_new_fraction_0.1.ms_caltable (SDSKY_OTF):
24-Oct-2026 12:22:21 2026-10-24 12:22:22        WARN        sdcal::CTPatchedInterp::interpolate+         Insufficient solution channel sampling (nchan=1) for frequency-dependent LINEAR interpolation
24-Oct-2026 12:22:21 2026-10-24 12:22:22        WARN        sdcal::CTPatchedInterp::interpolate+         of calibration for MS spw=4; using NEAREST instead.
24-Oct-2026 12:22:21
24-Oct-2026 12:22:21 test_otf06 --- Sky calibration reusing caltable pre-computed with calmode='otf'. calmode='apply' ms=lissajous.ms.
24-Oct-2026 12:22:21 PASSED
24-Oct-2026 12:22:21
24-Oct-2026 12:22:21 test_task_sdcal.py::sdcal_test_otf::test_otf07 2026-10-24 12:22:22        WARN        sdcal::::casa        Intent selection for 'otf' or 'otfraster' should be 'OBSERVE_TARGET#ON_SOURCE'.
24-Oct-2026 12:22:21 2026-10-24 12:22:22        WARN        sdcal::::casa+        However, the task is not allowed to set global intent selection since calmode contains 'tsys'.
24-Oct-2026 12:22:21 2026-10-24 12:22:22        WARN        sdcal::::casa+        As a workaround, set intent selection locally when 'otf' or 'otfraster' calibration is performed.
24-Oct-2026 12:22:21 2026-10-24 12:22:22        WARN        sdcal::calibrater::setvi(bool,bool)        Already using OLD VisibilityIterator.
24-Oct-2026 12:22:22 2026-10-24 12:22:22        WARN        sdcal::calibrater::setvi(bool,bool)        Already using OLD VisibilityIterator.
24-Oct-2026 12:22:22 2026-10-24 12:22:22        WARN        sdcal::calibrater::setvi(bool,bool)        Already using OLD VisibilityIterator.
24-Oct-2026 12:22:22 The following MS spws have no corresponding cal spws in __sdcal_composite_mode_otf_004.tab: 0 1 2 3
24-Oct-2026 12:22:22 The following MS spws have no corresponding cal spws in __sdcal_composite_mode_tsys_055.tab: 0 1 2 3
24-Oct-2026 12:22:22 2026-10-24 12:22:22        WARN        sdcal::CTPatchedInterp::interpolate        In caltable __sdcal_composite_mode_otf_004.tab (SDSKY_OTF):
24-Oct-2026 12:22:22 2026-10-24 12:22:22        WARN        sdcal::CTPatchedInterp::interpolate+         Insufficient solution channel sampling (nchan=1) for frequency-dependent LINEAR interpolation
24-Oct-2026 12:22:22 2026-10-24 12:22:22        WARN        sdcal::CTPatchedInterp::interpolate+         of calibration for MS spw=4; using NEAREST instead.
24-Oct-2026 12:22:22 2026-10-24 12:22:22        WARN        sdcal::CTPatchedInterp::interpolate        In caltable __sdcal_composite_mode_tsys_055.tab (B TSYS):
24-Oct-2026 12:22:22 2026-10-24 12:22:22        WARN        sdcal::CTPatchedInterp::interpolate+         Insufficient solution channel sampling (nchan=1) for frequency-dependent LINEAR interpolation
24-Oct-2026 12:22:22 2026-10-24 12:22:22        WARN        sdcal::CTPatchedInterp::interpolate+         of calibration for MS spw=4; using NEAREST instead.
24-Oct-2026 12:22:22
24-Oct-2026 12:22:22 test_otf07 --- Sky calibration + Tsys conversion, composite calmode='otf,tsys,apply'. ms=lissajous.ms.
24-Oct-2026 12:22:22 PASSED
24-Oct-2026 12:22:22
24-Oct-2026 12:22:22 test_task_sdcal.py::sdcal_test_otf_ephem::test_otfephem01 2026-10-24 12:22:23        WARN        sdcal::calibrater::setvi(bool,bool)        Already using OLD VisibilityIterator.
24-Oct-2026 12:22:23
24-Oct-2026 12:22:23 test_otfephem01: Sky calibration of 'otf' mode for ephemeris object.
24-Oct-2026 12:22:23 PASSED
24-Oct-2026 12:22:23
24-Oct-2026 12:22:23 test_task_sdcal.py::sdcal_test_otf_ephem::test_otfephem02 2026-10-24 12:22:23        WARN        sdcal::calibrater::setvi(bool,bool)        Already using OLD VisibilityIterator.
24-Oct-2026 12:22:23 2026-10-24 12:22:23        WARN        sdcal::calibrater::setvi(bool,bool)        Already using OLD VisibilityIterator.
24-Oct-2026 12:22:23 2026-10-24 12:22:23        WARN        sdcal::CTPatchedInterp::interpolate        In caltable __sdcal_composite_mode_otf_089.tab (SDSKY_OTF):
24-Oct-2026 12:22:23 2026-10-24 12:22:23        WARN        sdcal::CTPatchedInterp::interpolate+         Insufficient solution channel sampling (nchan=1) for frequency-dependent LINEAR interpolation
24-Oct-2026 12:22:23 2026-10-24 12:22:23        WARN        sdcal::CTPatchedInterp::interpolate+         of calibration for MS spw=0; using NEAREST instead.
24-Oct-2026 12:22:23 2026-10-24 12:22:23        WARN        sdcal::::        MS obs=0,spw=0,ant=1 is selected for processing, but has no available calibration in __sdcal_composite_mode_otf_089.tab as mapped, and will be flagged.
24-Oct-2026 12:22:23
24-Oct-2026 12:22:23 test_otfephem02: On-the-fly application of 'otf' calibration mode for ephemeris object.
24-Oct-2026 12:22:23 PASSED
24-Oct-2026 12:22:23
24-Oct-2026 12:22:23 test_task_sdcal.py::sdcal_test_apply::test_apply_composite00 2026-10-24 12:22:24        WARN        sdcal::calibrater::setvi(bool,bool)        Already using OLD VisibilityIterator.
24-Oct-2026 12:22:23 2026-10-24 12:22:24        WARN        sdcal::calibrater::setvi(bool,bool)        Already using OLD VisibilityIterator.
24-Oct-2026 12:22:24 The following MS spws have no corresponding cal spws in __sdcal_composite_mode_ps_038.tab: 0 1 2 3 4 5 6 7 8 10 12 13 14 15 16 17 18 19 20
24-Oct-2026 12:22:24 2026-10-24 12:22:24        WARN        sdcal::::        MS obs=0,spw=9,ant=2 is selected for processing, but has no available calibration in __sdcal_composite_mode_ps_038.tab as mapped, and will be flagged.
24-Oct-2026 12:22:24 2026-10-24 12:22:24        WARN        sdcal::::        MS obs=0,spw=9,ant=3 is selected for processing, but has no available calibration in __sdcal_composite_mode_ps_038.tab as mapped, and will be flagged.
24-Oct-2026 12:22:24 2026-10-24 12:22:24        WARN        sdcal::::        MS obs=0,spw=11,ant=2 is selected for processing, but has no available calibration in __sdcal_composite_mode_ps_038.tab as mapped, and will be flagged.
24-Oct-2026 12:22:24 2026-10-24 12:22:24        WARN        sdcal::::        MS obs=0,spw=11,ant=3 is selected for processing, but has no available calibration in __sdcal_composite_mode_ps_038.tab as mapped, and will be flagged.
24-Oct-2026 12:22:24 2026-10-24 12:22:24        WARN        sdcal::Calibrater::correct2 (VI2/VB2)        Spectral window(s) 1, 3,
24-Oct-2026 12:22:24 2026-10-24 12:22:24        WARN        sdcal::Calibrater::correct2 (VI2/VB2)+          could not be corrected due to missing (pre-)calibration
24-Oct-2026 12:22:24 2026-10-24 12:22:24        WARN        sdcal::Calibrater::correct2 (VI2/VB2)+            in one or more of the specified tables.
24-Oct-2026 12:22:24 2026-10-24 12:22:24        WARN        sdcal::Calibrater::correct2 (VI2/VB2)+            Please check your results carefully!
24-Oct-2026 12:22:24
24-Oct-2026 12:22:24 test_apply_composite00 --- on-the-fly application of sky table ('ps,apply').
24-Oct-2026 12:22:24 Interpolation option: linear nearestflag
24-Oct-2026 12:22:24 self.finterp: interp_freq_nearestflag
24-Oct-2026 12:22:24 PASSED
24-Oct-2026 12:22:24
24-Oct-2026 12:22:24 test_task_sdcal.py::sdcal_test_apply::test_apply_composite01 2026-10-24 12:22:24        WARN        sdcal::calibrater::setvi(bool,bool)        Already using OLD VisibilityIterator.
24-Oct-2026 12:22:24 2026-10-24 12:22:25        WARN        sdcal::calibrater::setvi(bool,bool)        Already using OLD VisibilityIterator.
24-Oct-2026 12:22:24 2026-10-24 12:22:25        WARN        sdcal::calibrater::setvi(bool,bool)        Already using OLD VisibilityIterator.
24-Oct-2026 12:22:25 The following MS spws have no corresponding cal spws in uid___A002_X6218fb_X264.ms.sel.tsys: 0 2 4 6 8 10 12 13 14 15 16 17 18 19 20
24-Oct-2026 12:22:25 The following MS spws have no corresponding cal spws in __sdcal_composite_mode_ps_031.tab: 0 1 2 3 4 5 6 7 8 10 12 13 14 15 16 17 18 19 20
24-Oct-2026 12:22:25 2026-10-24 12:22:25        WARN        sdcal::::        MS obs=0,spw=9,ant=2 is selected for processing, but has no available calibration in __sdcal_composite_mode_ps_031.tab as mapped, and will be flagged.
24-Oct-2026 12:22:25 2026-10-24 12:22:25        WARN        sdcal::::        MS obs=0,spw=9,ant=3 is selected for processing, but has no available calibration in __sdcal_composite_mode_ps_031.tab as mapped, and will be flagged.
24-Oct-2026 12:22:25 2026-10-24 12:22:25        WARN        sdcal::::        MS obs=0,spw=11,ant=2 is selected for processing, but has no available calibration in __sdcal_composite_mode_ps_031.tab as mapped, and will be flagged.
24-Oct-2026 12:22:25 2026-10-24 12:22:25        WARN        sdcal::::        MS obs=0,spw=11,ant=3 is selected for processing, but has no available calibration in __sdcal_composite_mode_ps_031.tab as mapped, and will be flagged.
24-Oct-2026 12:22:25 2026-10-24 12:22:25        WARN        sdcal::Calibrater::correct2 (VI2/VB2)        Spectral window(s) 1, 3,
24-Oct-2026 12:22:25 2026-10-24 12:22:25        WARN        sdcal::Calibrater::correct2 (VI2/VB2)+          could not be corrected due to missing (pre-)calibration
24-Oct-2026 12:22:25 2026-10-24 12:22:25        WARN        sdcal::Calibrater::correct2 (VI2/VB2)+            in one or more of the specified tables.
24-Oct-2026 12:22:25 2026-10-24 12:22:25        WARN        sdcal::Calibrater::correct2 (VI2/VB2)+            Please check your results carefully!
24-Oct-2026 12:22:25
24-Oct-2026 12:22:25 test_apply_composite01 --- on-the-fly application of sky table with existing Tsys table.
24-Oct-2026 12:22:25 Interpolation option: linear nearestflag
24-Oct-2026 12:22:25 self.finterp: interp_freq_nearestflag
24-Oct-2026 12:22:25 PASSED
24-Oct-2026 12:22:25
24-Oct-2026 12:22:25 test_task_sdcal.py::sdcal_test_apply::test_apply_composite02 2026-10-24 12:22:25        WARN        sdcal::calibrater::setvi(bool,bool)        Already using OLD VisibilityIterator.
24-Oct-2026 12:22:25 2026-10-24 12:22:26        WARN        sdcal::calibrater::setvi(bool,bool)        Already using OLD VisibilityIterator.
24-Oct-2026 12:22:25 2026-10-24 12:22:26        WARN        sdcal::calibrater::setvi(bool,bool)        Already using OLD VisibilityIterator.
24-Oct-2026 12:22:26 The following MS spws have no corresponding cal spws in __sdcal_composite_mode_ps_063.tab: 0 1 2 3 4 5 6 7 8 10 12 13 14 15 16 17 18 19 20
24-Oct-2026 12:22:26 The following MS spws have no corresponding cal spws in __sdcal_composite_mode_tsys_005.tab: 0 2 4 6 8 10 12 13 14 15 16 17 18 19 20
24-Oct-2026 12:22:26 2026-10-24 12:22:26        WARN        sdcal::::        MS obs=0,spw=9,ant=2 is selected for processing, but has no available calibration in __sdcal_composite_mode_ps_063.tab as mapped, and will be flagged.
24-Oct-2026 12:22:26 2026-10-24 12:22:26        WARN        sdcal::::        MS obs=0,spw=9,ant=3 is selected for processing, but has no available calibration in __sdcal_composite_mode_ps_063.tab as mapped, and will be flagged.
24-Oct-2026 12:22:26 2026-10-24 12:22:26        WARN        sdcal::::        MS obs=0,spw=11,ant=2 is selected for processing, but has no available calibration in __sdcal_composite_mode_ps_063.tab as mapped, and will be flagged.
24-Oct-2026 12:22:26 2026-10-24 12:22:26        WARN        sdcal::::        MS obs=0,spw=11,ant=3 is selected for processing, but has no available calibration in __sdcal_composite_mode_ps_063.tab as mapped, and will be flagged.
24-Oct-2026 12:22:26 2026-10-24 12:22:26        WARN        sdcal::Calibrater::correct2 (VI2/VB2)        Spectral window(s) 1, 3,
24-Oct-2026 12:22:26 2026-10-24 12:22:26        WARN        sdcal::Calibrater::correct2 (VI2/VB2)+          could not be corrected due to missing (pre-)calibration
24-Oct-2026 12:22:26 2026-10-24 12:22:26        WARN        sdcal::Calibrater::correct2 (VI2/VB2)+            in one or more of the specified tables.
24-Oct-2026 12:22:26 2026-10-24 12:22:26        WARN        sdcal::Calibrater::correct2 (VI2/VB2)+            Please check your results carefully!
24-Oct-2026 12:22:26
24-Oct-2026 12:22:26 test_apply_composite02 --- on-the-fly application of sky and tsys tables ('ps,tsys,apply').
24-Oct-2026 12:22:26 Interpolation option: linear nearestflag
24-Oct-2026 12:22:26 self.finterp: interp_freq_nearestflag
24-Oct-2026 12:22:26 PASSED
24-Oct-2026 12:22:26
24-Oct-2026 12:22:26 test_task_sdcal.py::sdcal_test_apply::test_apply_composite03 2026-10-24 12:22:26        WARN        sdcal::calibrater::setvi(bool,bool)        Already using OLD VisibilityIterator.
24-Oct-2026 12:22:26 2026-10-24 12:22:27        WARN        sdcal::calibrater::setvi(bool,bool)        Already using OLD VisibilityIterator.
24-Oct-2026 12:22:26 The following MS spws have no corresponding cal spws in uid___A002_X6218fb_X264.ms.sel.sky: 0 1 2 3 4 5 6 7 8 10 12 13 14 15 16 17 18 19 20
24-Oct-2026 12:22:26 The following MS spws have no corresponding cal spws in __sdcal_composite_mode_tsys_071.tab: 0 2 4 6 8 10 12 13 14 15 16 17 18 19 20
24-Oct-2026 12:22:26 2026-10-24 12:22:27        WARN        sdcal::::        MS obs=0,spw=9,ant=2 is selected for processing, but has no available calibration in uid___A002_X6218fb_X264.ms.sel.sky as mapped, and will be flagged.
24-Oct-2026 12:22:26 2026-10-24 12:22:27        WARN        sdcal::::        MS obs=0,spw=9,ant=3 is selected for processing, but has no available calibration in uid___A002_X6218fb_X264.ms.sel.sky as mapped, and will be flagged.
24-Oct-2026 12:22:26 2026-10-24 12:22:27        WARN        sdcal::::        MS obs=0,spw=11,ant=2 is selected for processing, but has no available calibration in uid___A002_X6218fb_X264.ms.sel.sky as mapped, and will be flagged.
24-Oct-2026 12:22:26 2026-10-24 12:22:27        WARN        sdcal::::        MS obs=0,spw=11,ant=3 is selected for processing, but has no available calibration in uid___A002_X6218fb_X264.ms.sel.sky as mapped, and will be flagged.
24-Oct-2026 12:22:26 2026-10-24 12:22:27        WARN        sdcal::Calibrater::correct2 (VI2/VB2)        Spectral window(s) 1, 3,
24-Oct-2026 12:22:26 2026-10-24 12:22:27        WARN        sdcal::Calibrater::correct2 (VI2/VB2)+          could not be corrected due to missing (pre-)calibration
24-Oct-2026 12:22:26 2026-10-24 12:22:27        WARN        sdcal::Calibrater::correct2 (VI2/VB2)+            in one or more of the specified tables.
24-Oct-2026 12:22:26 2026-10-24 12:22:27        WARN        sdcal::Calibrater::correct2 (VI2/VB2)+            Please check your results carefully!
24-Oct-2026 12:22:27
24-Oct-2026 12:22:27 test_apply_composite03 --- on-the-fly application of sky table ('otfraster,apply').
24-Oct-2026 12:22:27 Interpolation option: linear nearestflag
24-Oct-2026 12:22:27 self.finterp: interp_freq_nearestflag
24-Oct-2026 12:22:27 PASSED
24-Oct-2026 12:22:27
24-Oct-2026 12:22:27 test_task_sdcal.py::sdcal_test_apply::test_apply_sky00 2026-10-24 12:22:27        WARN        sdcal::calibrater::setvi(bool,bool)        Already using OLD VisibilityIterator.
24-Oct-2026 12:22:27 2026-10-24 12:22:27        SEVERE        sdcal::::casa        Traceback (most recent call last):
24-Oct-2026 12:22:27 2026-10-24 12:22:27        SEVERE        sdcal::::casa+                     ^^^^^^^^^^^^^^^^^^^^^
24-Oct-2026 12:22:27 2026-10-24 12:22:27        SEVERE        sdcal::::casa+          File "/home/casatest/venv/lib/python3.12/site-packages/casatasks/private/task_sdcal.py", line 78, in sdcal
24-Oct-2026 12:22:27 2026-10-24 12:22:27        SEVERE        sdcal::::casa+            raise Exception('Applytable name must be specified.')
24-Oct-2026 12:22:27 2026-10-24 12:22:27        SEVERE        sdcal::::casa+        Exception: Applytable name must be specified.
24-Oct-2026 12:22:27 2026-10-24 12:22:27        SEVERE        sdcal::::casa        Applytable name must be specified.
24-Oct-2026 12:22:27 2026-10-24 12:22:27        SEVERE        sdcal::::casa        Task sdcal raised an exception of class Exception with the following message: Applytable name must be specified.
24-Oct-2026 12:22:27
24-Oct-2026 12:22:27 test_apply_sky00 --- empty applytable.
24-Oct-2026 12:22:27 PASSED
24-Oct-2026 12:22:27
24-Oct-2026 12:22:27 test_task_sdcal.py::sdcal_test_apply::test_apply_sky01 2026-10-24 12:22:27        WARN        sdcal::calibrater::setvi(bool,bool)        Already using OLD VisibilityIterator.
24-Oct-2026 12:22:27 2026-10-24 12:22:28        SEVERE        sdcal::::casa        Traceback (most recent call last):
24-Oct-2026 12:22:27 2026-10-24 12:22:28        SEVERE        sdcal::::casa+                     ^^^^^^^^^^^^^^^^^^^^^
24-Oct-2026 12:22:27 2026-10-24 12:22:28        SEVERE        sdcal::::casa+          File "/home/casatest/venv/lib/python3.12/site-packages/casatasks/private/task_sdcal.py", line 78, in sdcal
24-Oct-2026 12:22:27 2026-10-24 12:22:28        SEVERE        sdcal::::casa+            raise Exception('Applytable name must be specified.')
24-Oct-2026 12:22:27 2026-10-24 12:22:28        SEVERE        sdcal::::casa+        Exception: Applytable name must be specified.
24-Oct-2026 12:22:27 2026-10-24 12:22:28        SEVERE        sdcal::::casa        Applytable name must be specified.
24-Oct-2026 12:22:27 2026-10-24 12:22:28        SEVERE        sdcal::::casa        Task sdcal raised an exception of class Exception with the following message: Applytable name must be specified.
24-Oct-2026 12:22:27
24-Oct-2026 12:22:27 test_apply_sky01 --- empty applytable (list ver.).
24-Oct-2026 12:22:27 PASSED
24-Oct-2026 12:22:27
24-Oct-2026 12:22:27 test_task_sdcal.py::sdcal_test_apply::test_apply_sky02 2026-10-24 12:22:28        WARN        sdcal::calibrater::setvi(bool,bool)        Already using OLD VisibilityIterator.
24-Oct-2026 12:22:27 2026-10-24 12:22:28        SEVERE        sdcal::::casa        Traceback (most recent call last):
24-Oct-2026 12:22:27 2026-10-24 12:22:28        SEVERE        sdcal::::casa+                     ^^^^^^^^^^^^^^^^^^^^^
24-Oct-2026 12:22:27 2026-10-24 12:22:28        SEVERE        sdcal::::casa+          File "/home/casatest/venv/lib/python3.12/site-packages/casatasks/private/task_sdcal.py", line 72, in sdcal
24-Oct-2026 12:22:27 2026-10-24 12:22:28        SEVERE        sdcal::::casa+            raise Exception('Applytable name must be specified.')
24-Oct-2026 12:22:27 2026-10-24 12:22:28        SEVERE        sdcal::::casa+        Exception: Applytable name must be specified.
24-Oct-2026 12:22:27 2026-10-24 12:22:28        SEVERE        sdcal::::casa        Applytable name must be specified.
24-Oct-2026 12:22:27 2026-10-24 12:22:28        SEVERE        sdcal::::casa        Task sdcal raised an exception of class Exception with the following message: Applytable name must be specified.
24-Oct-2026 12:22:27
24-Oct-2026 12:22:27 test_apply_sky02 --- empty applytable list.
24-Oct-2026 12:22:27 PASSED
24-Oct-2026 12:22:27
24-Oct-2026 12:22:27 test_task_sdcal.py::sdcal_test_apply::test_apply_sky03 2026-10-24 12:22:28        WARN        sdcal::calibrater::setvi(bool,bool)        Already using OLD VisibilityIterator.
24-Oct-2026 12:22:28 2026-10-24 12:22:28        SEVERE        sdcal::::casa        Traceback (most recent call last):
24-Oct-2026 12:22:28 2026-10-24 12:22:28        SEVERE        sdcal::::casa+                     ^^^^^^^^^^^^^^^^^^^^^
24-Oct-2026 12:22:28 2026-10-24 12:22:28        SEVERE        sdcal::::casa+          File "/home/casatest/venv/lib/python3.12/site-packages/casatasks/private/task_sdcal.py", line 81, in sdcal
24-Oct-2026 12:22:28 2026-10-24 12:22:28        SEVERE        sdcal::::casa+            raise Exception("Table doesn't exist: {}".format(_table_name))
24-Oct-2026 12:22:28 2026-10-24 12:22:28        SEVERE        sdcal::::casa+        Exception: Table doesn't exist: notexist.sky
24-Oct-2026 12:22:28 2026-10-24 12:22:28        SEVERE        sdcal::::casa        Table doesn't exist: notexist.sky
24-Oct-2026 12:22:28 2026-10-24 12:22:28        SEVERE        sdcal::::casa        Task sdcal raised an exception of class Exception with the following message: Table doesn't exist: notexist.sky
24-Oct-2026 12:22:28
24-Oct-2026 12:22:28 test_apply_sky03 --- unexisting applytable.
24-Oct-2026 12:22:28 PASSED
24-Oct-2026 12:22:28
24-Oct-2026 12:22:28 test_task_sdcal.py::sdcal_test_apply::test_apply_sky04 2026-10-24 12:22:28        WARN        sdcal::calibrater::setvi(bool,bool)        Already using OLD VisibilityIterator.
24-Oct-2026 12:22:28 2026-10-24 12:22:28        SEVERE        sdcal::::casa        Traceback (most recent call last):
24-Oct-2026 12:22:28 2026-10-24 12:22:28        SEVERE        sdcal::::casa+                     ^^^^^^^^^^^^^^^^^^^^^
24-Oct-2026 12:22:28 2026-10-24 12:22:28        SEVERE        sdcal::::casa+          File "/home/casatest/venv/lib/python3.12/site-packages/casatasks/private/task_sdcal.py", line 81, in sdcal
24-Oct-2026 12:22:28 2026-10-24 12:22:28        SEVERE        sdcal::::casa+            raise Exception("Table doesn't exist: {}".format(_table_name))
24-Oct-2026 12:22:28 2026-10-24 12:22:28        SEVERE        sdcal::::casa+        Exception: Table doesn't exist: notexist.sky
24-Oct-2026 12:22:28 2026-10-24 12:22:28        SEVERE        sdcal::::casa        Table doesn't exist: notexist.sky
24-Oct-2026 12:22:28 2026-10-24 12:22:28        SEVERE        sdcal::::casa        Task sdcal raised an exception of class Exception with the following message: Table doesn't exist: notexist.sky
24-Oct-2026 12:22:28
24-Oct-2026 12:22:28 test_apply_sky04 --- unexisting applytable (list ver.).
24-Oct-2026 12:22:28 PASSED
24-Oct-2026 12:22:28
24-Oct-2026 12:22:28 test_task_sdcal.py::sdcal_test_apply::test_apply_sky05 2026-10-24 12:22:29        WARN        sdcal::calibrater::setvi(bool,bool)        Already using OLD VisibilityIterator.
24-Oct-2026 12:22:28 2026-10-24 12:22:29        SEVERE        sdcal::Calibrater::selectvis (file /source/casa6/casatools/src/code/synthesis/MeasurementComponents/Calibrater.cc, line 4234)        Caught exception: Spw Expression: No match found for 99,
24-Oct-2026 12:22:28 2026-10-24 12:22:29        SEVERE        sdcal::::        Exception Reported: Error in data selection specification: Spw Expression: No match found for 99,
24-Oct-2026 12:22:28 2026-10-24 12:22:29        SEVERE        sdcal::::casa        Traceback (most recent call last):
24-Oct-2026 12:22:28 2026-10-24 12:22:29        SEVERE        sdcal::::casa+                     ^^^^^^^^^^^^^^^^^^^^^
24-Oct-2026 12:22:28 2026-10-24 12:22:29        SEVERE        sdcal::::casa+          File "/home/casatest/venv/lib/python3.12/site-packages/casatasks/private/task_sdcal.py", line 46, in sdcal
24-Oct-2026 12:22:28 2026-10-24 12:22:29        SEVERE        sdcal::::casa+            cb.selectvis(spw=spw, scan=scan, field=field)
24-Oct-2026 12:22:28 2026-10-24 12:22:29        SEVERE        sdcal::::casa+          File "/home/casatest/venv/lib/python3.12/site-packages/casatools/calibrater.py", line 82, in selectvis
24-Oct-2026 12:22:28 2026-10-24 12:22:29        SEVERE        sdcal::::casa+            return self._swigobj.selectvis(time, spw, scan, field, intent, observation, baseline, uvrange, chanmode, nchan, start, step, mstart, mstep, msselect)
24-Oct-2026 12:22:28 2026-10-24 12:22:29        SEVERE        sdcal::::casa+                   ^^^^^^^^^^^^^^^^^^^^^^^^^^^^^^^^^^^^^^^^^^^^^^^^^^^^^^^^^^^^^^^^^^^^^^^^^^^^^^^^^^^^^^^^^^^^^^^^^^^^^^^^^^^^^^^^^^^^^^^^^^^^^^^^^^^^^^^^^^^^^^
24-Oct-2026 12:22:28 2026-10-24 12:22:29        SEVERE        sdcal::::casa+          File "/home/casatest/venv/lib/python3.12/site-packages/casatools/__casac__/calibrater.py", line 264, in selectvis
24-Oct-2026 12:22:28 2026-10-24 12:22:29        SEVERE        sdcal::::casa+            return _calibrater.calibrater_selectvis(self, *args, **kwargs)
24-Oct-2026 12:22:28 2026-10-24 12:22:29        SEVERE        sdcal::::casa+                   ^^^^^^^^^^^^^^^^^^^^^^^^^^^^^^^^^^^^^^^^^^^^^^^^^^^^^^^
24-Oct-2026 12:22:28 2026-10-24 12:22:29        SEVERE        sdcal::::casa+        RuntimeError: Error in data selection specification: Spw Expression: No match found for 99,
24-Oct-2026 12:22:28 2026-10-24 12:22:29        SEVERE        sdcal::::casa        Error in data selection specification: Spw Expression: No match found for 99,
24-Oct-2026 12:22:28 2026-10-24 12:22:29        SEVERE        sdcal::::casa        Task sdcal raised an exception of class RuntimeError with the following message: Error in data selection specification: Spw Expression: No match found for 99,
24-Oct-2026 12:22:28
24-Oct-2026 12:22:28 test_apply_sky05 --- invalid selection (empty selection result).
24-Oct-2026 12:22:28 PASSED
24-Oct-2026 12:22:28
24-Oct-2026 12:22:28 test_task_sdcal.py::sdcal_test_apply::test_apply_sky06 2026-10-24 12:22:29        WARN        sdcal::calibrater::setvi(bool,bool)        Already using OLD VisibilityIterator.
24-Oct-2026 12:22:28 2026-10-24 12:22:29        SEVERE        sdcal::Calibrater::setapply(type, applypar)        Unknown interp type: 'sinusoid'!! Check inputs and try again.
24-Oct-2026 12:22:28 2026-10-24 12:22:29        SEVERE        sdcal::::        Exception Reported: Error in Calibrater::setapply.
24-Oct-2026 12:22:28 2026-10-24 12:22:29        SEVERE        sdcal::::casa        Traceback (most recent call last):
24-Oct-2026 12:22:28 2026-10-24 12:22:29        SEVERE        sdcal::::casa+                     ^^^^^^^^^^^^^^^^^^^^^
24-Oct-2026 12:22:28 2026-10-24 12:22:29        SEVERE        sdcal::::casa+          File "/home/casatest/venv/lib/python3.12/site-packages/casatasks/private/task_sdcal.py", line 121, in sdcal
24-Oct-2026 12:22:28 2026-10-24 12:22:29        SEVERE        sdcal::::casa+            cb.setapply(table=_table, interp=interp, calwt=True)
24-Oct-2026 12:22:28 2026-10-24 12:22:29        SEVERE        sdcal::::casa+          File "/home/casatest/venv/lib/python3.12/site-packages/casatools/calibrater.py", line 212, in setapply
24-Oct-2026 12:22:28 2026-10-24 12:22:29        SEVERE        sdcal::::casa+            return self._swigobj.setapply(type, t, table, field, interp, select, calwt, spwmap, opacity)
24-Oct-2026 12:22:28 2026-10-24 12:22:29        SEVERE        sdcal::::casa+                   ^^^^^^^^^^^^^^^^^^^^^^^^^^^^^^^^^^^^^^^^^^^^^^^^^^^^^^^^^^^^^^^^^^^^^^^^^^^^^^^^^^^^^
24-Oct-2026 12:22:28 2026-10-24 12:22:29        SEVERE        sdcal::::casa+          File "/home/casatest/venv/lib/python3.12/site-packages/casatools/__casac__/calibrater.py", line 479, in setapply
24-Oct-2026 12:22:28 2026-10-24 12:22:29        SEVERE        sdcal::::casa+            return _calibrater.calibrater_setapply(self, *args, **kwargs)
24-Oct-2026 12:22:28 2026-10-24 12:22:29        SEVERE        sdcal::::casa+                   ^^^^^^^^^^^^^^^^^^^^^^^^^^^^^^^^^^^^^^^^^^^^^^^^^^^^^^
24-Oct-2026 12:22:28 2026-10-24 12:22:29        SEVERE        sdcal::::casa+        RuntimeError: Error in Calibrater::setapply.
24-Oct-2026 12:22:28 2026-10-24 12:22:29        SEVERE        sdcal::::casa        Error in Calibrater::setapply.
24-Oct-2026 12:22:28 2026-10-24 12:22:29        SEVERE        sdcal::::casa        Task sdcal raised an exception of class RuntimeError with the following message: Error in Calibrater::setapply.
24-Oct-2026 12:22:28
24-Oct-2026 12:22:28 test_apply_sky06 --- invalid interp value.
24-Oct-2026 12:22:28 PASSED
24-Oct-2026 12:22:28
24-Oct-2026 12:22:29 test_task_sdcal.py::sdcal_test_apply::test_apply_sky07 2026-10-24 12:22:29        WARN        sdcal::calibrater::setvi(bool,bool)        Already using OLD VisibilityIterator.
24-Oct-2026 12:22:29 2026-10-24 12:22:29        SEVERE        sdcal::::casa        Traceback (most recent call last):
24-Oct-2026 12:22:29 2026-10-24 12:22:29        SEVERE        sdcal::::casa+                     ^^^^^^^^^^^^^^^^^^^^^
24-Oct-2026 12:22:29 2026-10-24 12:22:29        SEVERE        sdcal::::casa+          File "/home/casatest/venv/lib/python3.12/site-packages/casatasks/private/task_sdcal.py", line 116, in sdcal
24-Oct-2026 12:22:29 2026-10-24 12:22:29        SEVERE        sdcal::::casa+            raise RuntimeError('Applytable \'%s\' is not a caltable format' % (_table))
24-Oct-2026 12:22:29 2026-10-24 12:22:29        SEVERE        sdcal::::casa+        RuntimeError: Applytable 'uid___A002_X6218fb_X264.ms.sel' is not a caltable format
24-Oct-2026 12:22:29 2026-10-24 12:22:29        SEVERE        sdcal::::casa        Applytable 'uid___A002_X6218fb_X264.ms.sel' is not a caltable format
24-Oct-2026 12:22:29 2026-10-24 12:22:29        SEVERE        sdcal::::casa        Task sdcal raised an exception of class RuntimeError with the following message: Applytable 'uid___A002_X6218fb_X264.ms.sel' is not a caltable format
24-Oct-2026 12:22:29
24-Oct-2026 12:22:29 test_apply_sky07 --- invalid applytable (not caltable).
24-Oct-2026 12:22:29 PASSED
24-Oct-2026 12:22:29
24-Oct-2026 12:22:29 test_task_sdcal.py::sdcal_test_apply::test_apply_sky08 2026-10-24 12:22:29        WARN        sdcal::calibrater::setvi(bool,bool)        Already using OLD VisibilityIterator.
24-Oct-2026 12:22:29 The following MS spws have no corresponding cal spws in uid___A002_X6218fb_X264.ms.sel.sky: 0 1 2 3 4 5 6 7 8 10 12 13 14 15 16 17 18 19 20
24-Oct-2026 12:22:29 2026-10-24 12:22:29        WARN        sdcal::::        MS obs=0,spw=9,ant=2 is selected for processing, but has no available calibration in uid___A002_X6218fb_X264.ms.sel.sky as mapped, and will be flagged.
24-Oct-2026 12:22:29 2026-10-24 12:22:29        WARN        sdcal::::        MS obs=0,spw=9,ant=3 is selected for processing, but has no available calibration in uid___A002_X6218fb_X264.ms.sel.sky as mapped, and will be flagged.
24-Oct-2026 12:22:29 2026-10-24 12:22:30        WARN        sdcal::::        MS obs=0,spw=11,ant=2 is selected for processing, but has no available calibration in uid___A002_X6218fb_X264.ms.sel.sky as mapped, and will be flagged.
24-Oct-2026 12:22:29 2026-10-24 12:22:30        WARN        sdcal::::        MS obs=0,spw=11,ant=3 is selected for processing, but has no available calibration in uid___A002_X6218fb_X264.ms.sel.sky as mapped, and will be flagged.
24-Oct-2026 12:22:29 2026-10-24 12:22:30        WARN        sdcal::Calibrater::correct2 (VI2/VB2)        Spectral window(s) 1, 3,
24-Oct-2026 12:22:29 2026-10-24 12:22:30        WARN        sdcal::Calibrater::correct2 (VI2/VB2)+          could not be corrected due to missing (pre-)calibration
24-Oct-2026 12:22:29 2026-10-24 12:22:30        WARN        sdcal::Calibrater::correct2 (VI2/VB2)+            in one or more of the specified tables.
24-Oct-2026 12:22:29 2026-10-24 12:22:30        WARN        sdcal::Calibrater::correct2 (VI2/VB2)+            Please check your results carefully!
24-Oct-2026 12:22:29
24-Oct-2026 12:22:29 test_apply_sky08 --- apply data (linear).
24-Oct-2026 12:22:29 Interpolation option: linear nearestflag
24-Oct-2026 12:22:29 self.finterp: interp_freq_nearestflag
24-Oct-2026 12:22:29 PASSED
24-Oct-2026 12:22:29
24-Oct-2026 12:22:29 test_task_sdcal.py::sdcal_test_apply::test_apply_sky08M
24-Oct-2026 12:22:29 test_apply_sky08M --- apply data (linear) for MMS.
24-Oct-2026 12:22:29 SKIPPED (Skip test_apply_sky08M until calibrator tool supports proce...)
24-Oct-2026 12:22:29
24-Oct-2026 12:22:29 test_task_sdcal.py::sdcal_test_apply::test_apply_sky09 2026-10-24 12:22:30        WARN        sdcal::calibrater::setvi(bool,bool)        Already using OLD VisibilityIterator.
24-Oct-2026 12:22:30 The following MS spws have no corresponding cal spws in uid___A002_X6218fb_X264.ms.sel.sky: 0 1 2 3 4 5 6 7 8 10 12 13 14 15 16 17 18 19 20
24-Oct-2026 12:22:30 2026-10-24 12:22:30        WARN        sdcal::::        MS obs=0,spw=9,ant=2 is selected for processing, but has no available calibration in uid___A002_X6218fb_X264.ms.sel.sky as mapped, and will be flagged.
24-Oct-2026 12:22:30 2026-10-24 12:22:30        WARN        sdcal::::        MS obs=0,spw=9,ant=3 is selected for processing, but has no available calibration in uid___A002_X6218fb_X264.ms.sel.sky as mapped, and will be flagged.
24-Oct-2026 12:22:30
24-Oct-2026 12:22:30 test_apply_sky09 --- apply selected data.
24-Oct-2026 12:22:30 Interpolation option: linear nearestflag
24-Oct-2026 12:22:30 self.finterp: interp_freq_nearestflag
24-Oct-2026 12:22:30 PASSED
24-Oct-2026 12:22:30
24-Oct-2026 12:22:30 test_task_sdcal.py::sdcal_test_apply::test_apply_sky10 2026-10-24 12:22:30        WARN        sdcal::calibrater::setvi(bool,bool)        Already using OLD VisibilityIterator.
24-Oct-2026 12:22:30 The following MS spws have no corresponding cal spws in uid___A002_X6218fb_X264.ms.sel.sky: 0 1 2 3 4 5 6 7 8 10 12 13 14 15 16 17 18 19 20
24-Oct-2026 12:22:30 2026-10-24 12:22:30        WARN        sdcal::::        MS obs=0,spw=9,ant=2 is selected for processing, but has no available calibration in uid___A002_X6218fb_X264.ms.sel.sky as mapped, and will be flagged.
24-Oct-2026 12:22:30 2026-10-24 12:22:30        WARN        sdcal::::        MS obs=0,spw=9,ant=3 is selected for processing, but has no available calibration in uid___A002_X6218fb_X264.ms.sel.sky as mapped, and will be flagged.
24-Oct-2026 12:22:30 2026-10-24 12:22:30        WARN        sdcal::::        MS obs=0,spw=11,ant=2 is selected for processing, but has no available calibration in uid___A002_X6218fb_X264.ms.sel.sky as mapped, and will be flagged.
24-Oct-2026 12:22:30 2026-10-24 12:22:30        WARN        sdcal::::        MS obs=0,spw=11,ant=3 is selected for processing, but has no available calibration in uid___A002_X6218fb_X264.ms.sel.sky as mapped, and will be flagged.
24-Oct-2026 12:22:30 2026-10-24 12:22:30        WARN        sdcal::Calibrater::correct2 (VI2/VB2)        Spectral window(s) 1, 3,
24-Oct-2026 12:22:30 2026-10-24 12:22:30        WARN        sdcal::Calibrater::correct2 (VI2/VB2)+          could not be corrected due to missing (pre-)calibration
24-Oct-2026 12:22:30 2026-10-24 12:22:30        WARN        sdcal::Calibrater::correct2 (VI2/VB2)+            in one or more of the specified tables.
24-Oct-2026 12:22:30 2026-10-24 12:22:30        WARN        sdcal::Calibrater::correct2 (VI2/VB2)+            Please check your results carefully!
24-Oct-2026 12:22:30
24-Oct-2026 12:22:30 test_apply_sky10 --- apply data (nearest).
24-Oct-2026 12:22:30 Interpolation option: nearest nearestflag
24-Oct-2026 12:22:30 self.finterp: interp_freq_nearestflag
24-Oct-2026 12:22:30 PASSED
24-Oct-2026 12:22:30
24-Oct-2026 12:22:30 test_task_sdcal.py::sdcal_test_apply::test_apply_sky11 2026-10-24 12:22:31        WARN        sdcal::calibrater::setvi(bool,bool)        Already using OLD VisibilityIterator.
24-Oct-2026 12:22:30 The following MS spws have no corresponding cal spws in uid___A002_X6218fb_X264.ms.sel.sky: 0 1 2 3 4 5 6 7 8 10 12 13 14 15 16 17 18 19 20
24-Oct-2026 12:22:30 2026-10-24 12:22:31        WARN        sdcal::::        MS obs=0,spw=9,ant=2 is selected for processing, but has no available calibration in uid___A002_X6218fb_X264.ms.sel.sky as mapped, and will be flagged.
24-Oct-2026 12:22:30 2026-10-24 12:22:31        WARN        sdcal::::        MS obs=0,spw=9,ant=3 is selected for processing, but has no available calibration in uid___A002_X6218fb_X264.ms.sel.sky as mapped, and will be flagged.
24-Oct-2026 12:22:30 2026-10-24 12:22:31        WARN        sdcal::::        MS obs=0,spw=11,ant=2 is selected for processing, but has no available calibration in uid___A002_X6218fb_X264.ms.sel.sky as mapped, and will be flagged.
24-Oct-2026 12:22:30 2026-10-24 12:22:31        WARN        sdcal::::        MS obs=0,spw=11,ant=3 is selected for processing, but has no available calibration in uid___A002_X6218fb_X264.ms.sel.sky as mapped, and will be flagged.
24-Oct-2026 12:22:30 2026-10-24 12:22:31        WARN        sdcal::Calibrater::correct2 (VI2/VB2)        Spectral window(s) 1, 3,
24-Oct-2026 12:22:30 2026-10-24 12:22:31        WARN        sdcal::Calibrater::correct2 (VI2/VB2)+          could not be corrected due to missing (pre-)calibration
24-Oct-2026 12:22:30 2026-10-24 12:22:31        WARN        sdcal::Calibrater::correct2 (VI2/VB2)+            in one or more of the specified tables.
24-Oct-2026 12:22:30 2026-10-24 12:22:31        WARN        sdcal::Calibrater::correct2 (VI2/VB2)+            Please check your results carefully!
24-Oct-2026 12:22:31
24-Oct-2026 12:22:31 test_apply_sky11 --- apply data (linearflag for frequency interpolation).
24-Oct-2026 12:22:31 Interpolation option: linear nearestflag
24-Oct-2026 12:22:31 self.finterp: interp_freq_nearestflag
24-Oct-2026 12:22:31 PASSED
24-Oct-2026 12:22:31
24-Oct-2026 12:22:31 test_task_sdcal.py::sdcal_test_apply::test_apply_sky12 2026-10-24 12:22:31        WARN        sdcal::calibrater::setvi(bool,bool)        Already using OLD VisibilityIterator.
24-Oct-2026 12:22:31 The following MS spws have no corresponding cal spws in uid___A002_X6218fb_X264.ms.sel.sky: 0 1 2 3 4 5 6 7 8 10 12 13 14 15 16 17 18 19 20
24-Oct-2026 12:22:31 2026-10-24 12:22:31        WARN        sdcal::::        MS obs=0,spw=9,ant=2 is selected for processing, but has no available calibration in uid___A002_X6218fb_X264.ms.sel.sky as mapped, and will be flagged.
24-Oct-2026 12:22:31 2026-10-24 12:22:31        WARN        sdcal::::        MS obs=0,spw=9,ant=3 is selected for processing, but has no available calibration in uid___A002_X6218fb_X264.ms.sel.sky as mapped, and will be flagged.
24-Oct-2026 12:22:31 2026-10-24 12:22:31        WARN        sdcal::::        MS obs=0,spw=11,ant=2 is selected for processing, but has no available calibration in uid___A002_X6218fb_X264.ms.sel.sky as mapped, and will be flagged.
24-Oct-2026 12:22:31 2026-10-24 12:22:31        WARN        sdcal::::        MS obs=0,spw=11,ant=3 is selected for processing, but has no available calibration in uid___A002_X6218fb_X264.ms.sel.sky as mapped, and will be flagged.
24-Oct-2026 12:22:31 2026-10-24 12:22:31        WARN        sdcal::Calibrater::correct2 (VI2/VB2)        Spectral window(s) 1, 3,
24-Oct-2026 12:22:31 2026-10-24 12:22:31        WARN        sdcal::Calibrater::correct2 (VI2/VB2)+          could not be corrected due to missing (pre-)calibration
24-Oct-2026 12:22:31 2026-10-24 12:22:31        WARN        sdcal::Calibrater::correct2 (VI2/VB2)+            in one or more of the specified tables.
24-Oct-2026 12:22:31 2026-10-24 12:22:31        WARN        sdcal::Calibrater::correct2 (VI2/VB2)+            Please check your results carefully!
24-Oct-2026 12:22:31
24-Oct-2026 12:22:31 test_apply_sky12 --- apply data (nearestflag for frequency interpolation).
24-Oct-2026 12:22:31 Interpolation option: linear nearestflag
24-Oct-2026 12:22:31 self.finterp: interp_freq_nearestflag
24-Oct-2026 12:22:31 PASSED
24-Oct-2026 12:22:31
24-Oct-2026 12:22:31 test_task_sdcal.py::sdcal_test_apply::test_apply_sky13 2026-10-24 12:22:32        WARN        sdcal::calibrater::setvi(bool,bool)        Already using OLD VisibilityIterator.
24-Oct-2026 12:22:31 The following MS spws have no corresponding cal spws in uid___A002_X6218fb_X264.ms.sel.sky: 0 1 2 3 4 5 6 7 8 10 12 13 14 15 16 17 18 19 20
24-Oct-2026 12:22:31 2026-10-24 12:22:32        WARN        sdcal::::        MS obs=0,spw=9,ant=2 is selected for processing, but has no available calibration in uid___A002_X6218fb_X264.ms.sel.sky as mapped, and will be flagged.
24-Oct-2026 12:22:31 2026-10-24 12:22:32        WARN        sdcal::::        MS obs=0,spw=9,ant=3 is selected for processing, but has no available calibration in uid___A002_X6218fb_X264.ms.sel.sky as mapped, and will be flagged.
24-Oct-2026 12:22:31 2026-10-24 12:22:32        WARN        sdcal::::        MS obs=0,spw=11,ant=2 is selected for processing, but has no available calibration in uid___A002_X6218fb_X264.ms.sel.sky as mapped, and will be flagged.
24-Oct-2026 12:22:31 2026-10-24 12:22:32        WARN        sdcal::::        MS obs=0,spw=11,ant=3 is selected for processing, but has no available calibration in uid___A002_X6218fb_X264.ms.sel.sky as mapped, and will be flagged.
24-Oct-2026 12:22:31 2026-10-24 12:22:32        WARN        sdcal::Calibrater::correct2 (VI2/VB2)        Spectral window(s) 1, 3,
24-Oct-2026 12:22:31 2026-10-24 12:22:32        WARN        sdcal::Calibrater::correct2 (VI2/VB2)+          could not be corrected due to missing (pre-)calibration
24-Oct-2026 12:22:31 2026-10-24 12:22:32        WARN        sdcal::Calibrater::correct2 (VI2/VB2)+            in one or more of the specified tables.
24-Oct-2026 12:22:31 2026-10-24 12:22:32        WARN        sdcal::Calibrater::correct2 (VI2/VB2)+            Please check your results carefully!
24-Oct-2026 12:22:31
24-Oct-2026 12:22:31 test_apply_sky13 --- apply data (string applytable input).
24-Oct-2026 12:22:31 Interpolation option: linear nearestflag
24-Oct-2026 12:22:31 self.finterp: interp_freq_nearestflag
24-Oct-2026 12:22:31 PASSED
24-Oct-2026 12:22:31
24-Oct-2026 12:22:32 test_task_sdcal.py::sdcal_test_apply::test_apply_sky14 2026-10-24 12:22:32        WARN        sdcal::calibrater::setvi(bool,bool)        Already using OLD VisibilityIterator.
24-Oct-2026 12:22:32 The following MS spws have no corresponding cal spws in uid___A002_X6218fb_X264.ms.sel.sky: 0 1 2 3 4 5 6 7 8 10 12 13 14 15 16 17 18 19 20
24-Oct-2026 12:22:32 2026-10-24 12:22:32        WARN        sdcal::::        MS obs=0,spw=9,ant=2 is selected for processing, but has no available calibration in uid___A002_X6218fb_X264.ms.sel.sky as mapped, and will be flagged.
24-Oct-2026 12:22:32 2026-10-24 12:22:32        WARN        sdcal::::        MS obs=0,spw=9,ant=3 is selected for processing, but has no available calibration in uid___A002_X6218fb_X264.ms.sel.sky as mapped, and will be flagged.
24-Oct-2026 12:22:32 2026-10-24 12:22:32        WARN        sdcal::::        MS obs=0,spw=11,ant=2 is selected for processing, but has no available calibration in uid___A002_X6218fb_X264.ms.sel.sky as mapped, and will be flagged.
24-Oct-2026 12:22:32 2026-10-24 12:22:32        WARN        sdcal::::        MS obs=0,spw=11,ant=3 is selected for processing, but has no available calibration in uid___A002_X6218fb_X264.ms.sel.sky as mapped, and will be flagged.
24-Oct-2026 12:22:32 2026-10-24 12:22:32        WARN        sdcal::Calibrater::correct2 (VI2/VB2)        Spectral window(s) 1, 3,
24-Oct-2026 12:22:32 2026-10-24 12:22:32        WARN        sdcal::Calibrater::correct2 (VI2/VB2)+          could not be corrected due to missing (pre-)calibration
24-Oct-2026 12:22:32 2026-10-24 12:22:32        WARN        sdcal::Calibrater::correct2 (VI2/VB2)+            in one or more of the specified tables.
24-Oct-2026 12:22:32 2026-10-24 12:22:32        WARN        sdcal::Calibrater::correct2 (VI2/VB2)+            Please check your results carefully!
24-Oct-2026 12:22:32
24-Oct-2026 12:22:32 test_apply_sky14 --- apply data (interp='').
24-Oct-2026 12:22:32 Interpolation option: linear nearestflag
24-Oct-2026 12:22:32 self.finterp: interp_freq_nearestflag
24-Oct-2026 12:22:32 PASSED
24-Oct-2026 12:22:32
24-Oct-2026 12:22:32 test_task_sdcal.py::sdcal_test_apply::test_apply_sky15 2026-10-24 12:22:33        WARN        sdcal::calibrater::setvi(bool,bool)        Already using OLD VisibilityIterator.
24-Oct-2026 12:22:32 The following MS spws have no corresponding cal spws in uid___A002_X6218fb_X264.ms.sel.sky: 0 1 2 3 4 5 6 7 8 10 12 13 14 15 16 17 18 19 20
24-Oct-2026 12:22:32 2026-10-24 12:22:33        WARN        sdcal::::        MS obs=0,spw=9,ant=2 is selected for processing, but has no available calibration in uid___A002_X6218fb_X264.ms.sel.sky as mapped, and will be flagged.
24-Oct-2026 12:22:32 2026-10-24 12:22:33        WARN        sdcal::::        MS obs=0,spw=9,ant=3 is selected for processing, but has no available calibration in uid___A002_X6218fb_X264.ms.sel.sky as mapped, and will be flagged.
24-Oct-2026 12:22:32 2026-10-24 12:22:33        WARN        sdcal::::        MS obs=0,spw=11,ant=2 is selected for processing, but has no available calibration in uid___A002_X6218fb_X264.ms.sel.sky as mapped, and will be flagged.
24-Oct-2026 12:22:32 2026-10-24 12:22:33        WARN        sdcal::::        MS obs=0,spw=11,ant=3 is selected for processing, but has no available calibration in uid___A002_X6218fb_X264.ms.sel.sky as mapped, and will be flagged.
24-Oct-2026 12:22:32 2026-10-24 12:22:33        WARN        sdcal::Calibrater::correct2 (VI2/VB2)        Spectral window(s) 1, 3,
24-Oct-2026 12:22:32 2026-10-24 12:22:33        WARN        sdcal::Calibrater::correct2 (VI2/VB2)+          could not be corrected due to missing (pre-)calibration
24-Oct-2026 12:22:32 2026-10-24 12:22:33        WARN        sdcal::Calibrater::correct2 (VI2/VB2)+            in one or more of the specified tables.
24-Oct-2026 12:22:32 2026-10-24 12:22:33        WARN        sdcal::Calibrater::correct2 (VI2/VB2)+            Please check your results carefully!
24-Oct-2026 12:22:32
24-Oct-2026 12:22:32 test_apply_sky15 --- check if WEIGHT_SPECTRUM is updated properly when it exists.
24-Oct-2026 12:22:32 Interpolation option: linear nearestflag
24-Oct-2026 12:22:32 self.finterp: interp_freq_nearestflag
24-Oct-2026 12:22:32 PASSED
24-Oct-2026 12:22:32
24-Oct-2026 12:22:33 test_task_sdcal.py::sdcal_test_single_polarization::test_single_pol_apply 2026-10-24 12:22:33        WARN        sdcal::calibrater::setvi(bool,bool)        Already using OLD VisibilityIterator.
24-Oct-2026 12:22:33 2026-10-24 12:22:33        WARN        sdcal::calibrater::setvi(bool,bool)        Already using OLD VisibilityIterator.
24-Oct-2026 12:22:33 The following MS spws have no corresponding cal spws in uid___A002_X6218fb_X264.ms.sel.sky: 0
24-Oct-2026 12:22:33 2026-10-24 12:22:33        WARN        sdcal::Calibrater::correct2 (VI2/VB2)        Spectral window(s) 0,
24-Oct-2026 12:22:33 2026-10-24 12:22:33        WARN        sdcal::Calibrater::correct2 (VI2/VB2)+          could not be corrected due to missing (pre-)calibration
24-Oct-2026 12:22:33 2026-10-24 12:22:33        WARN        sdcal::Calibrater::correct2 (VI2/VB2)+            in one or more of the specified tables.
24-Oct-2026 12:22:33 2026-10-24 12:22:33        WARN        sdcal::Calibrater::correct2 (VI2/VB2)+            Please check your results carefully!
24-Oct-2026 12:22:33
24-Oct-2026 12:22:33 test_single_pol_apply --- apply caltable to single-polarization data.
24-Oct-2026 12:22:33 PASSED
24-Oct-2026 12:22:33
24-Oct-2026 12:22:33 test_task_sdcal.py::sdcal_test_single_polarization::test_single_pol_apply_composite 2026-10-24 12:22:33        WARN        sdcal::calibrater::setvi(bool,bool)        Already using OLD VisibilityIterator.
24-Oct-2026 12:22:33 2026-10-24 12:22:34        WARN        sdcal::calibrater::setvi(bool,bool)        Already using OLD VisibilityIterator.
24-Oct-2026 12:22:33 The following MS spws have no corresponding cal spws in __sdcal_composite_mode_ps_065.tab: 0
24-Oct-2026 12:22:33 2026-10-24 12:22:34        WARN        sdcal::Calibrater::correct2 (VI2/VB2)        Spectral window(s) 0,
24-Oct-2026 12:22:33 2026-10-24 12:22:34        WARN        sdcal::Calibrater::correct2 (VI2/VB2)+          could not be corrected due to missing (pre-)calibration
24-Oct-2026 12:22:33 2026-10-24 12:22:34        WARN        sdcal::Calibrater::correct2 (VI2/VB2)+            in one or more of the specified tables.
24-Oct-2026 12:22:33 2026-10-24 12:22:34        WARN        sdcal::Calibrater::correct2 (VI2/VB2)+            Please check your results carefully!
24-Oct-2026 12:22:33
24-Oct-2026 12:22:33 test_single_pol_apply_composite --- on-the-fly calibration/application on single-polarization data.
24-Oct-2026 12:22:33 PASSED
24-Oct-2026 12:22:33
24-Oct-2026 12:22:33 test_task_sdcal.py::sdcal_test_single_polarization::test_single_pol_ps 2026-10-24 12:22:34        WARN        sdcal::calibrater::setvi(bool,bool)        Already using OLD VisibilityIterator.
24-Oct-2026 12:22:33
24-Oct-2026 12:22:33 test_single_pol_ps --- generate caltable for single-polarization data.
24-Oct-2026 12:22:33 PASSED
24-Oct-2026 12:22:33
24-Oct-2026 12:22:33 - generated xml file: /home/casatest/casa6/casatestutils/nosedir/xml/test_task_sdcal/nose.xml -
24-Oct-2026 12:22:33 =========================== short test summary info ============================
24-Oct-2026 12:22:33 SKIPPED [1] test_task_sdcal.py:1994: Skip test_apply_sky08M until calibrator tool supports processing MMS on serial casa
24-Oct-2026 12:22:33 ================= 65 passed, 1 skipped, 13 warnings in 58.50s ==================
24-Oct-2026 12:22:34
24-Oct-2026 12:22:34
24-Oct-2026 12:22:34 Setting Working Directory: /home/casatest/casa6/casatestutils/nosedir/test_task_listhistory/
24-Oct-2026 12:22:34 Test Directory: /home/casatest/casa6/casatestutils/nosedir/test_task_listhistory
24-Oct-2026 12:22:34
24-Oct-2026 12:22:34 Running Command: pytest --junitxml=/home/casatest/casa6/casatestutils/nosedir/xml/test_task_listhistory/nose.xml -s --disable-pytest-warnings --verbose -ra --tb=short /home/casatest/casa6/casatestutils/nosedir/test_task_listhistory/
24-Oct-2026 12:22:34
24-Oct-2026 12:22:34 Setting Working Directory: /home/casatest/casa6/casatestutils/nosedir/test_task_plotbandpass/
24-Oct-2026 12:22:34 Test Directory: /home/casatest/casa6/casatestutils/nosedir/test_task_plotbandpass
24-Oct-2026 12:22:34
24-Oct-2026 12:22:34 Running Command: pytest --junitxml=/home/casatest/casa6/casatestutils/nosedir/xml/test_task_plotbandpass/nose.xml -s --disable-pytest-warnings --verbose -ra --tb=short /home/casatest/casa6/casatestutils/nosedir/test_task_plotbandpass/
24-Oct-2026 12:22:34
24-Oct-2026 12:22:34 Setting Working Directory: /home/casatest/casa6/casatestutils/nosedir/test_task_exportuvfits/
24-Oct-2026 12:22:34 Test Directory: /home/casatest/casa6/casatestutils/nosedir/test_task_exportuvfits
24-Oct-2026 12:22:34
24-Oct-2026 12:22:34 Running Command: pytest --junitxml=/home/casatest/casa6/casatestutils/nosedir/xml/test_task_exportuvfits/nose.xml -s --disable-pytest-warnings --verbose -ra --tb=short /home/casatest/casa6/casatestutils/nosedir/test_task_exportuvfits/
24-Oct-2026 12:22:34
24-Oct-2026 12:22:34 Setting Working Directory: /home/casatest/casa6/casatestutils/nosedir/test_task_imtrans/
24-Oct-2026 12:22:34 Test Directory: /home/casatest/casa6/casatestutils/nosedir/test_task_imtrans
24-Oct-2026 12:22:34
24-Oct-2026 12:22:34 Running Command: pytest --junitxml=/home/casatest/casa6/casatestutils/nosedir/xml/test_task_imtrans/nose.xml -s --disable-pytest-warnings --verbose -ra --tb=short /home/casatest/casa6/casatestutils/nosedir/test_task_imtrans/
24-Oct-2026 12:22:34
24-Oct-2026 12:22:34 Setting Working Directory: /home/casatest/casa6/casatestutils/nosedir/test_task_listfits/
24-Oct-2026 12:22:34 Test Directory: /home/casatest/casa6/casatestutils/nosedir/test_task_listfits
24-Oct-2026 12:22:34
24-Oct-2026 12:22:34 Running Command: pytest --junitxml=/home/casatest/casa6/casatestutils/nosedir/xml/test_task_listfits/nose.xml -s --disable-pytest-warnings --verbose -ra --tb=short /home/casatest/casa6/casatestutils/nosedir/test_task_listfits/
24-Oct-2026 12:22:34
24-Oct-2026 12:22:34 Setting Working Directory: /home/casatest/casa6/casatestutils/nosedir/test_task_importmiriad/
24-Oct-2026 12:22:34 Test Directory: /home/casatest/casa6/casatestutils/nosedir/test_task_importmiriad
24-Oct-2026 12:22:34
24-Oct-2026 12:22:34 Running Command: pytest --junitxml=/home/casatest/casa6/casatestutils/nosedir/xml/test_task_importmiriad/nose.xml -s --disable-pytest-warnings --verbose -ra --tb=short /home/casatest/casa6/casatestutils/nosedir/test_task_importmiriad/
24-Oct-2026 12:22:34
24-Oct-2026 12:22:34 Setting Working Directory: /home/casatest/casa6/casatestutils/nosedir/test_task_deconvolve/
24-Oct-2026 12:22:34 Test Directory: /home/casatest/casa6/casatestutils/nosedir/test_task_deconvolve
24-Oct-2026 12:22:34
24-Oct-2026 12:22:34 Running Command: pytest --junitxml=/home/casatest/casa6/casatestutils/nosedir/xml/test_task_deconvolve/nose.xml -s --disable-pytest-warnings --verbose -ra --tb=short /home/casatest/casa6/casatestutils/nosedir/test_task_deconvolve/
24-Oct-2026 12:22:34
24-Oct-2026 12:22:34 Setting Working Directory: /home/casatest/casa6/casatestutils/nosedir/test_task_imregrid/
24-Oct-2026 12:22:34 Test Directory: /home/casatest/casa6/casatestutils/nosedir/test_task_imregrid
24-Oct-2026 12:22:34
24-Oct-2026 12:22:34 Running Command: pytest --junitxml=/home/casatest/casa6/casatestutils/nosedir/xml/test_task_imregrid/nose.xml -s --disable-pytest-warnings --verbose -ra --tb=short /home/casatest/casa6/casatestutils/nosedir/test_task_imregrid/
24-Oct-2026 12:22:34
24-Oct-2026 12:22:34 Setting Working Directory: /home/casatest/casa6/casatestutils/nosedir/test_task_setjy/
24-Oct-2026 12:22:34 Test Directory: /home/casatest/casa6/casatestutils/nosedir/test_task_setjy
24-Oct-2026 12:22:34
24-Oct-2026 12:22:34 Running Command: pytest --junitxml=/home/casatest/casa6/casatestutils/nosedir/xml/test_task_setjy/nose.xml -s --disable-pytest-warnings --verbose -ra --tb=short /home/casatest/casa6/casatestutils/nosedir/test_task_setjy/
24-Oct-2026 12:22:34
24-Oct-2026 12:22:34 Setting Working Directory: /home/casatest/casa6/casatestutils/nosedir/test_task_asdmsummary/
24-Oct-2026 12:22:34 Test Directory: /home/casatest/casa6/casatestutils/nosedir/test_task_asdmsummary
24-Oct-2026 12:22:34
24-Oct-2026 12:22:34 Running Command: pytest --junitxml=/home/casatest/casa6/casatestutils/nosedir/xml/test_task_asdmsummary/nose.xml -s --disable-pytest-warnings --verbose -ra --tb=short /home/casatest/casa6/casatestutils/nosedir/test_task_asdmsummary/
24-Oct-2026 12:22:34
24-Oct-2026 12:22:34 Setting Working Directory: /home/casatest/casa6/casatestutils/nosedir/test_task_nrobeamaverage/
24-Oct-2026 12:22:34 Test Directory: /home/casatest/casa6/casatestutils/nosedir/test_task_nrobeamaverage
24-Oct-2026 12:22:34
24-Oct-2026 12:22:34 Running Command: pytest --junitxml=/home/casatest/casa6/casatestutils/nosedir/xml/test_task_nrobeamaverage/nose.xml -s --disable-pytest-warnings --verbose -ra --tb=short /home/casatest/casa6/casatestutils/nosedir/test_task_nrobeamaverage/
24-Oct-2026 12:22:34
24-Oct-2026 12:22:34 Setting Working Directory: /home/casatest/casa6/casatestutils/nosedir/test_task_polfromgain/
24-Oct-2026 12:22:34 Test Directory: /home/casatest/casa6/casatestutils/nosedir/test_task_polfromgain
24-Oct-2026 12:22:34
24-Oct-2026 12:22:34 Running Command: pytest --junitxml=/home/casatest/casa6/casatestutils/nosedir/xml/test_task_polfromgain/nose.xml -s --disable-pytest-warnings --verbose -ra --tb=short /home/casatest/casa6/casatestutils/nosedir/test_task_polfromgain/
24-Oct-2026 12:22:34
24-Oct-2026 12:22:34 Setting Working Directory: /home/casatest/casa6/casatestutils/nosedir/test_task_getcalmodvla/
24-Oct-2026 12:22:34 Test Directory: /home/casatest/casa6/casatestutils/nosedir/test_task_getcalmodvla
24-Oct-2026 12:22:34
24-Oct-2026 12:22:34 Running Command: pytest --junitxml=/home/casatest/casa6/casatestutils/nosedir/xml/test_task_getcalmodvla/nose.xml -s --disable-pytest-warnings --verbose -ra --tb=short /home/casatest/casa6/casatestutils/nosedir/test_task_getcalmodvla/
24-Oct-2026 12:22:34
24-Oct-2026 12:22:34 Setting Working Directory: /home/casatest/casa6/casatestutils/nosedir/test_task_blcal/
24-Oct-2026 12:22:34 Test Directory: /home/casatest/casa6/casatestutils/nosedir/test_task_blcal
24-Oct-2026 12:22:34
24-Oct-2026 12:22:34 Running Command: pytest --junitxml=/home/casatest/casa6/casatestutils/nosedir/xml/test_task_blcal/nose.xml -s --disable-pytest-warnings --verbose -ra --tb=short /home/casatest/casa6/casatestutils/nosedir/test_task_blcal/
24-Oct-2026 12:22:34
24-Oct-2026 12:22:34 Setting Working Directory: /home/casatest/casa6/casatestutils/nosedir/test_task_importatca/
24-Oct-2026 12:22:34 Test Directory: /home/casatest/casa6/casatestutils/nosedir/test_task_importatca
24-Oct-2026 12:22:34
24-Oct-2026 12:22:34 Running Command: pytest --junitxml=/home/casatest/casa6/casatestutils/nosedir/xml/test_task_importatca/nose.xml -s --disable-pytest-warnings --verbose -ra --tb=short /home/casatest/casa6/casatestutils/nosedir/test_task_importatca/
24-Oct-2026 12:22:34
24-Oct-2026 12:22:34 Setting Working Directory: /home/casatest/casa6/casatestutils/nosedir/test_task_makemask/
24-Oct-2026 12:22:34 Test Directory: /home/casatest/casa6/casatestutils/nosedir/test_task_makemask
24-Oct-2026 12:22:34
24-Oct-2026 12:22:34 Running Command: pytest --junitxml=/home/casatest/casa6/casatestutils/nosedir/xml/test_task_makemask/nose.xml -s --disable-pytest-warnings --verbose -ra --tb=short /home/casatest/casa6/casatestutils/nosedir/test_task_makemask/
24-Oct-2026 12:22:34
24-Oct-2026 12:22:34 Setting Working Directory: /home/casatest/casa6/casatestutils/nosedir/test_task_imrebin/
24-Oct-2026 12:22:34 Test Directory: /home/casatest/casa6/casatestutils/nosedir/test_task_imrebin
24-Oct-2026 12:22:34
24-Oct-2026 12:22:34 Running Command: pytest --junitxml=/home/casatest/casa6/casatestutils/nosedir/xml/test_task_imrebin/nose.xml -s --disable-pytest-warnings --verbose -ra --tb=short /home/casatest/casa6/casatestutils/nosedir/test_task_imrebin/
24-Oct-2026 12:22:34
24-Oct-2026 12:22:34 Setting Working Directory: /home/casatest/casa6/casatestutils/nosedir/test_task_sdcal/
24-Oct-2026 12:22:34 Test Directory: /home/casatest/casa6/casatestutils/nosedir/test_task_sdcal
24-Oct-2026 12:22:34
24-Oct-2026 12:22:34 Running Command: pytest --junitxml=/home/casatest/casa6/casatestutils/nosedir/xml/test_task_sdcal/nose.xml -s --disable-pytest-warnings --verbose -ra --tb=short /home/casatest/casa6/casatestutils/nosedir/test_task_sdcal/
24-Oct-2026 12:22:35 total 297928
24-Oct-2026 12:22:35 -rw-r--r-- 1 casaci 15001   1935259 Oct 24 06:52 casatasks-6.8.0.1-py3-none-any.whl
24-Oct-2026 12:22:35 -rw-r--r-- 1 casaci root    4553103 Oct 24 12:22 casatasks_test.log
24-Oct-2026 12:22:35 -rw-r--r-- 1 casaci 15001    161004 Oct 24 06:52 casatestutils-6.8.0.1-py3-none-any.whl
24-Oct-2026 12:22:35 -rw-r--r-- 1 casaci 15001 297661210 Oct 24 06:52 casatools-6.8.0.1-cp312-cp312-manylinux_2_28_x86_64.whl
24-Oct-2026 12:22:35 -rw-r--r-- 1 casaci root        870 Oct 24 12:22 requirements.txt
24-Oct-2026 12:22:35 -rw-r--r-- 1 casaci root       1822 Oct 24 12:22 test_task_accor.xml
24-Oct-2026 12:22:35 -rw-r--r-- 1 casaci root        998 Oct 24 12:22 test_task_appendantab.xml
24-Oct-2026 12:22:35 -rw-r--r-- 1 casaci root       3271 Oct 24 12:22 test_task_applycal.xml
24-Oct-2026 12:22:35 -rw-r--r-- 1 casaci root        655 Oct 24 12:22 test_task_asdmsummary.xml
24-Oct-2026 12:22:35 -rw-r--r-- 1 casaci root        831 Oct 24 12:22 test_task_bandpass.xml
24-Oct-2026 12:22:35 -rw-r--r-- 1 casaci root       1748 Oct 24 12:22 test_task_blcal.xml
24-Oct-2026 12:22:35 -rw-r--r-- 1 casaci root        880 Oct 24 12:22 test_task_calstat.xml
24-Oct-2026 12:22:35 -rw-r--r-- 1 casaci root        998 Oct 24 12:22 test_task_clearcal.xml
24-Oct-2026 12:22:35 -rw-r--r-- 1 casaci root        689 Oct 24 12:22 test_task_clearstat.xml
24-Oct-2026 12:22:35 -rw-r--r-- 1 casaci root       2017 Oct 24 12:22 test_task_concat.xml
24-Oct-2026 12:22:35 -rw-r--r-- 1 casaci root       1367 Oct 24 12:22 test_task_conjugatevis.xml
24-Oct-2026 12:22:35 -rw-r--r-- 1 casaci root       7424 Oct 24 12:22 test_task_cvel.xml
24-Oct-2026 12:22:35 -rw-r--r-- 1 casaci root       5054 Oct 24 12:22 test_task_cvel2.xml
24-Oct-2026 12:22:35 -rw-r--r-- 1 casaci root      15738 Oct 24 12:22 test_task_deconvolve.xml
24-Oct-2026 12:22:35 -rw-r--r-- 1 casaci root        944 Oct 24 12:22 test_task_defintent.xml
24-Oct-2026 12:22:35 -rw-r--r-- 1 casaci root        612 Oct 24 12:22 test_task_delmod.xml
24-Oct-2026 12:22:35 -rw-r--r-- 1 casaci root       1798 Oct 24 12:22 test_task_exportasdm.xml
24-Oct-2026 12:22:35 -rw-r--r-- 1 casaci root        359 Oct 24 12:22 test_task_exportfits.xml
24-Oct-2026 12:22:35 -rw-r--r-- 1 casaci root       1863 Oct 24 12:22 test_task_exportuvfits.xml
24-Oct-2026 12:22:35 -rw-r--r-- 1 casaci root       1087 Oct 24 12:22 test_task_feather.xml
24-Oct-2026 12:22:35 -rw-r--r-- 1 casaci root       1977 Oct 24 12:22 test_task_fixplanets.xml
24-Oct-2026 12:22:35 -rw-r--r-- 1 casaci root       1469 Oct 24 12:22 test_task_fixvis.xml
24-Oct-2026 12:22:35 -rw-r--r-- 1 casaci root       4627 Oct 24 12:22 test_task_flagcmd.xml
24-Oct-2026 12:22:35 -rw-r--r-- 1 casaci root      28030 Oct 24 12:22 test_task_flagdata.xml
24-Oct-2026 12:22:35 -rw-r--r-- 1 casaci root        966 Oct 24 12:22 test_task_flagmanager.xml
24-Oct-2026 12:22:35 -rw-r--r-- 1 casaci root       2358 Oct 24 12:22 test_task_fluxscale.xml
24-Oct-2026 12:22:35 -rw-r--r-- 1 casaci root       1678 Oct 24 12:22 test_task_fringefit.xml
24-Oct-2026 12:22:35 -rw-r--r-- 1 casaci root       2373 Oct 24 12:22 test_task_ft.xml
24-Oct-2026 12:22:35 -rw-r--r-- 1 casaci root       4057 Oct 24 12:22 test_task_gaincal.xml
24-Oct-2026 12:22:35 -rw-r--r-- 1 casaci root       3172 Oct 24 12:22 test_task_gencal.xml
24-Oct-2026 12:22:35 -rw-r--r-- 1 casaci root        684 Oct 24 12:22 test_task_getantposalma.xml
24-Oct-2026 12:22:35 -rw-r--r-- 1 casaci root        685 Oct 24 12:22 test_task_getcalmodvla.xml
24-Oct-2026 12:22:35 -rw-r--r-- 1 casaci root       1162 Oct 24 12:22 test_task_getephemtable.xml
24-Oct-2026 12:22:35 -rw-r--r-- 1 casaci root       1329 Oct 24 12:22 test_task_getjyperkalma.xml
24-Oct-2026 12:22:35 -rw-r--r-- 1 casaci root       2607 Oct 24 12:22 test_task_hanningsmooth.xml
24-Oct-2026 12:22:35 -rw-r--r-- 1 casaci root      29162 Oct 24 12:22 test_task_imbaseline.xml
24-Oct-2026 12:22:35 -rw-r--r-- 1 casaci root       2220 Oct 24 12:22 test_task_imcollapse.xml
24-Oct-2026 12:22:35 -rw-r--r-- 1 casaci root       1223 Oct 24 12:22 test_task_imcontsub.xml
24-Oct-2026 12:22:35 -rw-r--r-- 1 casaci root       1767 Oct 24 12:22 test_task_imdev.xml
24-Oct-2026 12:22:35 -rw-r--r-- 1 casaci root       3192 Oct 24 12:22 test_task_imfit.xml
24-Oct-2026 12:22:35 -rw-r--r-- 1 casaci root       2135 Oct 24 12:22 test_task_imhead.xml
24-Oct-2026 12:22:35 -rw-r--r-- 1 casaci root       1175 Oct 24 12:22 test_task_imhistory.xml
24-Oct-2026 12:22:35 -rw-r--r-- 1 casaci root       3055 Oct 24 12:22 test_task_immath.xml
24-Oct-2026 12:22:35 -rw-r--r-- 1 casaci root       1668 Oct 24 12:22 test_task_immoments.xml
24-Oct-2026 12:22:35 -rw-r--r-- 1 casaci root       1129 Oct 24 12:22 test_task_impbcor.xml
24-Oct-2026 12:22:35 -rw-r--r-- 1 casaci root        752 Oct 24 12:22 test_task_importasap.xml
24-Oct-2026 12:22:35 -rw-r--r-- 1 casaci root       4130 Oct 24 12:22 test_task_importasdm.xml
24-Oct-2026 12:22:35 -rw-r--r-- 1 casaci root        352 Oct 24 12:22 test_task_importatca.xml
24-Oct-2026 12:22:35 -rw-r--r-- 1 casaci root       1483 Oct 24 12:22 test_task_importfitsidi.xml
24-Oct-2026 12:22:35 -rw-r--r-- 1 casaci root        358 Oct 24 12:22 test_task_importmiriad.xml
24-Oct-2026 12:22:35 -rw-r--r-- 1 casaci root        639 Oct 24 12:22 test_task_importnro.xml
24-Oct-2026 12:22:35 -rw-r--r-- 1 casaci root       1818 Oct 24 12:22 test_task_importuvfits.xml
24-Oct-2026 12:22:35 -rw-r--r-- 1 casaci root        833 Oct 24 12:22 test_task_importvla.xml
24-Oct-2026 12:22:35 -rw-r--r-- 1 casaci root       1838 Oct 24 12:22 test_task_impv.xml
24-Oct-2026 12:22:35 -rw-r--r-- 1 casaci root       2115 Oct 24 12:22 test_task_imrebin.xml
24-Oct-2026 12:22:35 -rw-r--r-- 1 casaci root        830 Oct 24 12:22 test_task_imreframe.xml
24-Oct-2026 12:22:35 -rw-r--r-- 1 casaci root       2342 Oct 24 12:22 test_task_imregrid.xml
24-Oct-2026 12:22:35 -rw-r--r-- 1 casaci root       1462 Oct 24 12:22 test_task_imsmooth.xml
24-Oct-2026 12:22:35 -rw-r--r-- 1 casaci root       1440 Oct 24 12:22 test_task_imstat.xml
24-Oct-2026 12:22:35 -rw-r--r-- 1 casaci root        734 Oct 24 12:22 test_task_imsubimage.xml
24-Oct-2026 12:22:35 -rw-r--r-- 1 casaci root        804 Oct 24 12:22 test_task_imtrans.xml
24-Oct-2026 12:22:35 -rw-r--r-- 1 casaci root       3129 Oct 24 12:22 test_task_imval.xml
24-Oct-2026 12:22:35 -rw-r--r-- 1 casaci root       3796 Oct 24 12:22 test_task_initweights.xml
24-Oct-2026 12:22:35 -rw-r--r-- 1 casaci root       1685 Oct 24 12:22 test_task_listcal.xml
24-Oct-2026 12:22:35 -rw-r--r-- 1 casaci root        512 Oct 24 12:22 test_task_listfits.xml
24-Oct-2026 12:22:35 -rw-r--r-- 1 casaci root        752 Oct 24 12:22 test_task_listhistory.xml
24-Oct-2026 12:22:35 -rw-r--r-- 1 casaci root       8581 Oct 24 12:22 test_task_listobs.xml
24-Oct-2026 12:22:35 -rw-r--r-- 1 casaci root       1519 Oct 24 12:22 test_task_listpartition.xml
24-Oct-2026 12:22:35 -rw-r--r-- 1 casaci root        525 Oct 24 12:22 test_task_listsdm.xml
24-Oct-2026 12:22:35 -rw-r--r-- 1 casaci root        754 Oct 24 12:22 test_task_listvis.xml
24-Oct-2026 12:22:35 -rw-r--r-- 1 casaci root       2663 Oct 24 12:22 test_task_makemask.xml
24-Oct-2026 12:22:35 -rw-r--r-- 1 casaci root      34488 Oct 24 12:22 test_task_mstransform.xml
24-Oct-2026 12:22:35 -rw-r--r-- 1 casaci root       5847 Oct 24 12:22 test_task_mstransform_mms.xml
24-Oct-2026 12:22:35 -rw-r--r-- 1 casaci root       1113 Oct 24 12:22 test_task_msuvbinflag.xml
24-Oct-2026 12:22:35 -rw-r--r-- 1 casaci root        782 Oct 24 12:22 test_task_nrobeamaverage.xml
24-Oct-2026 12:22:35 -rw-r--r-- 1 casaci root       3467 Oct 24 12:22 test_task_partition.xml
24-Oct-2026 12:22:35 -rw-r--r-- 1 casaci root       2359 Oct 24 12:22 test_task_pccor.xml
24-Oct-2026 12:22:35 -rw-r--r-- 1 casaci root       3403 Oct 24 12:22 test_task_phaseshift.xml
24-Oct-2026 12:22:35 -rw-r--r-- 1 casaci root       1095 Oct 24 12:22 test_task_plotants.xml
24-Oct-2026 12:22:35 -rw-r--r-- 1 casaci root       3883 Oct 24 12:22 test_task_plotbandpass.xml
24-Oct-2026 12:22:35 -rw-r--r-- 1 casaci root       1795 Oct 24 12:22 test_task_plotprofilemap.xml
24-Oct-2026 12:22:35 -rw-r--r-- 1 casaci root       1175 Oct 24 12:22 test_task_plotweather.xml
24-Oct-2026 12:22:35 -rw-r--r-- 1 casaci root       3088 Oct 24 12:22 test_task_polcal.xml
24-Oct-2026 12:22:35 -rw-r--r-- 1 casaci root        358 Oct 24 12:22 test_task_polfromgain.xml
24-Oct-2026 12:22:35 -rw-r--r-- 1 casaci root       1217 Oct 24 12:22 test_task_predictcomp.xml
24-Oct-2026 12:22:35 -rw-r--r-- 1 casaci root        973 Oct 24 12:22 test_task_rerefant.xml
24-Oct-2026 12:22:35 -rw-r--r-- 1 casaci root       1207 Oct 24 12:22 test_task_rmfit.xml
24-Oct-2026 12:22:35 -rw-r--r-- 1 casaci root        810 Oct 24 12:22 test_task_rmtables.xml
24-Oct-2026 12:22:35 -rw-r--r-- 1 casaci root       5028 Oct 24 12:22 test_task_sdatmcor.xml
24-Oct-2026 12:22:35 -rw-r--r-- 1 casaci root      18290 Oct 24 12:22 test_task_sdbaseline.xml
24-Oct-2026 12:22:35 -rw-r--r-- 1 casaci root       6646 Oct 24 12:22 test_task_sdcal.xml
24-Oct-2026 12:22:35 -rw-r--r-- 1 casaci root       4176 Oct 24 12:22 test_task_sdfit.xml
24-Oct-2026 12:22:35 -rw-r--r-- 1 casaci root       1862 Oct 24 12:22 test_task_sdfixscan.xml
24-Oct-2026 12:22:35 -rw-r--r-- 1 casaci root       1589 Oct 24 12:22 test_task_sdgaincal.xml
24-Oct-2026 12:22:35 -rw-r--r-- 1 casaci root       2718 Oct 24 12:22 test_task_sdintimaging.xml
24-Oct-2026 12:22:35 -rw-r--r-- 1 casaci root        585 Oct 24 12:22 test_task_sdpolaverage.xml
24-Oct-2026 12:22:35 -rw-r--r-- 1 casaci root       2453 Oct 24 12:22 test_task_sdsidebandsplit.xml
24-Oct-2026 12:22:35 -rw-r--r-- 1 casaci root       3947 Oct 24 12:22 test_task_sdsmooth.xml
24-Oct-2026 12:22:35 -rw-r--r-- 1 casaci root       4399 Oct 24 12:22 test_task_sdtimeaverage.xml
24-Oct-2026 12:22:35 -rw-r--r-- 1 casaci root       3451 Oct 24 12:22 test_task_setjy.xml
24-Oct-2026 12:22:35 -rw-r--r-- 1 casaci root       1715 Oct 24 12:22 test_task_simanalyze.xml
24-Oct-2026 12:22:35 -rw-r--r-- 1 casaci root      14295 Oct 24 12:22 test_task_simobserve.xml
24-Oct-2026 12:22:35 -rw-r--r-- 1 casaci root       1511 Oct 24 12:22 test_task_slsearch.xml
24-Oct-2026 12:22:35 -rw-r--r-- 1 casaci root       1388 Oct 24 12:22 test_task_smoothcal.xml
24-Oct-2026 12:22:35 -rw-r--r-- 1 casaci root       1949 Oct 24 12:22 test_task_specfit.xml
24-Oct-2026 12:22:35 -rw-r--r-- 1 casaci root        716 Oct 24 12:22 test_task_specflux.xml
24-Oct-2026 12:22:35 -rw-r--r-- 1 casaci root        453 Oct 24 12:22 test_task_specsmooth.xml
24-Oct-2026 12:22:35 -rw-r--r-- 1 casaci root        468 Oct 24 12:22 test_task_splattotable.xml
24-Oct-2026 12:22:35 -rw-r--r-- 1 casaci root      17902 Oct 24 12:22 test_task_split.xml
24-Oct-2026 12:22:35 -rw-r--r-- 1 casaci root        706 Oct 24 12:22 test_task_spxfit.xml
24-Oct-2026 12:22:35 -rw-r--r-- 1 casaci root       2409 Oct 24 12:22 test_task_statwt.xml
24-Oct-2026 12:22:35 -rw-r--r-- 1 casaci root      38942 Oct 24 12:22 test_task_tclean.xml
24-Oct-2026 12:22:35 -rw-r--r-- 1 casaci root        700 Oct 24 12:22 test_task_testconcat.xml
24-Oct-2026 12:22:35 -rw-r--r-- 1 casaci root      24766 Oct 24 12:22 test_task_tsdimaging.xml
24-Oct-2026 12:22:35 -rw-r--r-- 1 casaci root       4555 Oct 24 12:22 test_task_uvcontsub.xml
24-Oct-2026 12:22:35 -rw-r--r-- 1 casaci root        843 Oct 24 12:22 test_task_uvcontsub_old.xml
24-Oct-2026 12:22:35 -rw-r--r-- 1 casaci root       1522 Oct 24 12:22 test_task_uvmodelfit.xml
24-Oct-2026 12:22:35 -rw-r--r-- 1 casaci root       1483 Oct 24 12:22 test_task_virtualconcat.xml
24-Oct-2026 12:22:35 -rw-r--r-- 1 casaci root       1096 Oct 24 12:22 test_task_vishead.xml
24-Oct-2026 12:22:35 -rw-r--r-- 1 casaci root       3288 Oct 24 12:22 test_task_visstat.xml
24-Oct-2026 12:22:35 -rw-r--r-- 1 casaci root       1984 Oct 24 12:22 test_task_wvrgcal.xml
24-Oct-2026 12:22:35 -rw-r--r-- 1 casaci root       1841 Oct 24 12:22 test_task_zenithdelaycal.xml
24-Oct-2026 12:22:35 Finished task 'Test wheel' with result: Success
24-Oct-2026 12:22:35 Starting task 'Inject is_641' of type 'com.atlassian.bamboo.plugins.bamboo-variable-inject-plugin:inject'
24-Oct-2026 12:22:35 Injected variable bamboo.inject.is_641=False in LOCAL scope
24-Oct-2026 12:22:35 Finished task 'Inject is_641' with result: Success
24-Oct-2026 12:22:35
Substituting variable: ${bamboo.planRepository.branchName} with master
24-Oct-2026 12:22:35 Starting task 'Tar work directory' of type 'com.atlassian.bamboo.plugins.scripttask:task.builder.script'
24-Oct-2026 12:22:35
Beginning to execute external process for build 'CASASPECS - Master Test GPU 3.12 - Test Tasks Many Linux 2.28 Rocky 8.10 Py3.12 #189 (CASASPECS-MASTERTESTGPUPY312-TTM228PY312-189)'
... running command line:
/export/cvpost135-nvme/casa/bamboohome/temp/CASASPECS-MASTERTESTGPUPY312-TTM228PY312-189-ScriptBuildTask-7803327728505805667.sh
... in: /export/cvpost135-nvme/casa/bamboohome/xml-data/build-dir/CASASPECS-MASTERTESTGPUPY312-TTM228PY312
24-Oct-2026 12:22:35 Package working directory
24-Oct-2026 12:22:35 tar: work: Cannot stat: No such file or directory
24-Oct-2026 12:22:35 tar: Exiting with failure status due to previous errors
24-Oct-2026 12:22:35 total 297932
24-Oct-2026 12:22:35 -rw-r--r-- 1 casaci 15001   1935259 Oct 24 06:52 casatasks-6.8.0.1-py3-none-any.whl
24-Oct-2026 12:22:35 -rw-r--r-- 1 casaci root    4553103 Oct 24 12:22 casatasks_test.log
24-Oct-2026 12:22:35 -rw-r--r-- 1 casaci 15001    161004 Oct 24 06:52 casatestutils-6.8.0.1-py3-none-any.whl
24-Oct-2026 12:22:35 -rw-r--r-- 1 casaci 15001 297661210 Oct 24 06:52 casatools-6.8.0.1-cp312-cp312-manylinux_2_28_x86_64.whl
24-Oct-2026 12:22:35 -rw-r--r-- 1 casaci root        870 Oct 24 12:22 requirements.txt
24-Oct-2026 12:22:35 -rw-r--r-- 1 casaci root       1822 Oct 24 12:22 test_task_accor.xml
24-Oct-2026 12:22:35 -rw-r--r-- 1 casaci root        998 Oct 24 12:22 test_task_appendantab.xml
24-Oct-2026 12:22:35 -rw-r--r-- 1 casaci root       3271 Oct 24 12:22 test_task_applycal.xml
24-Oct-2026 12:22:35 -rw-r--r-- 1 casaci root        655 Oct 24 12:22 test_task_asdmsummary.xml
24-Oct-2026 12:22:35 -rw-r--r-- 1 casaci root        831 Oct 24 12:22 test_task_bandpass.xml
24-Oct-2026 12:22:35 -rw-r--r-- 1 casaci root       1748 Oct 24 12:22 test_task_blcal.xml
24-Oct-2026 12:22:35 -rw-r--r-- 1 casaci root        880 Oct 24 12:22 test_task_calstat.xml
24-Oct-2026 12:22:35 -rw-r--r-- 1 casaci root        998 Oct 24 12:22 test_task_clearcal.xml
24-Oct-2026 12:22:35 -rw-r--r-- 1 casaci root        689 Oct 24 12:22 test_task_clearstat.xml
24-Oct-2026 12:22:35 -rw-r--r-- 1 casaci root       2017 Oct 24 12:22 test_task_concat.xml
24-Oct-2026 12:22:35 -rw-r--r-- 1 casaci root       1367 Oct 24 12:22 test_task_conjugatevis.xml
24-Oct-2026 12:22:35 -rw-r--r-- 1 casaci root       7424 Oct 24 12:22 test_task_cvel.xml
24-Oct-2026 12:22:35 -rw-r--r-- 1 casaci root       5054 Oct 24 12:22 test_task_cvel2.xml
24-Oct-2026 12:22:35 -rw-r--r-- 1 casaci root      15738 Oct 24 12:22 test_task_deconvolve.xml
24-Oct-2026 12:22:35 -rw-r--r-- 1 casaci root        944 Oct 24 12:22 test_task_defintent.xml
24-Oct-2026 12:22:35 -rw-r--r-- 1 casaci root        612 Oct 24 12:22 test_task_delmod.xml
24-Oct-2026 12:22:35 -rw-r--r-- 1 casaci root       1798 Oct 24 12:22 test_task_exportasdm.xml
24-Oct-2026 12:22:35 -rw-r--r-- 1 casaci root        359 Oct 24 12:22 test_task_exportfits.xml
24-Oct-2026 12:22:35 -rw-r--r-- 1 casaci root       1863 Oct 24 12:22 test_task_exportuvfits.xml
24-Oct-2026 12:22:35 -rw-r--r-- 1 casaci root       1087 Oct 24 12:22 test_task_feather.xml
24-Oct-2026 12:22:35 -rw-r--r-- 1 casaci root       1977 Oct 24 12:22 test_task_fixplanets.xml
24-Oct-2026 12:22:35 -rw-r--r-- 1 casaci root       1469 Oct 24 12:22 test_task_fixvis.xml
24-Oct-2026 12:22:35 -rw-r--r-- 1 casaci root       4627 Oct 24 12:22 test_task_flagcmd.xml
24-Oct-2026 12:22:35 -rw-r--r-- 1 casaci root      28030 Oct 24 12:22 test_task_flagdata.xml
24-Oct-2026 12:22:35 -rw-r--r-- 1 casaci root        966 Oct 24 12:22 test_task_flagmanager.xml
24-Oct-2026 12:22:35 -rw-r--r-- 1 casaci root       2358 Oct 24 12:22 test_task_fluxscale.xml
24-Oct-2026 12:22:35 -rw-r--r-- 1 casaci root       1678 Oct 24 12:22 test_task_fringefit.xml
24-Oct-2026 12:22:35 -rw-r--r-- 1 casaci root       2373 Oct 24 12:22 test_task_ft.xml
24-Oct-2026 12:22:35 -rw-r--r-- 1 casaci root       4057 Oct 24 12:22 test_task_gaincal.xml
24-Oct-2026 12:22:35 -rw-r--r-- 1 casaci root       3172 Oct 24 12:22 test_task_gencal.xml
24-Oct-2026 12:22:35 -rw-r--r-- 1 casaci root        684 Oct 24 12:22 test_task_getantposalma.xml
24-Oct-2026 12:22:35 -rw-r--r-- 1 casaci root        685 Oct 24 12:22 test_task_getcalmodvla.xml
24-Oct-2026 12:22:35 -rw-r--r-- 1 casaci root       1162 Oct 24 12:22 test_task_getephemtable.xml
24-Oct-2026 12:22:35 -rw-r--r-- 1 casaci root       1329 Oct 24 12:22 test_task_getjyperkalma.xml
24-Oct-2026 12:22:35 -rw-r--r-- 1 casaci root       2607 Oct 24 12:22 test_task_hanningsmooth.xml
24-Oct-2026 12:22:35 -rw-r--r-- 1 casaci root      29162 Oct 24 12:22 test_task_imbaseline.xml
24-Oct-2026 12:22:35 -rw-r--r-- 1 casaci root       2220 Oct 24 12:22 test_task_imcollapse.xml
24-Oct-2026 12:22:35 -rw-r--r-- 1 casaci root       1223 Oct 24 12:22 test_task_imcontsub.xml
24-Oct-2026 12:22:35 -rw-r--r-- 1 casaci root       1767 Oct 24 12:22 test_task_imdev.xml
24-Oct-2026 12:22:35 -rw-r--r-- 1 casaci root       3192 Oct 24 12:22 test_task_imfit.xml
24-Oct-2026 12:22:35 -rw-r--r-- 1 casaci root       2135 Oct 24 12:22 test_task_imhead.xml
24-Oct-2026 12:22:35 -rw-r--r-- 1 casaci root       1175 Oct 24 12:22 test_task_imhistory.xml
24-Oct-2026 12:22:35 -rw-r--r-- 1 casaci root       3055 Oct 24 12:22 test_task_immath.xml
24-Oct-2026 12:22:35 -rw-r--r-- 1 casaci root       1668 Oct 24 12:22 test_task_immoments.xml
24-Oct-2026 12:22:35 -rw-r--r-- 1 casaci root       1129 Oct 24 12:22 test_task_impbcor.xml
24-Oct-2026 12:22:35 -rw-r--r-- 1 casaci root        752 Oct 24 12:22 test_task_importasap.xml
24-Oct-2026 12:22:35 -rw-r--r-- 1 casaci root       4130 Oct 24 12:22 test_task_importasdm.xml
24-Oct-2026 12:22:35 -rw-r--r-- 1 casaci root        352 Oct 24 12:22 test_task_importatca.xml
24-Oct-2026 12:22:35 -rw-r--r-- 1 casaci root       1483 Oct 24 12:22 test_task_importfitsidi.xml
24-Oct-2026 12:22:35 -rw-r--r-- 1 casaci root        358 Oct 24 12:22 test_task_importmiriad.xml
24-Oct-2026 12:22:35 -rw-r--r-- 1 casaci root        639 Oct 24 12:22 test_task_importnro.xml
24-Oct-2026 12:22:35 -rw-r--r-- 1 casaci root       1818 Oct 24 12:22 test_task_importuvfits.xml
24-Oct-2026 12:22:35 -rw-r--r-- 1 casaci root        833 Oct 24 12:22 test_task_importvla.xml
24-Oct-2026 12:22:35 -rw-r--r-- 1 casaci root       1838 Oct 24 12:22 test_task_impv.xml
24-Oct-2026 12:22:35 -rw-r--r-- 1 casaci root       2115 Oct 24 12:22 test_task_imrebin.xml
24-Oct-2026 12:22:35 -rw-r--r-- 1 casaci root        830 Oct 24 12:22 test_task_imreframe.xml
24-Oct-2026 12:22:35 -rw-r--r-- 1 casaci root       2342 Oct 24 12:22 test_task_imregrid.xml
24-Oct-2026 12:22:35 -rw-r--r-- 1 casaci root       1462 Oct 24 12:22 test_task_imsmooth.xml
24-Oct-2026 12:22:35 -rw-r--r-- 1 casaci root       1440 Oct 24 12:22 test_task_imstat.xml
24-Oct-2026 12:22:35 -rw-r--r-- 1 casaci root        734 Oct 24 12:22 test_task_imsubimage.xml
24-Oct-2026 12:22:35 -rw-r--r-- 1 casaci root        804 Oct 24 12:22 test_task_imtrans.xml
24-Oct-2026 12:22:35 -rw-r--r-- 1 casaci root       3129 Oct 24 12:22 test_task_imval.xml
24-Oct-2026 12:22:35 -rw-r--r-- 1 casaci root       3796 Oct 24 12:22 test_task_initweights.xml
24-Oct-2026 12:22:35 -rw-r--r-- 1 casaci root       1685 Oct 24 12:22 test_task_listcal.xml
24-Oct-2026 12:22:35 -rw-r--r-- 1 casaci root        512 Oct 24 12:22 test_task_listfits.xml
24-Oct-2026 12:22:35 -rw-r--r-- 1 casaci root        752 Oct 24 12:22 test_task_listhistory.xml
24-Oct-2026 12:22:35 -rw-r--r-- 1 casaci root       8581 Oct 24 12:22 test_task_listobs.xml
24-Oct-2026 12:22:35 -rw-r--r-- 1 casaci root       1519 Oct 24 12:22 test_task_listpartition.xml
24-Oct-2026 12:22:35 -rw-r--r-- 1 casaci root        525 Oct 24 12:22 test_task_listsdm.xml
24-Oct-2026 12:22:35 -rw-r--r-- 1 casaci root        754 Oct 24 12:22 test_task_listvis.xml
24-Oct-2026 12:22:35 -rw-r--r-- 1 casaci root       2663 Oct 24 12:22 test_task_makemask.xml
24-Oct-2026 12:22:35 -rw-r--r-- 1 casaci root      34488 Oct 24 12:22 test_task_mstransform.xml
24-Oct-2026 12:22:35 -rw-r--r-- 1 casaci root       5847 Oct 24 12:22 test_task_mstransform_mms.xml
24-Oct-2026 12:22:35 -rw-r--r-- 1 casaci root       1113 Oct 24 12:22 test_task_msuvbinflag.xml
24-Oct-2026 12:22:35 -rw-r--r-- 1 casaci root        782 Oct 24 12:22 test_task_nrobeamaverage.xml
24-Oct-2026 12:22:35 -rw-r--r-- 1 casaci root       3467 Oct 24 12:22 test_task_partition.xml
24-Oct-2026 12:22:35 -rw-r--r-- 1 casaci root       2359 Oct 24 12:22 test_task_pccor.xml
24-Oct-2026 12:22:35 -rw-r--r-- 1 casaci root       3403 Oct 24 12:22 test_task_phaseshift.xml
24-Oct-2026 12:22:35 -rw-r--r-- 1 casaci root       1095 Oct 24 12:22 test_task_plotants.xml
24-Oct-2026 12:22:35 -rw-r--r-- 1 casaci root       3883 Oct 24 12:22 test_task_plotbandpass.xml
24-Oct-2026 12:22:35 -rw-r--r-- 1 casaci root       1795 Oct 24 12:22 test_task_plotprofilemap.xml
24-Oct-2026 12:22:35 -rw-r--r-- 1 casaci root       1175 Oct 24 12:22 test_task_plotweather.xml
24-Oct-2026 12:22:35 -rw-r--r-- 1 casaci root       3088 Oct 24 12:22 test_task_polcal.xml
24-Oct-2026 12:22:35 -rw-r--r-- 1 casaci root        358 Oct 24 12:22 test_task_polfromgain.xml
24-Oct-2026 12:22:35 -rw-r--r-- 1 casaci root       1217 Oct 24 12:22 test_task_predictcomp.xml
24-Oct-2026 12:22:35 -rw-r--r-- 1 casaci root        973 Oct 24 12:22 test_task_rerefant.xml
24-Oct-2026 12:22:35 -rw-r--r-- 1 casaci root       1207 Oct 24 12:22 test_task_rmfit.xml
24-Oct-2026 12:22:35 -rw-r--r-- 1 casaci root        810 Oct 24 12:22 test_task_rmtables.xml
24-Oct-2026 12:22:35 -rw-r--r-- 1 casaci root       5028 Oct 24 12:22 test_task_sdatmcor.xml
24-Oct-2026 12:22:35 -rw-r--r-- 1 casaci root      18290 Oct 24 12:22 test_task_sdbaseline.xml
24-Oct-2026 12:22:35 -rw-r--r-- 1 casaci root       6646 Oct 24 12:22 test_task_sdcal.xml
24-Oct-2026 12:22:35 -rw-r--r-- 1 casaci root       4176 Oct 24 12:22 test_task_sdfit.xml
24-Oct-2026 12:22:35 -rw-r--r-- 1 casaci root       1862 Oct 24 12:22 test_task_sdfixscan.xml
24-Oct-2026 12:22:35 -rw-r--r-- 1 casaci root       1589 Oct 24 12:22 test_task_sdgaincal.xml
24-Oct-2026 12:22:35 -rw-r--r-- 1 casaci root       2718 Oct 24 12:22 test_task_sdintimaging.xml
24-Oct-2026 12:22:35 -rw-r--r-- 1 casaci root        585 Oct 24 12:22 test_task_sdpolaverage.xml
24-Oct-2026 12:22:35 -rw-r--r-- 1 casaci root       2453 Oct 24 12:22 test_task_sdsidebandsplit.xml
24-Oct-2026 12:22:35 -rw-r--r-- 1 casaci root       3947 Oct 24 12:22 test_task_sdsmooth.xml
24-Oct-2026 12:22:35 -rw-r--r-- 1 casaci root       4399 Oct 24 12:22 test_task_sdtimeaverage.xml
24-Oct-2026 12:22:35 -rw-r--r-- 1 casaci root       3451 Oct 24 12:22 test_task_setjy.xml
24-Oct-2026 12:22:35 -rw-r--r-- 1 casaci root       1715 Oct 24 12:22 test_task_simanalyze.xml
24-Oct-2026 12:22:35 -rw-r--r-- 1 casaci root      14295 Oct 24 12:22 test_task_simobserve.xml
24-Oct-2026 12:22:35 -rw-r--r-- 1 casaci root       1511 Oct 24 12:22 test_task_slsearch.xml
24-Oct-2026 12:22:35 -rw-r--r-- 1 casaci root       1388 Oct 24 12:22 test_task_smoothcal.xml
24-Oct-2026 12:22:35 -rw-r--r-- 1 casaci root       1949 Oct 24 12:22 test_task_specfit.xml
24-Oct-2026 12:22:35 -rw-r--r-- 1 casaci root        716 Oct 24 12:22 test_task_specflux.xml
24-Oct-2026 12:22:35 -rw-r--r-- 1 casaci root        453 Oct 24 12:22 test_task_specsmooth.xml
24-Oct-2026 12:22:35 -rw-r--r-- 1 casaci root        468 Oct 24 12:22 test_task_splattotable.xml
24-Oct-2026 12:22:35 -rw-r--r-- 1 casaci root      17902 Oct 24 12:22 test_task_split.xml
24-Oct-2026 12:22:35 -rw-r--r-- 1 casaci root        706 Oct 24 12:22 test_task_spxfit.xml
24-Oct-2026 12:22:35 -rw-r--r-- 1 casaci root       2409 Oct 24 12:22 test_task_statwt.xml
24-Oct-2026 12:22:35 -rw-r--r-- 1 casaci root      38942 Oct 24 12:22 test_task_tclean.xml
24-Oct-2026 12:22:35 -rw-r--r-- 1 casaci root        700 Oct 24 12:22 test_task_testconcat.xml
24-Oct-2026 12:22:35 -rw-r--r-- 1 casaci root      24766 Oct 24 12:22 test_task_tsdimaging.xml
24-Oct-2026 12:22:35 -rw-r--r-- 1 casaci root       4555 Oct 24 12:22 test_task_uvcontsub.xml
24-Oct-2026 12:22:35 -rw-r--r-- 1 casaci root        843 Oct 24 12:22 test_task_uvcontsub_old.xml
24-Oct-2026 12:22:35 -rw-r--r-- 1 casaci root       1522 Oct 24 12:22 test_task_uvmodelfit.xml
24-Oct-2026 12:22:35 -rw-r--r-- 1 casaci root       1483 Oct 24 12:22 test_task_virtualconcat.xml
24-Oct-2026 12:22:35 -rw-r--r-- 1 casaci root       1096 Oct 24 12:22 test_task_vishead.xml
24-Oct-2026 12:22:35 -rw-r--r-- 1 casaci root       3288 Oct 24 12:22 test_task_visstat.xml
24-Oct-2026 12:22:35 -rw-r--r-- 1 casaci root       1984 Oct 24 12:22 test_task_wvrgcal.xml
24-Oct-2026 12:22:35 -rw-r--r-- 1 casaci root       1841 Oct 24 12:22 test_task_zenithdelaycal.xml
24-Oct-2026 12:22:35 -rw-r--r-- 1 casaci root         45 Oct 24 12:22 work-manylinux_228_casatasks-3.12.tar.gz
24-Oct-2026 12:22:35 Done packaging working directory
24-Oct-2026 12:22:35 Finished task 'Tar work directory' with result: Success
24-Oct-2026 12:22:35 Starting task 'Parse tests' of type 'com.atlassian.bamboo.plugins.testresultparser:task.testresultparser.junit'
24-Oct-2026 12:22:35 Parsing test results under /export/cvpost135-nvme/casa/bamboohome/xml-data/build-dir/CASASPECS-MASTERTESTGPUPY312-TTM228PY312...
24-Oct-2026 12:22:35 Failing task since 2 failing test cases were found.
24-Oct-2026 12:22:35 Finished task 'Parse tests' with result: Failed
24-Oct-2026 12:22:35 Starting task 'Cleanup' of type 'com.atlassian.bamboo.plugins.scripttask:task.builder.script'
24-Oct-2026 12:22:35
Beginning to execute external process for build 'CASASPECS - Master Test GPU 3.12 - Test Tasks Many Linux 2.28 Rocky 8.10 Py3.12 #189 (CASASPECS-MASTERTESTGPUPY312-TTM228PY312-189)'
... running command line:
/export/cvpost135-nvme/casa/bamboohome/temp/CASASPECS-MASTERTESTGPUPY312-TTM228PY312-189-ScriptBuildTask-3396474547713265790.sh
... in: /export/cvpost135-nvme/casa/bamboohome/xml-data/build-dir/CASASPECS-MASTERTESTGPUPY312-TTM228PY312
24-Oct-2026 12:22:35 Starting cleanup
24-Oct-2026 12:22:46 wheel-container-test
24-Oct-2026 12:22:50 wheel-container-test
24-Oct-2026 12:22:50 Cleanup complete
24-Oct-2026 12:22:50 Finished task 'Cleanup' with result: Success
24-Oct-2026 12:22:50 Running post build plugin 'Docker Container Cleanup'
24-Oct-2026 12:22:50 Running post build plugin 'NCover Results Collector'
24-Oct-2026 12:22:50 Running post build plugin 'Build Results Label Collector'
24-Oct-2026 12:22:50 Running post build plugin 'Clover Results Collector'
24-Oct-2026 12:22:50 Running post build plugin 'npm Cache Cleanup'
24-Oct-2026 12:22:50 Running post build plugin 'Artifact Copier'
24-Oct-2026 12:22:50 Publishing an artifact: XML Directories
24-Oct-2026 12:22:52 Finished publishing of artifact Non required job artifact Http Compression On : [XML Directories], patterns: [**/*.xml] anchored at: [wheeldirectory/] in 2.210 s
24-Oct-2026 12:22:52 Publishing an artifact: requirements.txt
24-Oct-2026 12:22:52 Finished publishing of artifact Non required job artifact Http Compression On : [requirements.txt], patterns: [requirements.txt] anchored at: [wheeldirectory/] in 27.70 ms
24-Oct-2026 12:22:52 Finalising the build...
24-Oct-2026 12:22:52 Stopping timer.
24-Oct-2026 12:22:52 Build CASASPECS-MASTERTESTGPUPY312-TTM228PY312-189 completed.
24-Oct-2026 08:22:53 Running on server: post build plugin 'Build Hanging Detection Configuration'
24-Oct-2026 08:22:53 Running on server: post build plugin 'NCover Results Collector'
24-Oct-2026 08:22:53 Running on server: post build plugin 'Build Labeller'
24-Oct-2026 08:22:53 Running on server: post build plugin 'Clover Delta Calculator'
24-Oct-2026 08:22:53 Running on server: post build plugin 'Maven Dependencies Postprocessor'
24-Oct-2026 08:22:53 All post build plugins have finished
24-Oct-2026 08:22:53 Generating build results summary...
24-Oct-2026 08:22:54 Saving build results to disk...
24-Oct-2026 08:22:54 Store variable context...
24-Oct-2026 08:22:54 Finished building CASASPECS-MASTERTESTGPUPY312-TTM228PY312-189.