Build: #189 failed Child of CASASPECS-MASTERBUILDCASALITHGPU-202
Build result summary
Details
- Completed
- Queue duration
- < 1 second
- Duration
- 346 minutes
- Labels
- None
- Revisions
-
- CASA6
-
07b93ae4691683e42ffeb80be149a8fa5ebcf9f9
- OPEN-CASA-PKG
-
e5285e68467f01199807a1f1a978aec8a4781be7
- Total tests
- 4415
- Failing since
- #180 (Child of CASASPECS-MASTERBUILDCASALITHGPU-195 – )
Tests
- 0 New failures
- 2 Existing failures
- 0 Fixed
- 143 Quarantined / skipped
Responsible
-
Takahiro Tsutsumi
Automatically assigned
Code commits
| Author | Commit | Commit date | |
|---|---|---|---|
|
|
Takahiro Tsutsumi |
07b93ae4691683e42ffeb80be149a8fa5ebcf9f9
|
|
|
|
Srikrishna Sekhar |
6bf9a287644247a534350fc7b2eaa493d427eb54
m |
|
Configuration changes
Plan configuration has changed since the last successful build. See the plan audit log for more details.
Tests
| Status | Test | Failing since | View job | Duration | |
|---|---|---|---|---|---|
|
test_task_tclean
test_wproject.test_wterm_awphpg
|
Failing since build #180 (Child of CASASPECS-MASTERBUILDCASALITHGPU-195) | Test Tasks Many Linux 2.28 Rocky 8.10 Py3.12 | 39 secs | ||
AssertionError: False is not true
test_task_tclean.py:4254: in test_wterm_awphpg
self.assertTrue(self.check_final(report))
E AssertionError: False is not true
|
|||||
|
test_task_tclean
test_widefield.test_widefield_awphpg_mtmfs_via_cube
|
Failing since build #180 (Child of CASASPECS-MASTERBUILDCASALITHGPU-195) | Test Tasks Many Linux 2.28 Rocky 8.10 Py3.12 | 22 secs | ||
AssertionError: False is not true
test_task_tclean.py:4514: in test_widefield_awphpg_mtmfs_via_cube
self.assertTrue(self.check_final(report))
E AssertionError: False is not true
|
|||||
Jira issues
| Issue | Description | Status | |
|---|---|---|---|
| Unknown Issue Type | CAS-14874 | Could not obtain issue details from Jira | |