Build: #191 failed Child of CASASPECS-MASTERBUILDCASALITHGPU-204
Build result summary
Details
- Completed
- Queue duration
- 1 second
- Duration
- 357 minutes
- Labels
- None
- Revisions
-
- CASA6
-
4a3321b72f1600f874dc362479609743a47ce11c
- OPEN-CASA-PKG
-
e5285e68467f01199807a1f1a978aec8a4781be7
- Total tests
- 4428
- Failing since
- #180 (Child of CASASPECS-MASTERBUILDCASALITHGPU-195 – )
Tests
- 2 New failures
- 0 Existing failures
- 0 Fixed
- 143 Quarantined / skipped
Responsible
-
Takahiro Tsutsumi
Automatically assigned
Code commits
| Author | Commit | Commit date | |
|---|---|---|---|
|
|
Akeem Wells |
4a3321b72f1600f874dc362479609743a47ce11c
|
|
|
|
Akeem Wells |
fe7eefd28dc37f1e72d5cbd05f17055c72662036
|
|
Configuration changes
Plan configuration has changed since the last successful build. See the plan audit log for more details.
Tests
| Status | Test | View job | Duration | |
|---|---|---|---|---|
| Collapse |
test_task_tclean
test_wproject.test_wterm_awphpg
|
Test Tasks Many Linux 2.28 Rocky 8.10 Py3.12 | 39 secs | |
AssertionError: False is not true
test_task_tclean.py:4268: in test_wterm_awphpg
self.assertTrue(self.check_final(report))
E AssertionError: False is not true
|
||||
| Collapse |
test_task_tclean
test_widefield.test_widefield_awphpg_mtmfs_via_cube
|
Test Tasks Many Linux 2.28 Rocky 8.10 Py3.12 | 23 secs | |
AssertionError: False is not true
test_task_tclean.py:4528: in test_widefield_awphpg_mtmfs_via_cube
self.assertTrue(self.check_final(report))
E AssertionError: False is not true
|
||||
Jira issues
| Issue | Description | Status | |
|---|---|---|---|
| Unknown Issue Type | CAS-14928 | Could not obtain issue details from Jira | |