Build: #182 failed Child of CASASPECS-MASTERBUILDCASALITHGPU-197
Build result summary
Details
- Completed
- Queue duration
- 1 second
- Duration
- 348 minutes
- Labels
- None
- Revisions
-
- CASA6
-
a853b0702798817e83f84e721670c7888c1cd1b8
- OPEN-CASA-PKG
-
e5285e68467f01199807a1f1a978aec8a4781be7
- Total tests
- 4415
- Failing since
- #180 (Child of CASASPECS-MASTERBUILDCASALITHGPU-195 – )
Tests
- 0 New failures
- 2 Existing failures
- 0 Fixed
- 143 Quarantined / skipped
Responsible
-
Bob Garwood
Automatically assigned
-
Kumar Golap
Automatically assigned
Code commits
| Author | Commit | Commit date | |
|---|---|---|---|
|
|
Darrell Schiebel |
a853b0702798817e83f84e721670c7888c1cd1b8
|
|
|
|
Darrell Schiebel <darrell@schiebel.us> |
9c4b84a5d8bfbbe846f03660630e0bbcd9d5b2b9
|
|
|
|
Darrell Schiebel <darrell@schiebel.us> |
d5c2471512f80c5eab6937c38dc755fdf0aed07e
m |
|
|
|
Darrell Schiebel <darrell@schiebel.us> |
4d2ac1d50559a6b692486ce4a9e0cea6d20bde18
m |
|
Tests
| Status | Test | Failing since | View job | Duration | |
|---|---|---|---|---|---|
|
test_task_tclean
test_widefield.test_widefield_awphpg_mtmfs_via_cube
|
Failing since build #180 (Child of CASASPECS-MASTERBUILDCASALITHGPU-195) | Test Tasks Many Linux 2.28 Rocky 8.10 Py3.12 | 22 secs | ||
AssertionError: False is not true
test_task_tclean.py:4514: in test_widefield_awphpg_mtmfs_via_cube
self.assertTrue(self.check_final(report))
E AssertionError: False is not true
|
|||||
|
test_task_tclean
test_wproject.test_wterm_awphpg
|
Failing since build #180 (Child of CASASPECS-MASTERBUILDCASALITHGPU-195) | Test Tasks Many Linux 2.28 Rocky 8.10 Py3.12 | 39 secs | ||
AssertionError: False is not true
test_task_tclean.py:4254: in test_wterm_awphpg
self.assertTrue(self.check_final(report))
E AssertionError: False is not true
|
|||||
Jira issues
| Issue | Description | Status | |
|---|---|---|---|
| Unknown Issue Type | CAS-14881 | Could not obtain issue details from Jira | |