Build: #1 failed Manual run by CASA adm account

Test results

  • 2,110 tests in total
  • 2 tests failed
  • 2 failures are new
  • 44 tests were quarantined / skipped
  • 144 minutes taken in total.
New test failures 2
Status Test View job Duration
Collapse Failed test_task_tclean test_onefield.test_onefield_asp_preconditioned
Test Tasks Many Linux 2.28 Py3.12 41 secs
AssertionError: False is not true
test_task_tclean.py:459: in test_onefield_asp_preconditioned
    self.assertTrue(self.check_final(report))
E   AssertionError: False is not true
Collapse Failed test_task_tclean test_onefield.test_onefield_asp_preconditioned
Test Tasks macOS 26 Py3.12 11 secs
AssertionError: False is not true
test_task_tclean.py:459: in test_onefield_asp_preconditioned
    self.assertTrue(self.check_final(report))
E   AssertionError: False is not true
Skipped tests 44
Status Test Failing since View job
Skipped test_task_tclean test_cube.test_cube_continuum_subtract_uvsub
Test Tasks macOS 26 Py3.12
Skipped test_task_tclean test_hetarray_imaging.test_het_antenna_mosaic_cube_vptable_complex
Test Tasks macOS 26 Py3.12
Skipped test_task_tclean test_pbcor.test_pbcor_mtmfs
Test Tasks macOS 26 Py3.12
Skipped test_task_tclean test_widefield.test_widefield_awphpg_cube
Test Tasks macOS 26 Py3.12
Skipped test_task_tclean test_cube.test_cubedata_mtmfs_nterms1
Test Tasks macOS 26 Py3.12
Skipped test_task_tclean test_cube.test_cube_flagged_mosaic_mtmfs
Test Tasks macOS 26 Py3.12
Skipped test_task_tclean test_wproject.test_wterm_awphpg
Test Tasks macOS 26 Py3.12
Skipped test_task_tclean test_widefield.test_widefield_awphpg_mfs
Test Tasks macOS 26 Py3.12
Skipped test_task_tclean test_mask.test_mask_pbmask
Test Tasks macOS 26 Py3.12
Skipped test_task_tclean test_hetarray_imaging.test_het_antenna_mosaic_cube_vptable_float
Test Tasks Many Linux 2.28 Py3.12
Skipped test_task_tclean test_mask.test_mask_outlier
Test Tasks macOS 26 Py3.12
Skipped test_task_tclean test_startmodel.test_csys_startmodel_restart_mfs
Test Tasks macOS 26 Py3.12
Skipped test_task_tclean test_widefield.test_widefield_awphpg_mtmfs_via_cube
Test Tasks macOS 26 Py3.12
Skipped test_task_tclean test_mask.test_mask_combined_1
Test Tasks macOS 26 Py3.12
Skipped test_task_tclean test_mask.test_mask_combined_2
Test Tasks macOS 26 Py3.12
Skipped test_task_tclean test_hetarray_imaging.test_het_antenna_mosaic_cube_vptable_float
Test Tasks macOS 26 Py3.12
Skipped test_task_tclean test_cube.test_cube_weighting_taper_cas13260_old
Test Tasks macOS 26 Py3.12
Skipped test_task_tclean test_cube.test_cube_mtmfs_nterms1
Test Tasks macOS 26 Py3.12
Skipped test_task_tclean test_cube.test_cube_continuum_subtract_uvsub
Test Tasks Many Linux 2.28 Py3.12
Skipped test_task_tclean test_mask.test_mask_pbmask
Test Tasks Many Linux 2.28 Py3.12
Skipped test_task_tclean test_mask.test_mask_combined_2
Test Tasks Many Linux 2.28 Py3.12
Skipped test_task_tclean test_hetarray_imaging.test_het_antenna_mosaic_cube_vptable_complex
Test Tasks Many Linux 2.28 Py3.12
Skipped test_task_tclean test_cube.test_cube_mtmfs_nterms1
Test Tasks Many Linux 2.28 Py3.12
Skipped test_task_tclean test_startmodel.test_csys_startmodel_restart_mfs
Test Tasks Many Linux 2.28 Py3.12
Skipped test_task_tclean test_pbcor.test_pbcor_mtmfs
Test Tasks Many Linux 2.28 Py3.12
Skipped test_task_tclean test_mask.test_mask_outlier
Test Tasks Many Linux 2.28 Py3.12
Skipped test_task_tclean test_widefield.test_widefield_awphpg_mtmfs_via_cube
Test Tasks Many Linux 2.28 Py3.12
Skipped test_task_tclean test_cube.test_cube_weighting_taper_cas13260_old
Test Tasks Many Linux 2.28 Py3.12
Skipped test_task_tclean test_cube.test_cube_flagged_mosaic_mtmfs
Test Tasks Many Linux 2.28 Py3.12
Skipped test_task_tclean test_wproject.test_wterm_awphpg
Test Tasks Many Linux 2.28 Py3.12
Skipped test_task_tclean test_widefield.test_widefield_awphpg_mfs
Test Tasks Many Linux 2.28 Py3.12
Skipped test_task_tclean test_mask.test_mask_combined_1
Test Tasks Many Linux 2.28 Py3.12
Skipped test_task_tclean test_widefield.test_widefield_awphpg_cube
Test Tasks Many Linux 2.28 Py3.12
Skipped test_task_tclean test_cube.test_cubedata_mtmfs_nterms1
Test Tasks Many Linux 2.28 Py3.12
Skipped test_tool_sdm SdmFrommsTest.test10
Test Tools macOS 26 Py3.12
Skipped test_tool_sdm SdmFrommsTest.test12
Test Tools macOS 26 Py3.12
Skipped test_tool_sdm SdmFrommsTest.test12
Test Tools Many Linux 2.28 Py3.12
Skipped test_tool_sdm SdmFrommsTest.test10
Test Tools Many Linux 2.28 Py3.12
Skipped test_tool_sdm_toms asdm_import7.test7_lazy3
Test Tools Many Linux 2.28 Py3.12
Skipped test_tool_sdm_toms asdm_import7.test7_skiprows1
Test Tools macOS 26 Py3.12
Skipped test_tool_sdm_toms asdm_import7.test7_lazy3
Test Tools macOS 26 Py3.12
Skipped test_tool_sdm_toms asdm_import7.test7_skiprows1
Test Tools Many Linux 2.28 Py3.12
Skipped test_tool_simulator sm_settrop_test.test_smsettrop
Test Tools macOS 26 Py3.12
Skipped test_tool_simulator sm_settrop_test.test_smsettrop
Test Tools Many Linux 2.28 Py3.12