Build: #1 failed Manual run by CASA adm account

Build result summary

Details

Completed
Queue duration
1 second
Duration
92 minutes
Labels
None
Revisions
CASA6
d215993f5515f8125b1e15c4c5bd4f7d1691f7af
OPEN-CASA-PKG
e5285e68467f01199807a1f1a978aec8a4781be7
Total tests
2110

Tests

Responsible

No one has taken responsibility for this failure

Code commits

CASA6
Author Commit Message Commit date
Hendrik Muller <hmuller@smurf.aoc.nrao.edu> Hendrik Muller <hmuller@smurf.aoc.nrao.edu> d215993f5515f8125b1e15c4c5bd4f7d1691f7af Replace truncating with nearest neighbor rounding in the uv-cell assignment for the imaging weight degridding step (Briggs computing)

Tests

New test failures 2
Status Test View job Duration
Collapse Failed test_task_tclean test_onefield.test_onefield_asp_preconditioned
Test Tasks Many Linux 2.28 Py3.12 41 secs
AssertionError: False is not true
test_task_tclean.py:459: in test_onefield_asp_preconditioned
    self.assertTrue(self.check_final(report))
E   AssertionError: False is not true
Collapse Failed test_task_tclean test_onefield.test_onefield_asp_preconditioned
Test Tasks macOS 26 Py3.12 11 secs
AssertionError: False is not true
test_task_tclean.py:459: in test_onefield_asp_preconditioned
    self.assertTrue(self.check_final(report))
E   AssertionError: False is not true