Build: #1 failed

Job: Test Tools macOS 15 Py3.12 was successful

Build log

The build generated 53,274 lines of output.   The output is too long and has been truncated to the last 1,000 lines. Download or view full build log.

01-Oct-2026 18:59:19 2026-10-01 22:59:20        INFO        SubImageFactory::createImage        Creating image 'third' of shape [200, 200, 20, 4]
01-Oct-2026 18:59:19 2026-10-01 22:59:20        INFO        ImageMaskAttacher::makeMask        Created mask `mask0'
01-Oct-2026 18:59:19 2026-10-01 22:59:20        INFO        ImageMaskAttacher::makeMask        Created and initialized mask `mask0'
01-Oct-2026 18:59:19 2026-10-01 22:59:20        WARN        ImageRegridder::_doImagesOverlap        At least one of the images exceeds one degree on at one side, not checking for direction plane overlap.
01-Oct-2026 18:59:19 2026-10-01 22:59:20        SEVERE        image::regrid        Exception Reported: Exception: There is no overlap between the (region chosen in) the input image and the output image with respect to the axes being regridded..
01-Oct-2026 18:59:19 2026-10-01 22:59:20        SEVERE        image::regrid+        ... thrown by std::shared_ptr<casacore::ImageInterface<T>> casa::ImageRegridder<float>::_regrid() const [T = float] at File: /Users/casaci/bamboohome/xml-data/build-dir/CASASPECS-DBC268-BPO15AP312/casainstall/include/casacpp/imageanalysis/ImageAnalysis/ImageRegridder.tcc, line: 155
01-Oct-2026 18:59:19 2026-10-01 22:59:20        INFO        ImageFactory::createImage        Created Temp image  of shape [20, 20, 1001, 4] with float valued pixels.
01-Oct-2026 18:59:19 2026-10-01 22:59:20        INFO        ImageMaskAttacher::makeMask        Created and initialized mask `mask0'
01-Oct-2026 18:59:19 2026-10-01 22:59:20        INFO        SubImageFactory::createImage        Creating image 'sixth' of shape [20, 20, 1001, 4]
01-Oct-2026 18:59:19 2026-10-01 22:59:20        INFO        ImageMaskAttacher::makeMask        Created mask `mask0'
01-Oct-2026 18:59:19 2026-10-01 22:59:20        INFO        ImageMaskAttacher::makeMask        Created and initialized mask `mask0'
01-Oct-2026 18:59:19 2026-10-01 22:59:20        SEVERE        image::regrid        Exception Reported: Exception: There is no overlap between the (region chosen in) the input image and the output image with respect to the axes being regridded..
01-Oct-2026 18:59:19 2026-10-01 22:59:20        SEVERE        image::regrid+        ... thrown by std::shared_ptr<casacore::ImageInterface<T>> casa::ImageRegridder<float>::_regrid() const [T = float] at File: /Users/casaci/bamboohome/xml-data/build-dir/CASASPECS-DBC268-BPO15AP312/casainstall/include/casacpp/imageanalysis/ImageAnalysis/ImageRegridder.tcc, line: 155
01-Oct-2026 18:59:19 test_tool_image_regrid.py::ia_regrid_test::test_overlap
01-Oct-2026 18:59:19 Test for notification if no overlap between input and output images
01-Oct-2026 18:59:19 PASSED
01-Oct-2026 18:59:19
01-Oct-2026 18:59:19 2026-10-01 22:59:20        INFO        ImageMaskAttacher::makeMask        Created and initialized mask `mask0'
01-Oct-2026 18:59:19 2026-10-01 22:59:20        WARN        ImageRegridder::_doImagesOverlap        At least one of the images exceeds one degree on at one side, not checking for direction plane overlap.
01-Oct-2026 18:59:19 2026-10-01 22:59:20        INFO        ImageRegrid::_checkAxes         The Stokes axis cannot be regridded - removing from list
01-Oct-2026 18:59:19 2026-10-01 22:59:20        WARN        ImageRegrid::regrid        You are regridding an image whose beam is not well sampled by the pixel size.  Total flux can be lost when regridding such images, especially when the new pixel size is larger than the old pixel size. It is recommended to check the total flux of your input and output image, and if necessary rebin the input to have smaller pixels.
01-Oct-2026 18:59:19 2026-10-01 22:59:20        INFO        SubImageFactory::createImage        Creating image 'gal_regrid_out.image' of shape [300, 300, 1, 46]
01-Oct-2026 18:59:19 2026-10-01 22:59:20        INFO        ImageMaskAttacher::makeMask        Created mask `mask0'
01-Oct-2026 18:59:19 2026-10-01 22:59:20        WARN        image::open (file /private/var/folders/60/83wxljbx2vlfbx_hy0yfv8rc0000gn/T/build-via-sdist-24x446m6/casatools-6.7.7.8a14803.dev1+dirty/src/tools/image/image_cmpt.cc, line 4289)        Another image is already open, closing first
01-Oct-2026 18:59:20 test_tool_image_regrid.py::ia_regrid_test::test_regrid_galactic
01-Oct-2026 18:59:20 Verify fix for CAS-5534
01-Oct-2026 18:59:20 PASSED
01-Oct-2026 18:59:20
01-Oct-2026 18:59:20 2026-10-01 22:59:20        INFO        ImageFactory::createImage        Created Paged image 'maskim' of shape [200, 200, 1, 1] with float valued pixels.
01-Oct-2026 18:59:20 2026-10-01 22:59:20        INFO        ImageFactory::createImage        Created Temp image  of shape [200, 200, 1, 20] with float valued pixels.
01-Oct-2026 18:59:20 2026-10-01 22:59:20        SEVERE        image::regrid        Exception Reported: The input image shape ([200, 200, 1, 20]) and mask shape ([200, 200, 1, 1]) are different, and it was specified that the mask should not be extended, so the mask cannot be applied to the (sub)image. Specifying that the mask should be extended may resolve the issue at File: /Users/casaci/bamboohome/xml-data/build-dir/CASASPECS-DBC268-BPO15AP312/casainstall/include/casacpp/imageanalysis/ImageAnalysis/SubImageFactory.tcc, line: 306
01-Oct-2026 18:59:20 2026-10-01 22:59:20        INFO        CasacRegionManager::fromBCS        No directional region specified. Using full positional plane.
01-Oct-2026 18:59:20 2026-10-01 22:59:20        INFO        CasacRegionManager::fromBCS        Using polarizations ALL
01-Oct-2026 18:59:20 2026-10-01 22:59:20        INFO        ImageMaskAttacher::makeMask        Created and initialized mask `mask0'
01-Oct-2026 18:59:20 2026-10-01 22:59:20        WARN        ImageRegridder::_doImagesOverlap        At least one of the images exceeds one degree on at one side, not checking for direction plane overlap.
01-Oct-2026 18:59:20 2026-10-01 22:59:20        INFO        ImageRegrid::_checkAxes         The Stokes axis cannot be regridded - removing from list
01-Oct-2026 18:59:20 2026-10-01 22:59:20        INFO        ImageMaskAttacher::makeMask        Created mask `mask0'
01-Oct-2026 18:59:20 2026-10-01 22:59:20        SEVERE        image::regrid        Exception Reported: The input image shape ([200, 200, 1, 20]) and mask shape ([200, 200, 1, 1]) are different, and it was specified that the mask should not be extended, so the mask cannot be applied to the (sub)image. Specifying that the mask should be extended may resolve the issue at File: /Users/casaci/bamboohome/xml-data/build-dir/CASASPECS-DBC268-BPO15AP312/casainstall/include/casacpp/imageanalysis/ImageAnalysis/SubImageFactory.tcc, line: 306
01-Oct-2026 18:59:20 2026-10-01 22:59:20        INFO        ImageMaskAttacher::makeMask        Created and initialized mask `mask0'
01-Oct-2026 18:59:20 2026-10-01 22:59:20        WARN        ImageRegridder::_doImagesOverlap        At least one of the images exceeds one degree on at one side, not checking for direction plane overlap.
01-Oct-2026 18:59:20 2026-10-01 22:59:20        INFO        ImageRegrid::_checkAxes         The Stokes axis cannot be regridded - removing from list
01-Oct-2026 18:59:20 2026-10-01 22:59:20        INFO        ImageMaskAttacher::makeMask        Created mask `mask0'
01-Oct-2026 18:59:20 2026-10-01 22:59:20        INFO        name::        No table opened.
01-Oct-2026 18:59:20 2026-10-01 22:59:20        INFO        showcache::        The Table Cache is empty.
01-Oct-2026 18:59:20 test_tool_image_regrid.py::ia_regrid_test::test_stretch
01-Oct-2026 18:59:20 ia.regrid(): Test stretch parameter
01-Oct-2026 18:59:20 2026-10-01 22:59:20        INFO        name::        No table opened.
01-Oct-2026 18:59:20 2026-10-01 22:59:20        INFO        showcache::        The Table Cache is empty.
01-Oct-2026 18:59:20 PASSED
01-Oct-2026 18:59:20
01-Oct-2026 18:59:20 - generated xml file: /Users/casaci/bamboohome/xml-data/build-dir/CASASPECS-DEVTESTPY312158-TTOARM15P312/casa6/casatestutils/nosedir/xml/test_tool_image_regrid/nose.xml -
01-Oct-2026 18:59:20 ======================== 11 passed, 1 warning in 3.34s =========================
01-Oct-2026 18:59:20 swig/python detected a memory leak of type 'casac::coordsys *', no destructor found.
01-Oct-2026 18:59:20 ============================= test session starts ==============================
01-Oct-2026 18:59:20 platform darwin -- Python 3.12.8, pytest-9.1.1, pluggy-1.6.0 -- /Users/casaci/bamboohome/xml-data/build-dir/CASASPECS-DEVTESTPY312158-TTOARM15P312/casa6testenv/bin/python
01-Oct-2026 18:59:20 cachedir: .pytest_cache
01-Oct-2026 18:59:20 rootdir: /Users/casaci/bamboohome/xml-data/build-dir/CASASPECS-DEVTESTPY312158-TTOARM15P312/casa6/casatestutils/nosedir/test_tool_imagepol
01-Oct-2026 18:59:20 configfile: pytest.ini
01-Oct-2026 18:59:22 collecting ... collected 17 items
01-Oct-2026 18:59:22
01-Oct-2026 18:59:22
01-Oct-2026 18:59:22 2026-10-01 22:59:23        INFO        ImageFITSConverter::readBeamsTable        Loading multiple beams from BEAMS table
01-Oct-2026 18:59:22 2026-10-01 22:59:23        INFO        imagepol::complexFractionalLinearPolarization(...)        Creating image 'g' of shape [10, 10, 10, 1]
01-Oct-2026 18:59:22 2026-10-01 22:59:23        INFO        ImageFITSConverter::readBeamsTable        Loading multiple beams from BEAMS table
01-Oct-2026 18:59:22 2026-10-01 22:59:23        INFO        imagepol::complexFractionalLinearPolarization(...)        Creating image 'hh' of shape [10, 10, 10, 1]
01-Oct-2026 18:59:22 2026-10-01 22:59:23        SEVERE        imagepol::complexfraclinpol        Exception Reported: Exception: Input image has multiple beams and the corresponding beams for the stokes planes necessary for this computation are not equal..
01-Oct-2026 18:59:22 2026-10-01 22:59:23        SEVERE        imagepol::complexfraclinpol+        ... thrown by Bool casa::ImagePolarimetry::_checkBeams(const vector<StokesTypes> &, Bool, Bool) const at File: /Users/casaci/bamboohome/xml-data/build-dir/CASASPECS-DBC268-BPO15AP312/casa6/casatools/src/code/imageanalysis/ImageAnalysis/ImagePolarimetry.cc, line: 1631
01-Oct-2026 18:59:22 test_tool_imagepol.py::po_complexfraclinpol_test::test_multibeam
01-Oct-2026 18:59:22 Test multibeam images for correct behavior
01-Oct-2026 18:59:22 pol_eq_beams.fits
01-Oct-2026 18:59:22 PASSED
01-Oct-2026 18:59:22
01-Oct-2026 18:59:22 2026-10-01 22:59:23        INFO        ImageFITSConverter::readBeamsTable        Loading multiple beams from BEAMS table
01-Oct-2026 18:59:22 2026-10-01 22:59:23        INFO        ImagePolProxy::complexlinpol        Creating image 'g' of shape [10, 10, 10, 1]
01-Oct-2026 18:59:22 2026-10-01 22:59:23        INFO        ImageFITSConverter::readBeamsTable        Loading multiple beams from BEAMS table
01-Oct-2026 18:59:22 2026-10-01 22:59:23        INFO        ImagePolProxy::complexlinpol        Creating image 'hh' of shape [10, 10, 10, 1]
01-Oct-2026 18:59:22 2026-10-01 22:59:23        SEVERE        imagepol::complexlinpol        Exception Reported: Exception: Input image has multiple beams and the corresponding beams for the stokes planes necessary for this computation are not equal..
01-Oct-2026 18:59:22 2026-10-01 22:59:23        SEVERE        imagepol::complexlinpol+        ... thrown by Bool casa::ImagePolarimetry::_checkBeams(const vector<StokesTypes> &, Bool, Bool) const at File: /Users/casaci/bamboohome/xml-data/build-dir/CASASPECS-DBC268-BPO15AP312/casa6/casatools/src/code/imageanalysis/ImageAnalysis/ImagePolarimetry.cc, line: 1631
01-Oct-2026 18:59:22 2026-10-01 22:59:23        INFO        name::        No table opened.
01-Oct-2026 18:59:22 2026-10-01 22:59:23        INFO        showcache::        The Table Cache is empty.
01-Oct-2026 18:59:22 test_tool_imagepol.py::po_complexlinpol_test::test_multibeam
01-Oct-2026 18:59:22 Test multibeam images for correct behavior
01-Oct-2026 18:59:22 PASSED
01-Oct-2026 18:59:22
01-Oct-2026 18:59:22 2026-10-01 22:59:23        INFO        ImageFITSConverter::readBeamsTable        Loading multiple beams from BEAMS table
01-Oct-2026 18:59:22 2026-10-01 22:59:23        INFO        ImageFITSConverter::readBeamsTable        Loading multiple beams from BEAMS table
01-Oct-2026 18:59:22 2026-10-01 22:59:23        INFO        ImageFITSConverter::readBeamsTable        Loading multiple beams from BEAMS table
01-Oct-2026 18:59:22 2026-10-01 22:59:23        INFO        ImageFITSConverter::readBeamsTable        Loading multiple beams from BEAMS table
01-Oct-2026 18:59:22 2026-10-01 22:59:23        SEVERE        imagepol::depolratio        Exception Reported: Exception: Input image has multiple beams and the corresponding beams for the stokes planes necessary for this computation are not equal..
01-Oct-2026 18:59:22 2026-10-01 22:59:23        SEVERE        imagepol::depolratio+        ... thrown by Bool casa::ImagePolarimetry::_checkBeams(const vector<StokesTypes> &, Bool, Bool) const at File: /Users/casaci/bamboohome/xml-data/build-dir/CASASPECS-DBC268-BPO15AP312/casa6/casatools/src/code/imageanalysis/ImageAnalysis/ImagePolarimetry.cc, line: 1631
01-Oct-2026 18:59:22 2026-10-01 22:59:23        INFO        ImageFITSConverter::readBeamsTable        Loading multiple beams from BEAMS table
01-Oct-2026 18:59:22 2026-10-01 22:59:23        SEVERE        imagepol::depolratio        Exception Reported: Exception: Input image has multiple beams and the corresponding beams for the stokes planes necessary for this computation are not equal..
01-Oct-2026 18:59:22 2026-10-01 22:59:23        SEVERE        imagepol::depolratio+        ... thrown by Bool casa::ImagePolarimetry::_checkBeams(const vector<StokesTypes> &, Bool, Bool) const at File: /Users/casaci/bamboohome/xml-data/build-dir/CASASPECS-DBC268-BPO15AP312/casa6/casatools/src/code/imageanalysis/ImageAnalysis/ImagePolarimetry.cc, line: 1631
01-Oct-2026 18:59:22 test_tool_imagepol.py::po_depolratio_test::test_multibeam
01-Oct-2026 18:59:22 Test multibeam images for correct behavior
01-Oct-2026 18:59:22 pol_eq_beams.fits
01-Oct-2026 18:59:22 PASSED
01-Oct-2026 18:59:22
01-Oct-2026 18:59:22 2026-10-01 22:59:23        INFO        ImageFITSConverter::readBeamsTable        Loading multiple beams from BEAMS table
01-Oct-2026 18:59:22 2026-10-01 22:59:23        SEVERE        imagepol::fourierRotationMeasure (file /Users/casaci/bamboohome/xml-data/build-dir/CASASPECS-DBC268-BPO15AP312/casa6/casatools/src/code/imageanalysis/ImageAnalysis/ImagePolProxy.cc, line 623)        Cannot run fourierRotationMeasure on an image with multiple beams
01-Oct-2026 18:59:22 2026-10-01 22:59:23        SEVERE        imagepol::fourierrotationmeasure        Exception Reported: 2026-10-01 22:59:23        SEVERE        imagepol::fourierRotationMeasure (file /Users/casaci/bamboohome/xml-data/build-dir/CASASPECS-DBC268-BPO15AP312/casa6/casatools/src/code/imageanalysis/ImageAnalysis/ImagePolProxy.cc, line 623)        Cannot run fourierRotationMeasure on an image with multiple beams
01-Oct-2026 18:59:22 2026-10-01 22:59:23        INFO        ImageFITSConverter::readBeamsTable        Loading multiple beams from BEAMS table
01-Oct-2026 18:59:22 2026-10-01 22:59:23        SEVERE        imagepol::fourierRotationMeasure (file /Users/casaci/bamboohome/xml-data/build-dir/CASASPECS-DBC268-BPO15AP312/casa6/casatools/src/code/imageanalysis/ImageAnalysis/ImagePolProxy.cc, line 623)        Cannot run fourierRotationMeasure on an image with multiple beams
01-Oct-2026 18:59:22 2026-10-01 22:59:23        SEVERE        imagepol::fourierrotationmeasure        Exception Reported: 2026-10-01 22:59:23        SEVERE        imagepol::fourierRotationMeasure (file /Users/casaci/bamboohome/xml-data/build-dir/CASASPECS-DBC268-BPO15AP312/casa6/casatools/src/code/imageanalysis/ImageAnalysis/ImagePolProxy.cc, line 623)        Cannot run fourierRotationMeasure on an image with multiple beams
01-Oct-2026 18:59:22 test_tool_imagepol.py::po_fourierrotationmeasure_test::test_multibeam
01-Oct-2026 18:59:22 Test multibeam images for correct behavior
01-Oct-2026 18:59:22 pol_eq_beams.fits
01-Oct-2026 18:59:22 PASSED
01-Oct-2026 18:59:22
01-Oct-2026 18:59:22 2026-10-01 22:59:23        INFO        ImageFITSConverter::readBeamsTable        Loading multiple beams from BEAMS table
01-Oct-2026 18:59:22 2026-10-01 22:59:23        INFO        ImagePolarimetry::sigma         Determined noise from V image to be 1.0119
01-Oct-2026 18:59:22 2026-10-01 22:59:23        INFO        ImagePolarimetry::fracLinPol         Debiasing with sigma  = 1.0119
01-Oct-2026 18:59:22 2026-10-01 22:59:23        INFO        ImageFITSConverter::readBeamsTable        Loading multiple beams from BEAMS table
01-Oct-2026 18:59:22 test_tool_imagepol.py::po_fraclinpol_test::test_multibeam
01-Oct-2026 18:59:22 Test multibeam images for correct behavior
01-Oct-2026 18:59:22 pol_eq_beams.fits
01-Oct-2026 18:59:22 PASSED
01-Oct-2026 18:59:22
01-Oct-2026 18:59:22 2026-10-01 22:59:23        INFO        ImageFITSConverter::readBeamsTable        Loading multiple beams from BEAMS table
01-Oct-2026 18:59:22 2026-10-01 22:59:23        INFO        ImagePolarimetry::sigma         Determined noise from V image to be 1.0119
01-Oct-2026 18:59:22 2026-10-01 22:59:23        INFO        ImagePolarimetry::fracTotPol         Debiasing with sigma = 1.0119
01-Oct-2026 18:59:22 2026-10-01 22:59:23        INFO        ImageFITSConverter::readBeamsTable        Loading multiple beams from BEAMS table
01-Oct-2026 18:59:22 test_tool_imagepol.py::po_fractotpol_test::test_multibeam
01-Oct-2026 18:59:22 Test multibeam images for correct behavior
01-Oct-2026 18:59:22 pol_eq_beams.fits
01-Oct-2026 18:59:22 PASSED
01-Oct-2026 18:59:22
01-Oct-2026 18:59:22 2026-10-01 22:59:23        INFO        ImageFITSConverter::readBeamsTable        Loading multiple beams from BEAMS table
01-Oct-2026 18:59:22 2026-10-01 22:59:23        INFO        ImagePolTask::_sigma         Determined noise from V image to be 1.0119
01-Oct-2026 18:59:22 2026-10-01 22:59:23        INFO        ImagePolTask::_sigma         Debiasing with sigma = 1.0119
01-Oct-2026 18:59:22 2026-10-01 22:59:23        INFO        ImageFITSConverter::readBeamsTable        Loading multiple beams from BEAMS table
01-Oct-2026 18:59:22 test_tool_imagepol.py::po_linpolint_test::test_multibeam
01-Oct-2026 18:59:22 Test multibeam images for correct behavior
01-Oct-2026 18:59:22 pol_eq_beams.fits
01-Oct-2026 18:59:22 PASSED
01-Oct-2026 18:59:22
01-Oct-2026 18:59:22 2026-10-01 22:59:23        INFO        ImageFITSConverter::readBeamsTable        Loading multiple beams from BEAMS table
01-Oct-2026 18:59:22 2026-10-01 22:59:23        WARN        LinearPolarizationAngleCalculator::compute (file /Users/casaci/bamboohome/xml-data/build-dir/CASASPECS-DBC268-BPO15AP312/casa6/casatools/src/code/imageanalysis/ImageAnalysis/LinearPolarizationAngleCalculator.cc, line 40)        The input image has multiple beams. Because these beams can vary with stokes/polarization, they will not be copied to the output image
01-Oct-2026 18:59:22 2026-10-01 22:59:23        INFO        SubImageFactory::createImage        Creating image 'g' of shape [10, 10, 10, 1]
01-Oct-2026 18:59:22 2026-10-01 22:59:23        INFO        ImageFITSConverter::readBeamsTable        Loading multiple beams from BEAMS table
01-Oct-2026 18:59:22 2026-10-01 22:59:23        SEVERE        imagepol::linpolposang        Exception Reported: Exception: Input image has multiple beams and the corresponding beams for the stokes planes necessary for this computation are not equal..
01-Oct-2026 18:59:22 2026-10-01 22:59:23        SEVERE        imagepol::linpolposang+        ... thrown by Bool casa::ImagePolTask::_checkBeams(const std::vector<StokesTypes> &, Bool, Bool) const at File: /Users/casaci/bamboohome/xml-data/build-dir/CASASPECS-DBC268-BPO15AP312/casa6/casatools/src/code/imageanalysis/ImageAnalysis/ImagePolTask.cc, line: 84
01-Oct-2026 18:59:22 test_tool_imagepol.py::po_linpolposang_test::test_multibeam
01-Oct-2026 18:59:22 Test multibeam images for correct behavior
01-Oct-2026 18:59:22 pol_eq_beams.fits
01-Oct-2026 18:59:22 PASSED
01-Oct-2026 18:59:22
01-Oct-2026 18:59:22 2026-10-01 22:59:23        INFO        ImageFactory::createImage        Created Paged image 'rm_input.im' of shape [20, 20, 4, 20] with float valued pixels.
01-Oct-2026 18:59:22 2026-10-01 22:59:23        INFO        ImagePol::rotationMeasure        Creating image 'rm.im' of shape [20, 20]
01-Oct-2026 18:59:22 2026-10-01 22:59:23        INFO        ImagePol::rotationMeasure        Creating image 'pa0.im' of shape [20, 20, 1]
01-Oct-2026 18:59:22 2026-10-01 22:59:23        INFO        image::statistics         Determining stats for image rm.im
01-Oct-2026 18:59:22 2026-10-01 22:59:23        INFO        CasacRegionManager::fromBCS        No directional region specified. Using full positional plane.
01-Oct-2026 18:59:22 2026-10-01 22:59:23        INFO        ImageRegion::fromRecord        Selected bounding box :
01-Oct-2026 18:59:22 2026-10-01 22:59:23        INFO        ImageRegion::fromRecord+            [0, 0] to [19, 19]  (00:00:40.000, -00.10.00.001 to 23:59:24.000, +00.09.00.001)
01-Oct-2026 18:59:22 2026-10-01 22:59:23        INFO        ImageStatsCalculator::_logStartup        Statistics calculated using Classic algorithm
01-Oct-2026 18:59:22 2026-10-01 22:59:23        INFO        ImageStatsCalculator::_logStartup        Regions ---
01-Oct-2026 18:59:22 2026-10-01 22:59:23        INFO        ImageStatsCalculator::_logStartup                 -- bottom-left corner (pixel) [blc]:  [0, 0]
01-Oct-2026 18:59:22 2026-10-01 22:59:23        INFO        ImageStatsCalculator::_logStartup                 -- top-right corner (pixel) [trc]:    [19, 19]
01-Oct-2026 18:59:22 2026-10-01 22:59:23        INFO        ImageStatsCalculator::_logStartup                 -- bottom-left corner (world) [blcf]: 00:00:40.000, -00.10.00.001
01-Oct-2026 18:59:22 2026-10-01 22:59:23        INFO        ImageStatsCalculator::_logStartup                 -- top-right corner (world) [trcf]:   23:59:24.000, +00.09.00.001
01-Oct-2026 18:59:22 2026-10-01 22:59:23        INFO                Values ---
01-Oct-2026 18:59:22 2026-10-01 22:59:23        INFO                         -- number of points [npts]:                400
01-Oct-2026 18:59:22 2026-10-01 22:59:23        INFO                         -- maximum value [max]:                    9.60001 rad/m/m
01-Oct-2026 18:59:22 2026-10-01 22:59:23        INFO                         -- minimum value [min]:                    9.60001 rad/m/m
01-Oct-2026 18:59:22 2026-10-01 22:59:23        INFO                         -- position of max value (pixel) [maxpos]: [1, 0]
01-Oct-2026 18:59:22 2026-10-01 22:59:23        INFO                         -- position of min value (pixel) [minpos]: [0, 0]
01-Oct-2026 18:59:22 2026-10-01 22:59:23        INFO                         -- position of max value (world) [maxposf]: 00:00:36.000, -00.10.00.001
01-Oct-2026 18:59:22 2026-10-01 22:59:23        INFO                         -- position of min value (world) [minposf]: 00:00:40.000, -00.10.00.001
01-Oct-2026 18:59:22 2026-10-01 22:59:23        INFO                         -- Sum of pixel values [sum]:               3840 rad/m/m
01-Oct-2026 18:59:22 2026-10-01 22:59:23        INFO                         -- Sum of squared pixel values [sumsq]:     36864.1 rad/m/m.rad/m/m
01-Oct-2026 18:59:22 2026-10-01 22:59:23        INFO                Statistics ---
01-Oct-2026 18:59:22 2026-10-01 22:59:23        INFO                        -- Mean of the pixel values [mean]:         9.60001 rad/m/m
01-Oct-2026 18:59:22 2026-10-01 22:59:23        INFO                        -- Variance of the pixel values :           9.11774e-13 rad/m/m
01-Oct-2026 18:59:22 2026-10-01 22:59:23        INFO                        -- Standard deviation of the Mean [sigma]:  9.54869e-07 rad/m/m
01-Oct-2026 18:59:22 2026-10-01 22:59:23        INFO                        -- Root mean square [rms]:                  9.60001 rad/m/m
01-Oct-2026 18:59:22 2026-10-01 22:59:23        INFO        ImageStatsCalculator::statistics        Sum column unit = rad/m/m
01-Oct-2026 18:59:22 2026-10-01 22:59:23        INFO        ImageStatsCalculator::statistics+        Mean column unit = rad/m/m
01-Oct-2026 18:59:22 2026-10-01 22:59:23        INFO        ImageStatsCalculator::statistics+        Std_dev column unit = rad/m/m
01-Oct-2026 18:59:22 2026-10-01 22:59:23        INFO        ImageStatsCalculator::statistics+        Minimum column unit = rad/m/m
01-Oct-2026 18:59:22 2026-10-01 22:59:23        INFO        ImageStatsCalculator::statistics+        Maximum column unit = rad/m/m
01-Oct-2026 18:59:22 2026-10-01 22:59:23        INFO        ImageStatsCalculator::statistics        Npts          Sum           Mean          Rms           Std_dev       Minimum       Maximum     
01-Oct-2026 18:59:22 2026-10-01 22:59:23        INFO        ImageStatsCalculator::statistics         4.000000e+02  3.840004e+03  9.600010e+00  9.600010e+00  9.548686e-07  9.600009e+00  9.600011e+00
01-Oct-2026 18:59:22 2026-10-01 22:59:23        INFO                deleted table /Users/casaci/bamboohome/xml-data/build-dir/CASASPECS-DEVTESTPY312158-TTOARM15P312/casa6/casatestutils/nosedir/test_tool_imagepol/rm.im
01-Oct-2026 18:59:23 2026-10-01 22:59:23        INFO        image::statistics         Determining stats for image pa0.im
01-Oct-2026 18:59:23 2026-10-01 22:59:23        INFO        CasacRegionManager::fromBCS        No directional region specified. Using full positional plane.
01-Oct-2026 18:59:23 2026-10-01 22:59:23        INFO        CasacRegionManager::fromBCS        Using polarizations ALL
01-Oct-2026 18:59:23 2026-10-01 22:59:23        INFO        ImageRegion::fromRecord        Selected bounding box :
01-Oct-2026 18:59:23 2026-10-01 22:59:23        INFO        ImageRegion::fromRecord+            [0, 0, 0] to [19, 19, 0]  (00:00:40.000, -00.10.00.001, Pangle to 23:59:24.000, +00.09.00.001, Pangle)
01-Oct-2026 18:59:23 2026-10-01 22:59:23        INFO        ImageStatsCalculator::_logStartup        Statistics calculated using Classic algorithm
01-Oct-2026 18:59:23 2026-10-01 22:59:23        INFO        ImageStatsCalculator::_logStartup        Regions ---
01-Oct-2026 18:59:23 2026-10-01 22:59:23        INFO        ImageStatsCalculator::_logStartup                 -- bottom-left corner (pixel) [blc]:  [0, 0, 0]
01-Oct-2026 18:59:23 2026-10-01 22:59:23        INFO        ImageStatsCalculator::_logStartup                 -- top-right corner (pixel) [trc]:    [19, 19, 0]
01-Oct-2026 18:59:23 2026-10-01 22:59:23        INFO        ImageStatsCalculator::_logStartup                 -- bottom-left corner (world) [blcf]: 00:00:40.000, -00.10.00.001, Pangle
01-Oct-2026 18:59:23 2026-10-01 22:59:23        INFO        ImageStatsCalculator::_logStartup                 -- top-right corner (world) [trcf]:   23:59:24.000, +00.09.00.001, Pangle
01-Oct-2026 18:59:23 2026-10-01 22:59:23        INFO                Values ---
01-Oct-2026 18:59:23 2026-10-01 22:59:23        INFO                         -- number of points [npts]:                400
01-Oct-2026 18:59:23 2026-10-01 22:59:23        INFO                         -- maximum value [max]:                    22.5 deg
01-Oct-2026 18:59:23 2026-10-01 22:59:23        INFO                         -- minimum value [min]:                    22.5 deg
01-Oct-2026 18:59:23 2026-10-01 22:59:23        INFO                         -- position of max value (pixel) [maxpos]: [0, 0, 0]
01-Oct-2026 18:59:23 2026-10-01 22:59:23        INFO                         -- position of min value (pixel) [minpos]: [1, 0, 0]
01-Oct-2026 18:59:23 2026-10-01 22:59:23        INFO                         -- position of max value (world) [maxposf]: 00:00:40.000, -00.10.00.001, Pangle
01-Oct-2026 18:59:23 2026-10-01 22:59:23        INFO                         -- position of min value (world) [minposf]: 00:00:36.000, -00.10.00.001, Pangle
01-Oct-2026 18:59:23 2026-10-01 22:59:23        INFO                         -- Sum of pixel values [sum]:               8999.99 deg
01-Oct-2026 18:59:23 2026-10-01 22:59:23        INFO                         -- Sum of squared pixel values [sumsq]:     202500 deg.deg
01-Oct-2026 18:59:23 2026-10-01 22:59:23        INFO                Statistics ---
01-Oct-2026 18:59:23 2026-10-01 22:59:23        INFO                        -- Mean of the pixel values [mean]:         22.5 deg
01-Oct-2026 18:59:23 2026-10-01 22:59:23        INFO                        -- Variance of the pixel values :           3.6471e-12 deg
01-Oct-2026 18:59:23 2026-10-01 22:59:23        INFO                        -- Standard deviation of the Mean [sigma]:  1.90974e-06 deg
01-Oct-2026 18:59:23 2026-10-01 22:59:23        INFO                        -- Root mean square [rms]:                  22.5 deg
01-Oct-2026 18:59:23 2026-10-01 22:59:23        INFO        ImageStatsCalculator::statistics        Sum column unit = deg
01-Oct-2026 18:59:23 2026-10-01 22:59:23        INFO        ImageStatsCalculator::statistics+        Mean column unit = deg
01-Oct-2026 18:59:23 2026-10-01 22:59:23        INFO        ImageStatsCalculator::statistics+        Std_dev column unit = deg
01-Oct-2026 18:59:23 2026-10-01 22:59:23        INFO        ImageStatsCalculator::statistics+        Minimum column unit = deg
01-Oct-2026 18:59:23 2026-10-01 22:59:23        INFO        ImageStatsCalculator::statistics+        Maximum column unit = deg
01-Oct-2026 18:59:23 2026-10-01 22:59:23        INFO        ImageStatsCalculator::statistics        Npts          Sum           Mean          Rms           Std_dev       Minimum       Maximum     
01-Oct-2026 18:59:23 2026-10-01 22:59:23        INFO        ImageStatsCalculator::statistics         4.000000e+02  8.999989e+03  2.249997e+01  2.249997e+01  1.909737e-06  2.249997e+01  2.249998e+01
01-Oct-2026 18:59:23 2026-10-01 22:59:23        INFO                deleted table /Users/casaci/bamboohome/xml-data/build-dir/CASASPECS-DEVTESTPY312158-TTOARM15P312/casa6/casatestutils/nosedir/test_tool_imagepol/pa0.im
01-Oct-2026 18:59:23 test_tool_imagepol.py::po_rotationmeasure_test::test_algorithm
01-Oct-2026 18:59:23 Test rotation measure computation algorithm
01-Oct-2026 18:59:23 PASSED
01-Oct-2026 18:59:23
01-Oct-2026 18:59:23 2026-10-01 22:59:23        INFO        ImageFITSConverter::readBeamsTable        Loading multiple beams from BEAMS table
01-Oct-2026 18:59:23 2026-10-01 22:59:23        INFO        ImagePol::rotationMeasure        Creating image 'g' of shape [10, 10]
01-Oct-2026 18:59:23 2026-10-01 22:59:23        INFO        ImagePolarimetry::sigma         Determined noise from V image to be 1.0119
01-Oct-2026 18:59:23 2026-10-01 22:59:23        INFO        ImageFITSConverter::readBeamsTable        Loading multiple beams from BEAMS table
01-Oct-2026 18:59:23 2026-10-01 22:59:23        INFO        ImagePol::rotationMeasure        Creating image 'hh' of shape [10, 10]
01-Oct-2026 18:59:23 2026-10-01 22:59:23        SEVERE        imagepol::rotationmeasure        Exception Reported: Exception: Input image has multiple beams and the corresponding beams for the stokes planes necessary for this computation are not equal..
01-Oct-2026 18:59:23 2026-10-01 22:59:23        SEVERE        imagepol::rotationmeasure+        ... thrown by Bool casa::ImagePolarimetry::_checkBeams(const vector<StokesTypes> &, Bool, Bool) const at File: /Users/casaci/bamboohome/xml-data/build-dir/CASASPECS-DBC268-BPO15AP312/casa6/casatools/src/code/imageanalysis/ImageAnalysis/ImagePolarimetry.cc, line: 1631
01-Oct-2026 18:59:23 test_tool_imagepol.py::po_rotationmeasure_test::test_multibeam
01-Oct-2026 18:59:23 Test multibeam images for correct behavior
01-Oct-2026 18:59:23 PASSED
01-Oct-2026 18:59:23
01-Oct-2026 18:59:23 2026-10-01 22:59:23        INFO        ImageFITSConverter::readBeamsTable        Loading multiple beams from BEAMS table
01-Oct-2026 18:59:23 2026-10-01 22:59:23        INFO        ImagePolarimetry::sigma         Determined noise from V image to be 1.0119
01-Oct-2026 18:59:23 2026-10-01 22:59:23        INFO        ImageFITSConverter::readBeamsTable        Loading multiple beams from BEAMS table
01-Oct-2026 18:59:23 2026-10-01 22:59:23        INFO        ImagePolarimetry::sigma         Determined noise from V image to be 1.0119
01-Oct-2026 18:59:23 test_tool_imagepol.py::po_sigma_test::test_multibeam
01-Oct-2026 18:59:23 Test multibeam images for correct behavior
01-Oct-2026 18:59:23 pol_eq_beams.fits
01-Oct-2026 18:59:23 PASSED
01-Oct-2026 18:59:23
01-Oct-2026 18:59:23 2026-10-01 22:59:23        INFO        ImageFITSConverter::readBeamsTable        Loading multiple beams from BEAMS table
01-Oct-2026 18:59:23 2026-10-01 22:59:23        INFO        ImageFITSConverter::readBeamsTable        Loading multiple beams from BEAMS table
01-Oct-2026 18:59:23 2026-10-01 22:59:23        INFO        ImagePolarimetry::sigmaLinPolInt         Determined noise from Q&U images to be
01-Oct-2026 18:59:23 2026-10-01 22:59:23        INFO        ImagePolarimetry::sigmaLinPolInt         Determined noise from Q&U images to be
01-Oct-2026 18:59:23 2026-10-01 22:59:23        INFO        ImageFITSConverter::readBeamsTable        Loading multiple beams from BEAMS table
01-Oct-2026 18:59:23 2026-10-01 22:59:23        INFO        ImageFITSConverter::readBeamsTable        Loading multiple beams from BEAMS table
01-Oct-2026 18:59:23 2026-10-01 22:59:23        SEVERE        imagepol::sigmadepolratio        Exception Reported: Exception: Beams or beamsets are not equal between the two images, caonnot perform calculation.
01-Oct-2026 18:59:23 2026-10-01 22:59:23        SEVERE        imagepol::sigmadepolratio+        ... thrown by static void casa::ImagePolarimetry::_checkBeams(const ImagePolarimetry &, const ImagePolarimetry &, const Vector<ImagePolarimetry::StokesTypes> &) at File: /Users/casaci/bamboohome/xml-data/build-dir/CASASPECS-DBC268-BPO15AP312/casa6/casatools/src/code/imageanalysis/ImageAnalysis/ImagePolarimetry.cc, line: 1691
01-Oct-2026 18:59:23 test_tool_imagepol.py::po_sigmadepolratio_test::test_multibeam
01-Oct-2026 18:59:23 Test multibeam images for correct behavior
01-Oct-2026 18:59:23 PASSED
01-Oct-2026 18:59:23
01-Oct-2026 18:59:23 2026-10-01 22:59:23        INFO        ImageFITSConverter::readBeamsTable        Loading multiple beams from BEAMS table
01-Oct-2026 18:59:23 2026-10-01 22:59:23        INFO        ImagePolarimetry::sigmaLinPolInt         Determined noise from Q&U images to be
01-Oct-2026 18:59:23 2026-10-01 22:59:23        INFO        imagepol::sigmaFracLinPol        Creating image 'g' of shape [10, 10, 10, 1]
01-Oct-2026 18:59:23 2026-10-01 22:59:23        INFO        ImageFITSConverter::readBeamsTable        Loading multiple beams from BEAMS table
01-Oct-2026 18:59:23 2026-10-01 22:59:23        SEVERE        imagepol::sigmafraclinpol        Exception Reported: Exception: Input image has multiple beams and the corresponding beams for the stokes planes necessary for this computation are not equal..
01-Oct-2026 18:59:23 2026-10-01 22:59:23        SEVERE        imagepol::sigmafraclinpol+        ... thrown by Bool casa::ImagePolarimetry::_checkBeams(const vector<StokesTypes> &, Bool, Bool) const at File: /Users/casaci/bamboohome/xml-data/build-dir/CASASPECS-DBC268-BPO15AP312/casa6/casatools/src/code/imageanalysis/ImageAnalysis/ImagePolarimetry.cc, line: 1631
01-Oct-2026 18:59:23 test_tool_imagepol.py::po_sigmafraclinpol_test::test_multibeam
01-Oct-2026 18:59:23 Test multibeam images for correct behavior
01-Oct-2026 18:59:23 PASSED
01-Oct-2026 18:59:23
01-Oct-2026 18:59:23 2026-10-01 22:59:23        INFO        ImageFITSConverter::readBeamsTable        Loading multiple beams from BEAMS table
01-Oct-2026 18:59:23 2026-10-01 22:59:23        INFO        ImagePolarimetry::sigma         Determined noise from V image to be 1.0119
01-Oct-2026 18:59:23 2026-10-01 22:59:23        INFO        imagepol::sigmaFracTotPol        Creating image 'g' of shape [10, 10, 10, 1]
01-Oct-2026 18:59:23 2026-10-01 22:59:23        INFO        ImageFITSConverter::readBeamsTable        Loading multiple beams from BEAMS table
01-Oct-2026 18:59:23 2026-10-01 22:59:23        WARN        ImagePolarimetry::_setDoLinDoCirc (file /Users/casaci/bamboohome/xml-data/build-dir/CASASPECS-DBC268-BPO15AP312/casa6/casatools/src/code/imageanalysis/ImageAnalysis/ImagePolarimetry.cc, line 272)        I, Q, and U beams are not the same, cannot do linear portion
01-Oct-2026 18:59:23 2026-10-01 22:59:23        WARN        ImagePolarimetry::_setDoLinDoCirc (file /Users/casaci/bamboohome/xml-data/build-dir/CASASPECS-DBC268-BPO15AP312/casa6/casatools/src/code/imageanalysis/ImageAnalysis/ImagePolarimetry.cc, line 272)        I and V beams are not the same, cannot do circular portion
01-Oct-2026 18:59:23 2026-10-01 22:59:23        SEVERE        imagepol::sigmafractotpol        Exception Reported: Exception: Can do neither linear nor circular portions.
01-Oct-2026 18:59:23 2026-10-01 22:59:23        SEVERE        imagepol::sigmafractotpol+        ... thrown by void casa::ImagePolarimetry::_setDoLinDoCirc(Bool &, Bool &) const at File: /Users/casaci/bamboohome/xml-data/build-dir/CASASPECS-DBC268-BPO15AP312/casa6/casatools/src/code/imageanalysis/ImageAnalysis/ImagePolarimetry.cc, line: 294
01-Oct-2026 18:59:23 test_tool_imagepol.py::po_sigmafractotpol_test::test_multibeam
01-Oct-2026 18:59:23 Test multibeam images for correct behavior
01-Oct-2026 18:59:23 PASSED
01-Oct-2026 18:59:23
01-Oct-2026 18:59:23 2026-10-01 22:59:23        INFO        ImageFITSConverter::readBeamsTable        Loading multiple beams from BEAMS table
01-Oct-2026 18:59:23 2026-10-01 22:59:23        INFO        ImagePolarimetry::sigmaLinPolInt         Determined noise from Q&U images to be
01-Oct-2026 18:59:23 2026-10-01 22:59:23        INFO        ImageFITSConverter::readBeamsTable        Loading multiple beams from BEAMS table
01-Oct-2026 18:59:23 2026-10-01 22:59:23        SEVERE        imagepol::sigmalinpolint        Exception Reported: Exception: Input image has multiple beams and the corresponding beams for the stokes planes necessary for this computation are not equal..
01-Oct-2026 18:59:23 2026-10-01 22:59:23        SEVERE        imagepol::sigmalinpolint+        ... thrown by Bool casa::ImagePolarimetry::_checkBeams(const vector<StokesTypes> &, Bool, Bool) const at File: /Users/casaci/bamboohome/xml-data/build-dir/CASASPECS-DBC268-BPO15AP312/casa6/casatools/src/code/imageanalysis/ImageAnalysis/ImagePolarimetry.cc, line: 1631
01-Oct-2026 18:59:23 test_tool_imagepol.py::po_sigmalinpolint_test::test_multibeam
01-Oct-2026 18:59:23 Test multibeam images for correct behavior
01-Oct-2026 18:59:23 PASSED
01-Oct-2026 18:59:23
01-Oct-2026 18:59:23 2026-10-01 22:59:23        INFO        ImageFITSConverter::readBeamsTable        Loading multiple beams from BEAMS table
01-Oct-2026 18:59:23 2026-10-01 22:59:23        INFO        ImagePolarimetry::sigma         Determined noise from V image to be 1.0119
01-Oct-2026 18:59:23 2026-10-01 22:59:23        INFO        imagepol::sigmaLinPolPosAng        Creating image 'g' of shape [10, 10, 10, 1]
01-Oct-2026 18:59:23 2026-10-01 22:59:23        INFO        ImageFITSConverter::readBeamsTable        Loading multiple beams from BEAMS table
01-Oct-2026 18:59:23 2026-10-01 22:59:23        SEVERE        imagepol::sigmalinpolposang        Exception Reported: Exception: Input image has multiple beams and the corresponding beams for the stokes planes necessary for this computation are not equal..
01-Oct-2026 18:59:23 2026-10-01 22:59:23        SEVERE        imagepol::sigmalinpolposang+        ... thrown by Bool casa::ImagePolarimetry::_checkBeams(const vector<StokesTypes> &, Bool, Bool) const at File: /Users/casaci/bamboohome/xml-data/build-dir/CASASPECS-DBC268-BPO15AP312/casa6/casatools/src/code/imageanalysis/ImageAnalysis/ImagePolarimetry.cc, line: 1631
01-Oct-2026 18:59:23 test_tool_imagepol.py::po_sigmalinpolposang_test::test_multibeam
01-Oct-2026 18:59:23 Test multibeam images for correct behavior
01-Oct-2026 18:59:23 PASSED
01-Oct-2026 18:59:23
01-Oct-2026 18:59:23 2026-10-01 22:59:23        INFO        ImageFITSConverter::readBeamsTable        Loading multiple beams from BEAMS table
01-Oct-2026 18:59:23 2026-10-01 22:59:23        INFO        ImagePolTask::_sigma         Determined noise from V image to be 1.0119
01-Oct-2026 18:59:23 2026-10-01 22:59:23        INFO        ImagePolTask::_sigma         Debiasing with sigma = 1.0119
01-Oct-2026 18:59:23 2026-10-01 22:59:23        INFO        ImageFITSConverter::readBeamsTable        Loading multiple beams from BEAMS table
01-Oct-2026 18:59:23 test_tool_imagepol.py::po_totpolint_test::test_multibeam
01-Oct-2026 18:59:23 Test multibeam images for correct behavior
01-Oct-2026 18:59:23 PASSED
01-Oct-2026 18:59:23
01-Oct-2026 18:59:23 - generated xml file: /Users/casaci/bamboohome/xml-data/build-dir/CASASPECS-DEVTESTPY312158-TTOARM15P312/casa6/casatestutils/nosedir/xml/test_tool_imagepol/nose.xml -
01-Oct-2026 18:59:23 ======================== 17 passed, 1 warning in 2.59s =========================
01-Oct-2026 18:59:23 ============================= test session starts ==============================
01-Oct-2026 18:59:23 platform darwin -- Python 3.12.8, pytest-9.1.1, pluggy-1.6.0 -- /Users/casaci/bamboohome/xml-data/build-dir/CASASPECS-DEVTESTPY312158-TTOARM15P312/casa6testenv/bin/python
01-Oct-2026 18:59:23 cachedir: .pytest_cache
01-Oct-2026 18:59:23 rootdir: /Users/casaci/bamboohome/xml-data/build-dir/CASASPECS-DEVTESTPY312158-TTOARM15P312/casa6/casatestutils/nosedir/test_tool_regionmanager
01-Oct-2026 18:59:23 configfile: pytest.ini
01-Oct-2026 18:59:25 collecting ... collected 34 items
01-Oct-2026 18:59:25
01-Oct-2026 18:59:25
01-Oct-2026 18:59:25 2026-10-01 22:59:26        INFO        ImageFactory::createImage        Created Temp image  of shape [500, 500] with float valued pixels.
01-Oct-2026 18:59:25 2026-10-01 22:59:26        INFO        AsciiRegionFileParser::_parse         line# 2: difference found
01-Oct-2026 18:59:25 2026-10-01 22:59:26        INFO        AsciiRegionFileParser::_parse        Combined 2 image regions (which excludes any annotation regions)
01-Oct-2026 18:59:25 2026-10-01 22:59:26        INFO        AsciiRegionFileParser::_parse        The specified region will select all pixels that are included in the region. Full pixels will be included even when they are only partially covered by the region(s).
01-Oct-2026 18:59:25 2026-10-01 22:59:26        INFO        CasacRegionManager::fromBCS        Region read from text string ellipse [[0:0:0, 0.0.0], [10arcmin, 5arcmin], 45deg]
01-Oct-2026 18:59:25 2026-10-01 22:59:26        INFO        CasacRegionManager::fromBCS+        - ellipse [[0:0:0, 0.0.0], [7arcmin, 2arcmin], 45deg]
01-Oct-2026 18:59:25 2026-10-01 22:59:26        INFO        AsciiRegionFileParser::_parse         line# 2: difference found
01-Oct-2026 18:59:25 2026-10-01 22:59:26        INFO        AsciiRegionFileParser::_parse        Combined 2 image regions (which excludes any annotation regions)
01-Oct-2026 18:59:25 2026-10-01 22:59:26        INFO        AsciiRegionFileParser::_parse        The specified region will select all pixels that are included in the region. Full pixels will be included even when they are only partially covered by the region(s).
01-Oct-2026 18:59:25 2026-10-01 22:59:26        INFO        CasacRegionManager::fromBCS        Region read from text string ellipse [[0:0:0, 0.0.0], [10arcmin, 5arcmin], 45deg]
01-Oct-2026 18:59:25 2026-10-01 22:59:26        INFO        CasacRegionManager::fromBCS+        -ellipse [[0:0:0, 0.0.0], [7arcmin, 2arcmin], 45deg]
01-Oct-2026 18:59:25 test_tool_regionmanager.py::rg_frombcs_test::test_complement_is_last_line
01-Oct-2026 18:59:25 Test CAS-12978 fix, difference line is last in file works
01-Oct-2026 18:59:25 PASSED
01-Oct-2026 18:59:25
01-Oct-2026 18:59:25 2026-10-01 22:59:26        INFO        FITSCoordinateUtil::fromFITSHeader        Neither SPECSYS nor VELREF keyword given, spectral reference frame not defined ...
01-Oct-2026 18:59:25 2026-10-01 22:59:26        INFO        CasacRegionManager::fromBCS        No directional region specified. Using full positional plane.
01-Oct-2026 18:59:25 2026-10-01 22:59:26        INFO        CasacRegionManager::fromBCS        Using channel range(s)
01-Oct-2026 18:59:25 2026-10-01 22:59:26        INFO        CasacRegionManager::fromBCS        Using polarizations ALL
01-Oct-2026 18:59:25 test_tool_regionmanager.py::rg_frombcs_test::test_contiguous_channels
01-Oct-2026 18:59:25 Test setting multiple continuous channels
01-Oct-2026 18:59:25 got [1.2479523012078841, 0.7825499900718148, 4735100000.0, 1.0]
01-Oct-2026 18:59:25 exp [1.2479523, 0.78254999, 4735100000.0, 1.0]
01-Oct-2026 18:59:25 PASSED
01-Oct-2026 18:59:25
01-Oct-2026 18:59:25 2026-10-01 22:59:26        INFO        FITSCoordinateUtil::fromFITSHeader        Neither SPECSYS nor VELREF keyword given, spectral reference frame not defined ...
01-Oct-2026 18:59:25 2026-10-01 22:59:26        INFO        CasacRegionManager::fromBCS        No directional region specified. Using full positional plane.
01-Oct-2026 18:59:25 2026-10-01 22:59:26        INFO        CasacRegionManager::fromBCS        Using all spectral channels.
01-Oct-2026 18:59:25 2026-10-01 22:59:26        INFO        CasacRegionManager::fromBCS        Using polarizations QU
01-Oct-2026 18:59:25 test_tool_regionmanager.py::rg_frombcs_test::test_continguous_stokes
01-Oct-2026 18:59:25 Test setting a contiguous stokes
01-Oct-2026 18:59:25 got [1.2479523012078841, 0.7825499900718148, 4735100000.0, 2.0]
01-Oct-2026 18:59:25 exp [1.2479523, 0.78254999, 4735100000.0, 2.0]
01-Oct-2026 18:59:25 PASSED
01-Oct-2026 18:59:25
01-Oct-2026 18:59:25 2026-10-01 22:59:26        INFO        FITSCoordinateUtil::fromFITSHeader        Neither SPECSYS nor VELREF keyword given, spectral reference frame not defined ...
01-Oct-2026 18:59:25 2026-10-01 22:59:26        INFO        CasacRegionManager::fromBCS        No directional region specified. Using full positional plane.
01-Oct-2026 18:59:25 2026-10-01 22:59:26        INFO        CasacRegionManager::fromBCS        Using all spectral channels.
01-Oct-2026 18:59:25 2026-10-01 22:59:26        INFO        CasacRegionManager::fromBCS        Using polarizations I
01-Oct-2026 18:59:25 test_tool_regionmanager.py::rg_frombcs_test::test_first_stokes
01-Oct-2026 18:59:25 Test setting first stokes
01-Oct-2026 18:59:25 got [1.2479523012078841, 0.7825499900718148, 4735100000.0, 1.0]
01-Oct-2026 18:59:25 exp [1.2479523, 0.78254999, 4735100000.0, 1.0]
01-Oct-2026 18:59:25 PASSED
01-Oct-2026 18:59:25
01-Oct-2026 18:59:25 2026-10-01 22:59:26        INFO        FITSCoordinateUtil::fromFITSHeader        Neither SPECSYS nor VELREF keyword given, spectral reference frame not defined ...
01-Oct-2026 18:59:25 2026-10-01 22:59:26        INFO        CasacRegionManager::fromBCS        No directional region specified. Using full positional plane.
01-Oct-2026 18:59:25 2026-10-01 22:59:26        INFO        CasacRegionManager::fromBCS        Using all spectral channels.
01-Oct-2026 18:59:25 2026-10-01 22:59:26        INFO        CasacRegionManager::fromBCS        Using polarizations ALL
01-Oct-2026 18:59:25 test_tool_regionmanager.py::rg_frombcs_test::test_full_image
01-Oct-2026 18:59:25 Test default gives region of entire image
01-Oct-2026 18:59:25 got [1.2479523012078841, 0.7825499900718148, 4735100000.0, 1.0]
01-Oct-2026 18:59:25 exp [1.2479523, 0.78254999, 4735100000.0, 1.0]
01-Oct-2026 18:59:25 got [1.2479133877693258, 0.7825776650571085, 12335100000.0, 4.0]
01-Oct-2026 18:59:25 exp [1.24791339, 0.782577665, 12335100000.0, 4.0]
01-Oct-2026 18:59:25 PASSED
01-Oct-2026 18:59:25
01-Oct-2026 18:59:25 2026-10-01 22:59:26        INFO        FITSCoordinateUtil::fromFITSHeader        Neither SPECSYS nor VELREF keyword given, spectral reference frame not defined ...
01-Oct-2026 18:59:25 2026-10-01 22:59:26        INFO        CasacRegionManager::fromBCS        Using specified box(es) 1,2,3,4,5,6,7,8,9,10,11,12
01-Oct-2026 18:59:25 test_tool_regionmanager.py::rg_frombcs_test::test_multiple_boxes
01-Oct-2026 18:59:25 Test setting multiple boxes
01-Oct-2026 18:59:25 got [1.2479338718038553, 0.7825645538110931, 4735100000.0, 1.0]
01-Oct-2026 18:59:25 exp [1.24793387, 0.782564554, 4735100000.0, 1.0]
01-Oct-2026 18:59:25 got [1.2479297756405987, 0.7825674669653366, 12335100000.0, 4.0]
01-Oct-2026 18:59:25 exp [1.24792978, 0.782567467, 12335100000.0, 4.0]
01-Oct-2026 18:59:25 got [1.2479502562199296, 0.7825529011099799, 4735100000.0, 1.0]
01-Oct-2026 18:59:25 exp [1.24795026, 0.782552901, 4735100000.0, 1.0]
01-Oct-2026 18:59:25 got [1.2479461601514532, 0.7825558142978793, 12335100000.0, 4.0]
01-Oct-2026 18:59:25 exp [1.24794616, 0.782555814, 12335100000.0, 4.0]
01-Oct-2026 18:59:25 got [1.2479420640592822, 0.7825587274773647, 4735100000.0, 1.0]
01-Oct-2026 18:59:25 exp [1.24794206, 0.782558727, 4735100000.0, 1.0]
01-Oct-2026 18:59:25 got [1.2479379679434162, 0.782561640648436, 12335100000.0, 4.0]
01-Oct-2026 18:59:25 exp [1.24793797, 0.782561641, 12335100000.0, 4.0]
01-Oct-2026 18:59:25 PASSED
01-Oct-2026 18:59:25
01-Oct-2026 18:59:25 2026-10-01 22:59:26        INFO        FITSCoordinateUtil::fromFITSHeader        Neither SPECSYS nor VELREF keyword given, spectral reference frame not defined ...
01-Oct-2026 18:59:25 2026-10-01 22:59:26        INFO        CasacRegionManager::fromBCS        Using specified box(es) 1,2,3,4,5,6,7,8
01-Oct-2026 18:59:25 test_tool_regionmanager.py::rg_frombcs_test::test_multiple_boxes_channel_ranges_stokes_ranges
01-Oct-2026 18:59:25 Test multiple channel ranges, multiple stokes ranges, and multiple boxes
01-Oct-2026 18:59:25 got [1.2479420640592822, 0.7825587274773647, 10735100000.0, 4.0]
01-Oct-2026 18:59:25 exp [1.24794206, 0.782558727, 10735100000.0, 4.0]
01-Oct-2026 18:59:25 got [1.2479379679434162, 0.782561640648436, 12335100000.0, 4.0]
01-Oct-2026 18:59:25 exp [1.24793797, 0.782561641, 12335100000.0, 4.0]
01-Oct-2026 18:59:25 got [1.2479420640592822, 0.7825587274773647, 4735100000.0, 4.0]
01-Oct-2026 18:59:25 exp [1.24794206, 0.782558727, 4735100000.0, 4.0]
01-Oct-2026 18:59:25 got [1.2479379679434162, 0.782561640648436, 6335100000.0, 4.0]
01-Oct-2026 18:59:25 exp [1.24793797, 0.782561641, 6335100000.0, 4.0]
01-Oct-2026 18:59:25 got [1.2479420640592822, 0.7825587274773647, 10735100000.0, 1.0]
01-Oct-2026 18:59:25 exp [1.24794206, 0.782558727, 10735100000.0, 1.0]
01-Oct-2026 18:59:25 got [1.2479379679434162, 0.782561640648436, 12335100000.0, 2.0]
01-Oct-2026 18:59:25 exp [1.24793797, 0.782561641, 12335100000.0, 2.0]
01-Oct-2026 18:59:25 got [1.2479420640592822, 0.7825587274773647, 4735100000.0, 1.0]
01-Oct-2026 18:59:25 exp [1.24794206, 0.782558727, 4735100000.0, 1.0]
01-Oct-2026 18:59:25 got [1.2479379679434162, 0.782561640648436, 6335100000.0, 2.0]
01-Oct-2026 18:59:25 exp [1.24793797, 0.782561641, 6335100000.0, 2.0]
01-Oct-2026 18:59:25 got [1.2479502562199296, 0.7825529011099799, 10735100000.0, 4.0]
01-Oct-2026 18:59:25 exp [1.24795026, 0.782552901, 10735100000.0, 4.0]
01-Oct-2026 18:59:25 got [1.2479461601514532, 0.7825558142978793, 12335100000.0, 4.0]
01-Oct-2026 18:59:25 exp [1.24794616, 0.782555814, 12335100000.0, 4.0]
01-Oct-2026 18:59:25 got [1.2479502562199296, 0.7825529011099799, 4735100000.0, 4.0]
01-Oct-2026 18:59:25 exp [1.24795026, 0.782552901, 4735100000.0, 4.0]
01-Oct-2026 18:59:25 got [1.2479461601514532, 0.7825558142978793, 6335100000.0, 4.0]
01-Oct-2026 18:59:25 exp [1.24794616, 0.782555814, 6335100000.0, 4.0]
01-Oct-2026 18:59:25 got [1.2479502562199296, 0.7825529011099799, 10735100000.0, 1.0]
01-Oct-2026 18:59:25 exp [1.24795026, 0.782552901, 10735100000.0, 1.0]
01-Oct-2026 18:59:25 got [1.2479461601514532, 0.7825558142978793, 12335100000.0, 2.0]
01-Oct-2026 18:59:25 exp [1.24794616, 0.782555814, 12335100000.0, 2.0]
01-Oct-2026 18:59:25 got [1.2479502562199296, 0.7825529011099799, 4735100000.0, 1.0]
01-Oct-2026 18:59:25 exp [1.24795026, 0.782552901, 4735100000.0, 1.0]
01-Oct-2026 18:59:25 got [1.2479461601514532, 0.7825558142978793, 6335100000.0, 2.0]
01-Oct-2026 18:59:25 exp [1.24794616, 0.782555814, 6335100000.0, 2.0]
01-Oct-2026 18:59:25 PASSED
01-Oct-2026 18:59:25
01-Oct-2026 18:59:25 2026-10-01 22:59:26        INFO        FITSCoordinateUtil::fromFITSHeader        passing empty or nonexistant spectral Coordinate axis
01-Oct-2026 18:59:25 2026-10-01 22:59:26        INFO        CasacRegionManager::fromBCS        Using specified box(es) 1,2,3,4,5,6,7,8
01-Oct-2026 18:59:25 test_tool_regionmanager.py::rg_frombcs_test::test_multiple_boxes_image_with_direction_coordinate_only
01-Oct-2026 18:59:25 Test multiple boxes on image with direction coordinate only
01-Oct-2026 18:59:25 got [1.2479420640592822, 0.7825587274773647]
01-Oct-2026 18:59:25 exp [1.24794206, 0.782558727]
01-Oct-2026 18:59:25 got [1.2479379679434162, 0.782561640648436]
01-Oct-2026 18:59:25 exp [1.24793797, 0.782561641]
01-Oct-2026 18:59:25 got [1.2479502562199296, 0.7825529011099799]
01-Oct-2026 18:59:25 exp [1.24795026, 0.782552901]
01-Oct-2026 18:59:25 got [1.2479461601514532, 0.7825558142978793]
01-Oct-2026 18:59:25 exp [1.24794616, 0.782555814]
01-Oct-2026 18:59:25 PASSED
01-Oct-2026 18:59:25
01-Oct-2026 18:59:25 2026-10-01 22:59:26        INFO        FITSCoordinateUtil::fromFITSHeader        passing empty or nonexistant spectral Coordinate axis
01-Oct-2026 18:59:25 2026-10-01 22:59:26        INFO        CasacRegionManager::fromBCS        Using specified box(es) 1,2,3,4,5,6,7,8
01-Oct-2026 18:59:25 test_tool_regionmanager.py::rg_frombcs_test::test_multiple_boxes_multiple_stokes_no_spectral_axis
01-Oct-2026 18:59:25 Test multiple stokes ranges, and multiple boxes on image with no spectral axis
01-Oct-2026 18:59:25 got [1.2479420640592822, 0.7825587274773647, 4.0]
01-Oct-2026 18:59:25 exp [1.24794206, 0.782558727, 4.0]
01-Oct-2026 18:59:25 got [1.2479379679434162, 0.782561640648436, 4.0]
01-Oct-2026 18:59:25 exp [1.24793797, 0.782561641, 4.0]
01-Oct-2026 18:59:25 got [1.2479420640592822, 0.7825587274773647, 1.0]
01-Oct-2026 18:59:25 exp [1.24794206, 0.782558727, 1.0]
01-Oct-2026 18:59:25 got [1.2479379679434162, 0.782561640648436, 2.0]
01-Oct-2026 18:59:25 exp [1.24793797, 0.782561641, 2.0]
01-Oct-2026 18:59:25 got [1.2479502562199296, 0.7825529011099799, 4.0]
01-Oct-2026 18:59:25 exp [1.24795026, 0.782552901, 4.0]
01-Oct-2026 18:59:25 got [1.2479461601514532, 0.7825558142978793, 4.0]
01-Oct-2026 18:59:25 exp [1.24794616, 0.782555814, 4.0]
01-Oct-2026 18:59:25 got [1.2479502562199296, 0.7825529011099799, 1.0]
01-Oct-2026 18:59:25 exp [1.24795026, 0.782552901, 1.0]
01-Oct-2026 18:59:25 got [1.2479461601514532, 0.7825558142978793, 2.0]
01-Oct-2026 18:59:25 exp [1.24794616, 0.782555814, 2.0]
01-Oct-2026 18:59:25 PASSED
01-Oct-2026 18:59:25
01-Oct-2026 18:59:25 2026-10-01 22:59:26        INFO        FITSCoordinateUtil::fromFITSHeader        Neither SPECSYS nor VELREF keyword given, spectral reference frame not defined ...
01-Oct-2026 18:59:25 2026-10-01 22:59:26        INFO        CasacRegionManager::fromBCS        No directional region specified. Using full positional plane.
01-Oct-2026 18:59:25 2026-10-01 22:59:26        INFO        CasacRegionManager::fromBCS        Using channel range(s)
01-Oct-2026 18:59:25 2026-10-01 22:59:26        INFO        CasacRegionManager::fromBCS        Using polarizations ALL
01-Oct-2026 18:59:25 test_tool_regionmanager.py::rg_frombcs_test::test_multiple_channel_ranges
01-Oct-2026 18:59:25 Test multiple channel ranges
01-Oct-2026 18:59:25 got [1.2479523012078841, 0.7825499900718148, 4735100000.0, 1.0]
01-Oct-2026 18:59:25 exp [1.2479523, 0.78254999, 4735100000.0, 1.0]
01-Oct-2026 18:59:25 got [1.2479133877693258, 0.7825776650571085, 6335100000.0, 4.0]
01-Oct-2026 18:59:25 exp [1.24791339, 0.782577665, 6335100000.0, 4.0]
01-Oct-2026 18:59:25 got [1.2479523012078841, 0.7825499900718148, 10735100000.0, 1.0]
01-Oct-2026 18:59:25 exp [1.2479523, 0.78254999, 10735100000.0, 1.0]
01-Oct-2026 18:59:25 got [1.2479133877693258, 0.7825776650571085, 12335100000.0, 4.0]
01-Oct-2026 18:59:25 exp [1.24791339, 0.782577665, 12335100000.0, 4.0]
01-Oct-2026 18:59:25 PASSED
01-Oct-2026 18:59:25
01-Oct-2026 18:59:25 2026-10-01 22:59:26        INFO        FITSCoordinateUtil::fromFITSHeader        Neither SPECSYS nor VELREF keyword given, spectral reference frame not defined ...
01-Oct-2026 18:59:25 2026-10-01 22:59:26        INFO        FITSCoordinateUtil::fromFITSHeader        Neither SPECSYS nor VELREF keyword given, spectral reference frame not defined ...
01-Oct-2026 18:59:25 test_tool_regionmanager.py::rg_frombcs_test::test_region_record
01-Oct-2026 18:59:25 Test setting region record
01-Oct-2026 18:59:25 got [1.24795026e+00 7.82552901e-01 4.73510000e+09 1.00000000e+00]
01-Oct-2026 18:59:25 exp [1.24795026, 0.782552901, 4735100000.0, 1.0]
01-Oct-2026 18:59:25 got [1.24794616e+00 7.82555814e-01 1.23351000e+10 4.00000000e+00]
01-Oct-2026 18:59:25 exp [1.24794616, 0.782555814, 12335100000.0, 4.0]
01-Oct-2026 18:59:25 PASSED
01-Oct-2026 18:59:25
01-Oct-2026 18:59:25 2026-10-01 22:59:26        INFO        FITSCoordinateUtil::fromFITSHeader        Neither SPECSYS nor VELREF keyword given, spectral reference frame not defined ...
01-Oct-2026 18:59:25 2026-10-01 22:59:26        INFO        AsciiRegionFileParser::_parse        Combined 3 image regions (which excludes any annotation regions)
01-Oct-2026 18:59:25 2026-10-01 22:59:26        INFO        AsciiRegionFileParser::_parse        The specified region will select all pixels that are included in the region. Full pixels will be included even when they are only partially covered by the region(s).
01-Oct-2026 18:59:25 2026-10-01 22:59:26        INFO        CasacRegionManager::fromBCS        Region read from text string box[[1pix,2pix],[3pix,4pix]]
01-Oct-2026 18:59:25 2026-10-01 22:59:26        INFO        CasacRegionManager::fromBCS+        box[[5pix,6pix],[7pix,8pix]]
01-Oct-2026 18:59:25 2026-10-01 22:59:26        INFO        CasacRegionManager::fromBCS+        box[[9pix,10pix],[11pix,12pix]]
01-Oct-2026 18:59:25 2026-10-01 22:59:26        WARN        CasacRegionManager::fromBCS        Stokes cannot be determined because this region type is not handled yet. But chances are very good this is no need to be alarmed.
01-Oct-2026 18:59:25 2026-10-01 22:59:26        INFO        FITSCoordinateUtil::fromFITSHeader        Neither SPECSYS nor VELREF keyword given, spectral reference frame not defined ...
01-Oct-2026 18:59:25 2026-10-01 22:59:26        INFO        ImageRegion::fromRecord        Selected bounding box :
01-Oct-2026 18:59:25 2026-10-01 22:59:26        INFO        ImageRegion::fromRecord+            [1, 2, 0, 0] to [11, 12, 19, 3]  (04:46:00.548, +44.50.13.123, 4.7351e+09Hz, I to 04:46:00.266, +44.50.16.127, 1.23351e+10Hz, V)
01-Oct-2026 18:59:25 2026-10-01 22:59:26        INFO        ImageRegion::fromRecord        Creating image 'xxyy.im' of shape [11, 11, 20, 4]
01-Oct-2026 18:59:25 2026-10-01 22:59:26        INFO        ImageMaskAttacher::makeMask        Created mask `mask0'
01-Oct-2026 18:59:25 test_tool_regionmanager.py::rg_frombcs_test::test_region_text_string
01-Oct-2026 18:59:25 Test setting a region text string
01-Oct-2026 18:59:25 got [1.24795026 0.7825529 ]
01-Oct-2026 18:59:25 exp [1.24795026, 0.782552901]
01-Oct-2026 18:59:25 got [1.24792978 0.78256747]
01-Oct-2026 18:59:25 exp [1.2479297756405987, 0.7825674669653366]
01-Oct-2026 18:59:25 PASSED
01-Oct-2026 18:59:25
01-Oct-2026 18:59:25 2026-10-01 22:59:26        INFO        FITSCoordinateUtil::fromFITSHeader        Neither SPECSYS nor VELREF keyword given, spectral reference frame not defined ...
01-Oct-2026 18:59:25 2026-10-01 22:59:26        INFO        CasacRegionManager::fromBCS        No directional region specified. Using full positional plane.
01-Oct-2026 18:59:25 2026-10-01 22:59:26        INFO        CasacRegionManager::fromBCS        Using all spectral channels.
01-Oct-2026 18:59:25 2026-10-01 22:59:26        INFO        CasacRegionManager::fromBCS        Using polarizations IUV
01-Oct-2026 18:59:25 test_tool_regionmanager.py::rg_frombcs_test::test_set_multiple_stokes_ranges
01-Oct-2026 18:59:25 Test setting multiple stokes ranges
01-Oct-2026 18:59:25 got [1.2479523012078841, 0.7825499900718148, 4735100000.0, 1.0]
01-Oct-2026 18:59:25 exp [1.2479523, 0.78254999, 4735100000.0, 1.0]
01-Oct-2026 18:59:25 got [1.2479133877693258, 0.7825776650571085, 12335100000.0, 1.0]
01-Oct-2026 18:59:25 exp [1.24791339, 0.782577665, 12335100000.0, 1.0]
01-Oct-2026 18:59:25 got [1.2479523012078841, 0.7825499900718148, 4735100000.0, 3.0]
01-Oct-2026 18:59:25 exp [1.2479523, 0.78254999, 4735100000.0, 3.0]
01-Oct-2026 18:59:25 got [1.2479133877693258, 0.7825776650571085, 12335100000.0, 4.0]
01-Oct-2026 18:59:25 exp [1.24791339, 0.782577665, 12335100000.0, 4.0]
01-Oct-2026 18:59:25 PASSED
01-Oct-2026 18:59:25
01-Oct-2026 18:59:25 2026-10-01 22:59:26        INFO        FITSCoordinateUtil::fromFITSHeader        Neither SPECSYS nor VELREF keyword given, spectral reference frame not defined ...
01-Oct-2026 18:59:25 2026-10-01 22:59:26        INFO        CasacRegionManager::fromBCS        Using specified box(es) 1,2,3,4
01-Oct-2026 18:59:25 test_tool_regionmanager.py::rg_frombcs_test::test_single_box
01-Oct-2026 18:59:25 Test setting single box
01-Oct-2026 18:59:25 got [1.2479502562199296, 0.7825529011099799, 4735100000.0, 1.0]
01-Oct-2026 18:59:25 exp [1.24795026, 0.782552901, 4735100000.0, 1.0]
01-Oct-2026 18:59:25 PASSED
01-Oct-2026 18:59:25
01-Oct-2026 18:59:25 2026-10-01 22:59:26        INFO        FITSCoordinateUtil::fromFITSHeader        Neither SPECSYS nor VELREF keyword given, spectral reference frame not defined ...
01-Oct-2026 18:59:25 2026-10-01 22:59:26        INFO        CasacRegionManager::fromBCS        No directional region specified. Using full positional plane.
01-Oct-2026 18:59:25 2026-10-01 22:59:26        INFO        CasacRegionManager::fromBCS        Using channel range(s)
01-Oct-2026 18:59:25 2026-10-01 22:59:26        INFO        CasacRegionManager::fromBCS        Using polarizations ALL
01-Oct-2026 18:59:25 test_tool_regionmanager.py::rg_frombcs_test::test_single_channel
01-Oct-2026 18:59:25 Test setting a single channel
01-Oct-2026 18:59:25 got [1.2479523012078841, 0.7825499900718148, 6335100000.0, 1.0]
01-Oct-2026 18:59:25 exp [1.2479523, 0.78254999, 6335100000.0, 1.0]
01-Oct-2026 18:59:25 PASSED
01-Oct-2026 18:59:25
01-Oct-2026 18:59:25 2026-10-01 22:59:26        INFO        FITSCoordinateUtil::fromFITSHeader        Neither SPECSYS nor VELREF keyword given, spectral reference frame not defined ...
01-Oct-2026 18:59:25 2026-10-01 22:59:26        INFO        CasacRegionManager::fromBCS        No directional region specified. Using full positional plane.
01-Oct-2026 18:59:25 2026-10-01 22:59:26        INFO        CasacRegionManager::fromBCS        Using all spectral channels.
01-Oct-2026 18:59:25 2026-10-01 22:59:26        INFO        CasacRegionManager::fromBCS        Using polarizations Q
01-Oct-2026 18:59:25 test_tool_regionmanager.py::rg_frombcs_test::test_single_stokes
01-Oct-2026 18:59:25 Test setting a single stokes
01-Oct-2026 18:59:25 got [1.2479523012078841, 0.7825499900718148, 4735100000.0, 2.0]
01-Oct-2026 18:59:25 exp [1.2479523, 0.78254999, 4735100000.0, 2.0]
01-Oct-2026 18:59:25 PASSED
01-Oct-2026 18:59:25
01-Oct-2026 18:59:25 2026-10-01 22:59:26        SEVERE        MeasTable::dUTC(Double) (file ../../measures/Measures/MeasTable.cc, line 4290)        Leap second table TAI_UTC seems out-of-date.
01-Oct-2026 18:59:25 2026-10-01 22:59:26        SEVERE        MeasTable::dUTC(Double) (file ../../measures/Measures/MeasTable.cc, line 4290)+        Until the table is updated (see the CASA documentation or your system admin),
01-Oct-2026 18:59:25 2026-10-01 22:59:26        SEVERE        MeasTable::dUTC(Double) (file ../../measures/Measures/MeasTable.cc, line 4290)+        times and coordinates derived from UTC could be wrong by 1s or more.
01-Oct-2026 18:59:25 2026-10-01 22:59:26        INFO        RegionTextParser::_determineVersion        RegionTextParser::_determineVersion: Found spec version 0
01-Oct-2026 18:59:27 2026-10-01 22:59:28        INFO        AsciiRegionFileParser::_parse        Combined 1089 image regions (which excludes any annotation regions)
01-Oct-2026 18:59:27 2026-10-01 22:59:28        INFO        AsciiRegionFileParser::_parse        The specified region will select all pixels that are included in the region. Full pixels will be included even when they are only partially covered by the region(s).
01-Oct-2026 18:59:30 test_tool_regionmanager.py::rg_fromtextfile_test::test_1000
01-Oct-2026 18:59:30 Test a large number of regions, CAS-7405
01-Oct-2026 18:59:30 PASSED
01-Oct-2026 18:59:30
01-Oct-2026 18:59:30 2026-10-01 22:59:31        INFO        ImageFactory::createImage        Created Temp image  of shape [250, 250] with float valued pixels.
01-Oct-2026 18:59:30 2026-10-01 22:59:31        INFO        RegionTextParser::_determineVersion        RegionTextParser::_determineVersion: Found spec version 0
01-Oct-2026 18:59:30 2026-10-01 22:59:31        INFO        AsciiRegionFileParser::_parse        Combined 2 image regions (which excludes any annotation regions)
01-Oct-2026 18:59:30 2026-10-01 22:59:31        INFO        AsciiRegionFileParser::_parse        The specified region will select all pixels that are included in the region. Full pixels will be included even when they are only partially covered by the region(s).
01-Oct-2026 18:59:30 2026-10-01 22:59:31        INFO        AsciiRegionFileParser::_parse        Combined 2 image regions (which excludes any annotation regions)
01-Oct-2026 18:59:30 2026-10-01 22:59:31        INFO        AsciiRegionFileParser::_parse        The specified region will select all pixels that are included in the region. Full pixels will be included even when they are only partially covered by the region(s).
01-Oct-2026 18:59:30 test_tool_regionmanager.py::rg_fromtextfile_test::test_CAS_3258
01-Oct-2026 18:59:30 Verify fix to CAS-3258
01-Oct-2026 18:59:30 PASSED
01-Oct-2026 18:59:30
01-Oct-2026 18:59:30 2026-10-01 22:59:31        INFO        ImageFactory::createImage        Created Temp image  of shape [250, 250] with float valued pixels.
01-Oct-2026 18:59:30 2026-10-01 22:59:31        INFO        RegionTextParser::_determineVersion        RegionTextParser::_determineVersion: Found spec version 0
01-Oct-2026 18:59:30 2026-10-01 22:59:31        INFO        AsciiRegionFileParser::_parse        Combined 2 image regions (which excludes any annotation regions)
01-Oct-2026 18:59:30 2026-10-01 22:59:31        INFO        AsciiRegionFileParser::_parse        The specified region will select all pixels that are included in the region. Full pixels will be included even when they are only partially covered by the region(s).
01-Oct-2026 18:59:30 2026-10-01 22:59:31        INFO        AsciiRegionFileParser::_parse        Combined 2 image regions (which excludes any annotation regions)
01-Oct-2026 18:59:30 2026-10-01 22:59:31        INFO        AsciiRegionFileParser::_parse        The specified region will select all pixels that are included in the region. Full pixels will be included even when they are only partially covered by the region(s).
01-Oct-2026 18:59:30 test_tool_regionmanager.py::rg_fromtextfile_test::test_CAS_3259
01-Oct-2026 18:59:30 Verify fix to CAS-3259
01-Oct-2026 18:59:30 PASSED
01-Oct-2026 18:59:30
01-Oct-2026 18:59:30 2026-10-01 22:59:31        INFO        ImageFactory::createImage        Created Temp image  of shape [250, 250] with float valued pixels.
01-Oct-2026 18:59:30 2026-10-01 22:59:31        INFO        RegionTextParser::_determineVersion        RegionTextParser::_determineVersion: Found spec version 0
01-Oct-2026 18:59:30 2026-10-01 22:59:31        INFO        AsciiRegionFileParser::_parse        Combined 2 image regions (which excludes any annotation regions)
01-Oct-2026 18:59:30 2026-10-01 22:59:31        INFO        AsciiRegionFileParser::_parse        The specified region will select all pixels that are included in the region. Full pixels will be included even when they are only partially covered by the region(s).
01-Oct-2026 18:59:30 2026-10-01 22:59:31        INFO        AsciiRegionFileParser::_parse        Combined 2 image regions (which excludes any annotation regions)
01-Oct-2026 18:59:30 2026-10-01 22:59:31        INFO        AsciiRegionFileParser::_parse        The specified region will select all pixels that are included in the region. Full pixels will be included even when they are only partially covered by the region(s).
01-Oct-2026 18:59:30 test_tool_regionmanager.py::rg_fromtextfile_test::test_CAS_3260
01-Oct-2026 18:59:30 Verify fix to CAS-3260
01-Oct-2026 18:59:30 PASSED
01-Oct-2026 18:59:30
01-Oct-2026 18:59:30 2026-10-01 22:59:31        INFO        ImageFactory::createImage        Created Temp image  of shape [50, 50, 10] with float valued pixels.
01-Oct-2026 18:59:30 2026-10-01 22:59:31        INFO        AsciiRegionFileParser::_parse        Combined 1 image regions (which excludes any annotation regions)
01-Oct-2026 18:59:30 2026-10-01 22:59:31        INFO        AsciiRegionFileParser::_parse        The specified region will select all pixels that are included in the region. Full pixels will be included even when they are only partially covered by the region(s).
01-Oct-2026 18:59:30 test_tool_regionmanager.py::rg_fromtextfile_test::test_CAS_4415
01-Oct-2026 18:59:30 Verify CAS-4415 (parser did not properly handle frquency decreasing with pixel number)
01-Oct-2026 18:59:30 PASSED
01-Oct-2026 18:59:30
01-Oct-2026 18:59:30 2026-10-01 22:59:31        INFO        ImageFactory::createImage        Created Temp image  of shape [100, 100, 80] with float valued pixels.
01-Oct-2026 18:59:30 2026-10-01 22:59:31        INFO        AsciiRegionFileParser::_parse        Combined 1 image regions (which excludes any annotation regions)
01-Oct-2026 18:59:30 2026-10-01 22:59:31        INFO        AsciiRegionFileParser::_parse        The specified region will select all pixels that are included in the region. Full pixels will be included even when they are only partially covered by the region(s).
01-Oct-2026 18:59:30 2026-10-01 22:59:31        INFO        AsciiRegionFileParser::_parse        Combined 1 image regions (which excludes any annotation regions)
01-Oct-2026 18:59:30 2026-10-01 22:59:31        INFO        AsciiRegionFileParser::_parse        The specified region will select all pixels that are included in the region. Full pixels will be included even when they are only partially covered by the region(s).
01-Oct-2026 18:59:30 2026-10-01 22:59:31        SEVERE        regionmanager::fromtext        Exception Reported:  line# 1: AnnotationBase: setFrequencyLimits: Neither frequency specified has units. Both must at File: /Users/casaci/bamboohome/xml-data/build-dir/CASASPECS-DBC268-BPO15AP312/casa6/casatools/src/code/imageanalysis/IO/RegionTextParser.cc, line: 969
01-Oct-2026 18:59:30 test_tool_regionmanager.py::rg_fromtextfile_test::test_CAS_4425
01-Oct-2026 18:59:30 Verify CAS-4425 (pixel units now accounted for in range and no units throws exception)
01-Oct-2026 18:59:30 PASSED
01-Oct-2026 18:59:30
01-Oct-2026 18:59:30 2026-10-01 22:59:31        INFO        ImageFactory::createImage        Created Temp image  of shape [20, 20, 200] with float valued pixels.
01-Oct-2026 18:59:30 2026-10-01 22:59:31        INFO        AsciiRegionFileParser::_parse        Combined 1 image regions (which excludes any annotation regions)
01-Oct-2026 18:59:30 2026-10-01 22:59:31        INFO        AsciiRegionFileParser::_parse        The specified region will select all pixels that are included in the region. Full pixels will be included even when they are only partially covered by the region(s).
01-Oct-2026 18:59:30 2026-10-01 22:59:31        INFO        AsciiRegionFileParser::_parse        Combined 1 image regions (which excludes any annotation regions)
01-Oct-2026 18:59:30 2026-10-01 22:59:31        INFO        AsciiRegionFileParser::_parse        The specified region will select all pixels that are included in the region. Full pixels will be included even when they are only partially covered by the region(s).
01-Oct-2026 18:59:30 2026-10-01 22:59:31        INFO        AsciiRegionFileParser::_parse         line# 1: global found
01-Oct-2026 18:59:30 2026-10-01 22:59:31        SEVERE        regionmanager::fromtext        Exception Reported:  line# 2: Exception: Unknown direction reference frame 'B1950 frame=LSRK veltype=RADIO restfreq=1.42040575e+09Hz'.
01-Oct-2026 18:59:30 2026-10-01 22:59:31        SEVERE        regionmanager::fromtext+        ... thrown by casa::AnnotationBase::AnnotationBase(const Type, const String &, const CoordinateSystem &, const Quantity &, const Quantity &, const String &, const String &, const Quantity &, const Vector<Stokes::StokesTypes> &) at File: /Users/casaci/bamboohome/xml-data/build-dir/CASASPECS-DBC268-BPO15AP312/casa6/casatools/src/code/imageanalysis/Annotations/AnnotationBase.cc, line: 115 at File: /Users/casaci/bamboohome/xml-data/build-dir/CASASPECS-DBC268-BPO15AP312/casa6/casatools/src/code/imageanalysis/IO/RegionTextParser.cc, line: 969
01-Oct-2026 18:59:30 2026-10-01 22:59:31        INFO        AsciiRegionFileParser::_parse         line# 1: global found
01-Oct-2026 18:59:30 2026-10-01 22:59:31        INFO        AsciiRegionFileParser::_parse        Combined 1 image regions (which excludes any annotation regions)
01-Oct-2026 18:59:30 2026-10-01 22:59:31        INFO        AsciiRegionFileParser::_parse        The specified region will select all pixels that are included in the region. Full pixels will be included even when they are only partially covered by the region(s).
01-Oct-2026 18:59:30 2026-10-01 22:59:31        INFO        AsciiRegionFileParser::_parse         line# 1: global found
01-Oct-2026 18:59:30 2026-10-01 22:59:31        INFO        AsciiRegionFileParser::_parse        Combined 1 image regions (which excludes any annotation regions)
01-Oct-2026 18:59:30 2026-10-01 22:59:31        INFO        AsciiRegionFileParser::_parse        The specified region will select all pixels that are included in the region. Full pixels will be included even when they are only partially covered by the region(s).
01-Oct-2026 18:59:30 test_tool_regionmanager.py::rg_fromtextfile_test::test_CAS_8072
01-Oct-2026 18:59:30 Verify rest frequency precision issue has been fixed
01-Oct-2026 18:59:30 PASSED
01-Oct-2026 18:59:30
01-Oct-2026 18:59:30 2026-10-01 22:59:31        INFO        ImageFactory::createImage        Created Paged image 'icrs.im' of shape [100, 100] with float valued pixels.
01-Oct-2026 18:59:30 2026-10-01 22:59:31        INFO        AsciiRegionFileParser::_parse        Combined 1 image regions (which excludes any annotation regions)
01-Oct-2026 18:59:30 2026-10-01 22:59:31        INFO        AsciiRegionFileParser::_parse        The specified region will select all pixels that are included in the region. Full pixels will be included even when they are only partially covered by the region(s).
01-Oct-2026 18:59:30 test_tool_regionmanager.py::rg_fromtextfile_test::test_ICRS
01-Oct-2026 18:59:30 CAS-13074, verify that coord=ICRS works correctly
01-Oct-2026 18:59:30
01-Oct-2026 18:59:30 1. Create a 100x100 image using the default coordinate system provided by ia.shape()
01-Oct-2026 18:59:30
01-Oct-2026 18:59:30 2. Modify the coordinate system of the image from J2000 to GALACTIC ref frame,
01-Oct-2026 18:59:30    since the difference between J2000 and ICRS seems to be only about 10 marcsec,
01-Oct-2026 18:59:30    so we need to use a coordinate system where the values in the two systems differ
01-Oct-2026 18:59:30    more to get a convincing test.
01-Oct-2026 18:59:30
01-Oct-2026 18:59:30 3. Set all pixels to 0, except the reference pixel 50, 50 which is set to 1.
01-Oct-2026 18:59:30
01-Oct-2026 18:59:30 4. Create a CRTF region string using coords='ICRS' and a box that is centered at
01-Oct-2026 18:59:30    GALACTIC long=0, lat=0 (the ref direction in the image) but using ICRS coords
01-Oct-2026 18:59:30    of course. The hardcoded ICRS coords were determined using me.measure() to
01-Oct-2026 18:59:30    convert from GALACTIC to ICRS.
01-Oct-2026 18:59:30
01-Oct-2026 18:59:30 5. Run ia.statistics() using region=the CRTF text string previously created.
01-Oct-2026 18:59:30
01-Oct-2026 18:59:30 6. Test that the max pixel value found in the region is 1. This indicates that
01-Oct-2026 18:59:30    the region was applied correctly.
01-Oct-2026 18:59:30 PASSED
01-Oct-2026 18:59:30
01-Oct-2026 18:59:30 2026-10-01 22:59:31        INFO        RegionTextParser::_determineVersion        RegionTextParser::_determineVersion: Found spec version 0
01-Oct-2026 18:59:30 2026-10-01 22:59:31        INFO        AsciiRegionFileParser::_parse        mynewregion.crtf line# 3: difference found
01-Oct-2026 18:59:30 2026-10-01 22:59:31        INFO        AsciiRegionFileParser::_parse        mynewregion.crtf line# 5: difference found
01-Oct-2026 18:59:30 2026-10-01 22:59:31        INFO        AsciiRegionFileParser::_parse        mynewregion.crtf line# 6: difference found
01-Oct-2026 18:59:30 2026-10-01 22:59:31        INFO        AsciiRegionFileParser::_parse        Combined 5 image regions (which excludes any annotation regions)
01-Oct-2026 18:59:30 2026-10-01 22:59:31        INFO        AsciiRegionFileParser::_parse        The specified region will select all pixels that are included in the region. Full pixels will be included even when they are only partially covered by the region(s).
01-Oct-2026 18:59:31 2026-10-01 22:59:31        INFO        ImageRegion::fromRecord        Selected bounding box :
01-Oct-2026 18:59:31 2026-10-01 22:59:31        INFO        ImageRegion::fromRecord+            [245, 132, 0, 0] to [410, 298, 0, 0]  (15:20:40.458, -57.10.16.258, 8.56444e+10Hz, I to 15:20:38.024, -57.09.56.337, 8.56444e+10Hz, I)
01-Oct-2026 18:59:31 2026-10-01 22:59:31        INFO        ImageMaskAttacher::makeMask        Created mask `mask0'
01-Oct-2026 18:59:31 test_tool_regionmanager.py::rg_fromtextfile_test::test_crtf_has_multiple_diff_and_ends_with_diff_bug_fix
01-Oct-2026 18:59:31 CAS-12980, verify fix that allows supplied CRTF file to work correctly
01-Oct-2026 18:59:31 1. copy necessary data
01-Oct-2026 18:59:31 2. run ia.subimage() on image using region file
01-Oct-2026 18:59:31 3. confirm that the correct number of pixels are not masked
01-Oct-2026 18:59:31 PASSED
01-Oct-2026 18:59:31
01-Oct-2026 18:59:31 2026-10-01 22:59:31        INFO        RegionTextParser::_determineVersion        RegionTextParser::_determineVersion: Found spec version 0
01-Oct-2026 18:59:31 2026-10-01 22:59:31        INFO        AsciiRegionFileParser::_parse        /opt/casa/data/casatestdata/unittest/rgtool/testEllipse90deg.crtf line# 2: global found
01-Oct-2026 18:59:31 2026-10-01 22:59:31        INFO        AsciiRegionFileParser::_parse        Combined 1 image regions (which excludes any annotation regions)
01-Oct-2026 18:59:31 2026-10-01 22:59:31        INFO        AsciiRegionFileParser::_parse        The specified region will select all pixels that are included in the region. Full pixels will be included even when they are only partially covered by the region(s).
01-Oct-2026 18:59:31 2026-10-01 22:59:31        INFO        ImageRegion::fromRecord        Selected bounding box :
01-Oct-2026 18:59:31 2026-10-01 22:59:31        INFO        ImageRegion::fromRecord+            [86, 260, 0, 0] to [332, 505, 0, 0]  (286.980670deg, 42.444398deg, I, 3.43915e+11Hz to 286.968632deg, 42.453245deg, I, 3.43915e+11Hz)
01-Oct-2026 18:59:31 2026-10-01 22:59:31        INFO        ImageMaskAttacher::makeMask        Created mask `mask0'
01-Oct-2026 18:59:31 2026-10-01 22:59:31        WARN        image::open (file /private/var/folders/60/83wxljbx2vlfbx_hy0yfv8rc0000gn/T/build-via-sdist-24x446m6/casatools-6.7.7.8a14803.dev1+dirty/src/tools/image/image_cmpt.cc, line 4289)        Another image is already open, closing first
01-Oct-2026 18:59:31 test_tool_regionmanager.py::rg_fromtextfile_test::test_ellipse
01-Oct-2026 18:59:31 Test ellipse for image in GALACTIC and file in J2000
01-Oct-2026 18:59:31 PASSED
01-Oct-2026 18:59:31
01-Oct-2026 18:59:31 test_tool_regionmanager.py::rg_fromtextfile_test::test_exceptions
01-Oct-2026 18:59:31 test exception cases
01-Oct-2026 18:59:31 PASSED
01-Oct-2026 18:59:31
01-Oct-2026 18:59:31 2026-10-01 22:59:31        INFO        ImageFactory::createImage        Created Temp image  of shape [500, 500] with float valued pixels.
01-Oct-2026 18:59:31 2026-10-01 22:59:31        INFO        AsciiRegionFileParser::_parse        Combined 1 image regions (which excludes any annotation regions)
01-Oct-2026 18:59:31 2026-10-01 22:59:31        INFO        AsciiRegionFileParser::_parse        The specified region will select all pixels that are included in the region. Full pixels will be included even when they are only partially covered by the region(s).
01-Oct-2026 18:59:31 test_tool_regionmanager.py::rg_fromtextfile_test::test_poly_2000
01-Oct-2026 18:59:31 Test polygon with 2000 points specified in pixels (CAS-13727)
01-Oct-2026 18:59:31 PASSED
01-Oct-2026 18:59:31
01-Oct-2026 18:59:31 2026-10-01 22:59:31        INFO        FITSCoordinateUtil::fromFITSHeader        Neither SPECSYS nor VELREF keyword given, spectral reference frame not defined ...
01-Oct-2026 18:59:31 2026-10-01 22:59:31        INFO        RegionTextParser::_determineVersion        RegionTextParser::_determineVersion: Found spec version 0
01-Oct-2026 18:59:31 2026-10-01 22:59:31        INFO        AsciiRegionFileParser::_parse        Combined 1 image regions (which excludes any annotation regions)
01-Oct-2026 18:59:31 2026-10-01 22:59:31        INFO        AsciiRegionFileParser::_parse        The specified region will select all pixels that are included in the region. Full pixels will be included even when they are only partially covered by the region(s).
01-Oct-2026 18:59:31 2026-10-01 22:59:31        INFO        AsciiRegionFileParser::_parse        Combined 1 image regions (which excludes any annotation regions)
01-Oct-2026 18:59:31 2026-10-01 22:59:31        INFO        AsciiRegionFileParser::_parse        The specified region will select all pixels that are included in the region. Full pixels will be included even when they are only partially covered by the region(s).
01-Oct-2026 18:59:31 test_tool_regionmanager.py::rg_fromtextfile_test::test_read
01-Oct-2026 18:59:31 Read test
01-Oct-2026 18:59:31 PASSED
01-Oct-2026 18:59:31
01-Oct-2026 18:59:31 2026-10-01 22:59:31        INFO        ImageFactory::createImage        Created Temp image  of shape [200, 200] with float valued pixels.
01-Oct-2026 18:59:31 2026-10-01 22:59:31        INFO        AsciiRegionFileParser::_parse        Combined 1 image regions (which excludes any annotation regions)
01-Oct-2026 18:59:31 2026-10-01 22:59:31        INFO        AsciiRegionFileParser::_parse        The specified region will select all pixels that are included in the region. Full pixels will be included even when they are only partially covered by the region(s).
01-Oct-2026 18:59:31 2026-10-01 22:59:31        INFO        ImageRegion::fromRecord        Selected bounding box :
01-Oct-2026 18:59:31 2026-10-01 22:59:31        INFO        ImageRegion::fromRecord+            [50, 31] to [150, 171]  (00:03:20.047, -01.09.00.278 to 23:56:39.950, +01.11.00.303)
01-Oct-2026 18:59:31 2026-10-01 22:59:31        INFO        ImageMaskAttacher::makeMask        Created mask `mask0'
01-Oct-2026 18:59:31 2026-10-01 22:59:31        WARN        image::open (file /private/var/folders/60/83wxljbx2vlfbx_hy0yfv8rc0000gn/T/build-via-sdist-24x446m6/casatools-6.7.7.8a14803.dev1+dirty/src/tools/image/image_cmpt.cc, line 4289)        Another image is already open, closing first
01-Oct-2026 18:59:31 2026-10-01 22:59:31        INFO        ImageFactory::createImage        Created Temp image  of shape [200, 200] with float valued pixels.
01-Oct-2026 18:59:31 2026-10-01 22:59:31        INFO        AsciiRegionFileParser::_parse        Combined 1 image regions (which excludes any annotation regions)
01-Oct-2026 18:59:31 2026-10-01 22:59:31        INFO        AsciiRegionFileParser::_parse        The specified region will select all pixels that are included in the region. Full pixels will be included even when they are only partially covered by the region(s).
01-Oct-2026 18:59:31 2026-10-01 22:59:31        INFO        ImageRegion::fromRecord        Selected bounding box :
01-Oct-2026 18:59:31 2026-10-01 22:59:31        INFO        ImageRegion::fromRecord+            [50, 31] to [149, 171]  (00:03:20.047, -01.09.00.278 to 23:56:43.952, +01.11.00.303)
01-Oct-2026 18:59:31 2026-10-01 22:59:31        INFO        ImageMaskAttacher::makeMask        Created mask `mask0'
01-Oct-2026 18:59:31 2026-10-01 22:59:31        WARN        image::open (file /private/var/folders/60/83wxljbx2vlfbx_hy0yfv8rc0000gn/T/build-via-sdist-24x446m6/casatools-6.7.7.8a14803.dev1+dirty/src/tools/image/image_cmpt.cc, line 4289)        Another image is already open, closing first
01-Oct-2026 18:59:31 test_tool_regionmanager.py::rg_fromtextfile_test::test_rectangle_rotation
01-Oct-2026 18:59:31 Test rectangle region is preserved under coordinate frame switch
01-Oct-2026 18:59:31 PASSED
01-Oct-2026 18:59:31
01-Oct-2026 18:59:31 2026-10-01 22:59:31        INFO        ImageFactory::createImage        Created Temp image  of shape [200, 200] with float valued pixels.
01-Oct-2026 18:59:31 2026-10-01 22:59:31        INFO        AsciiRegionFileParser::_parse        Combined 1 image regions (which excludes any annotation regions)
01-Oct-2026 18:59:31 2026-10-01 22:59:31        INFO        AsciiRegionFileParser::_parse        The specified region will select all pixels that are included in the region. Full pixels will be included even when they are only partially covered by the region(s).
01-Oct-2026 18:59:31 2026-10-01 22:59:31        INFO        AsciiRegionFileParser::_parse        Combined 1 image regions (which excludes any annotation regions)
01-Oct-2026 18:59:31 2026-10-01 22:59:31        INFO        AsciiRegionFileParser::_parse        The specified region will select all pixels that are included in the region. Full pixels will be included even when they are only partially covered by the region(s).
01-Oct-2026 18:59:31 test_tool_regionmanager.py::rg_fromtextfile_test::test_rotbox
01-Oct-2026 18:59:31 Test rotbox when specified in pixels (CAS-5723)
01-Oct-2026 18:59:31 PASSED
01-Oct-2026 18:59:31
01-Oct-2026 18:59:31 2026-10-01 22:59:31        INFO        ImageFactory::createImage        Created Temp image  of shape [4, 4, 20] with float valued pixels.
01-Oct-2026 18:59:31 2026-10-01 22:59:31        WARN        AsciiRegionFileParser::_parse         line# 1: Error converting world region to lattice region which probably indicates the region lies outside of the image. This region will be ignored.The related message is: LCBox::LCBox - blc [0] must be <= trc [-99889]
01-Oct-2026 18:59:31 2026-10-01 22:59:31        INFO        AsciiRegionFileParser::_parse        Combined 0 image regions (which excludes any annotation regions)
01-Oct-2026 18:59:31 2026-10-01 22:59:31        SEVERE        regionmanager::selectedchannels        Exception Reported: Exception: The specified spectral range range=[1315MHz, 1315.1MHz] does not intersect the image spectral range..
01-Oct-2026 18:59:31 2026-10-01 22:59:31        SEVERE        regionmanager::selectedchannels+        ... thrown by vector<uInt> casa::CasacRegionManager::_spectralRangeFromRangeFormat(uInt &, const String &, const IPosition &) const at File: /Users/casaci/bamboohome/xml-data/build-dir/CASASPECS-DBC268-BPO15AP312/casa6/casatools/src/code/imageanalysis/Regions/CasacRegionManager.cc, line: 1017
01-Oct-2026 18:59:31 2026-10-01 22:59:31        INFO        name::        No table opened.
01-Oct-2026 18:59:31 2026-10-01 22:59:31        INFO        name::        No table opened.
01-Oct-2026 18:59:31 test_tool_regionmanager.py::rg_selectedchannels_test::test_no_overlap
01-Oct-2026 18:59:31 Test selection outside of image
01-Oct-2026 18:59:31 PASSED
01-Oct-2026 18:59:31
01-Oct-2026 18:59:31 2026-10-01 22:59:31        INFO        ImageFactory::createImage        Created Temp image  of shape [4, 4, 4] with float valued pixels.
01-Oct-2026 18:59:31 2026-10-01 22:59:31        SEVERE        regionmanager::selectedchannels        Exception Reported: Exception: Associated coordinate system has no spectral axis.
01-Oct-2026 18:59:31 2026-10-01 22:59:31        SEVERE        regionmanager::selectedchannels+        ... thrown by vector<long> casac::regionmanager::selectedchannels(const string &, const vector<long> &) at File: /private/var/folders/60/83wxljbx2vlfbx_hy0yfv8rc0000gn/T/build-via-sdist-24x446m6/casatools-6.7.7.8a14803.dev1+dirty/src/tools/regionmanager/regionmanager_cmpt.cc, line: 688
01-Oct-2026 18:59:31 2026-10-01 22:59:31        INFO        name::        No table opened.
01-Oct-2026 18:59:31 2026-10-01 22:59:31        INFO        name::        No table opened.
01-Oct-2026 18:59:31 test_tool_regionmanager.py::rg_selectedchannels_test::test_no_spectral_axis
01-Oct-2026 18:59:31 Test no spectral axis throws exception
01-Oct-2026 18:59:31 PASSED
01-Oct-2026 18:59:31
01-Oct-2026 18:59:31 2026-10-01 22:59:31        INFO        ImageFactory::createImage        Created Temp image  of shape [4, 4, 20] with float valued pixels.
01-Oct-2026 18:59:31 2026-10-01 22:59:31        INFO        AsciiRegionFileParser::_parse        Combined 1 image regions (which excludes any annotation regions)
01-Oct-2026 18:59:31 2026-10-01 22:59:31        INFO        AsciiRegionFileParser::_parse        The specified region will select all pixels that are included in the region. Full pixels will be included even when they are only partially covered by the region(s).
01-Oct-2026 18:59:31 2026-10-01 22:59:31        INFO        AsciiRegionFileParser::_parse        Combined 1 image regions (which excludes any annotation regions)
01-Oct-2026 18:59:31 2026-10-01 22:59:31        INFO        AsciiRegionFileParser::_parse        The specified region will select all pixels that are included in the region. Full pixels will be included even when they are only partially covered by the region(s).
01-Oct-2026 18:59:31 2026-10-01 22:59:31        INFO        AsciiRegionFileParser::_parse        Combined 1 image regions (which excludes any annotation regions)
01-Oct-2026 18:59:31 2026-10-01 22:59:31        INFO        AsciiRegionFileParser::_parse        The specified region will select all pixels that are included in the region. Full pixels will be included even when they are only partially covered by the region(s).
01-Oct-2026 18:59:31 2026-10-01 22:59:31        INFO        AsciiRegionFileParser::_parse        Combined 1 image regions (which excludes any annotation regions)
01-Oct-2026 18:59:31 2026-10-01 22:59:31        INFO        AsciiRegionFileParser::_parse        The specified region will select all pixels that are included in the region. Full pixels will be included even when they are only partially covered by the region(s).
01-Oct-2026 18:59:31 2026-10-01 22:59:31        INFO        name::        No table opened.
01-Oct-2026 18:59:31 2026-10-01 22:59:31        INFO        name::        No table opened.
01-Oct-2026 18:59:31 test_tool_regionmanager.py::rg_selectedchannels_test::test_range
01-Oct-2026 18:59:31 Test range
01-Oct-2026 18:59:31 PASSED
01-Oct-2026 18:59:31
01-Oct-2026 18:59:31 - generated xml file: /Users/casaci/bamboohome/xml-data/build-dir/CASASPECS-DEVTESTPY312158-TTOARM15P312/casa6/casatestutils/nosedir/xml/test_tool_regionmanager/nose.xml -
01-Oct-2026 18:59:31 ======================== 34 passed, 1 warning in 8.04s =========================
01-Oct-2026 18:59:31
01-Oct-2026 18:59:31
01-Oct-2026 18:59:31 Setting Working Directory: /Users/casaci/bamboohome/xml-data/build-dir/CASASPECS-DEVTESTPY312158-TTOARM15P312/casa6/casatestutils/nosedir/test_tool_simulator/
01-Oct-2026 18:59:31 Test Directory: /Users/casaci/bamboohome/xml-data/build-dir/CASASPECS-DEVTESTPY312158-TTOARM15P312/casa6/casatestutils/nosedir/test_tool_simulator
01-Oct-2026 18:59:31
01-Oct-2026 18:59:31 Running Command: pytest --junitxml=/Users/casaci/bamboohome/xml-data/build-dir/CASASPECS-DEVTESTPY312158-TTOARM15P312/casa6/casatestutils/nosedir/xml/test_tool_simulator/nose.xml -s --disable-pytest-warnings --verbose -ra --tb=short /Users/casaci/bamboohome/xml-data/build-dir/CASASPECS-DEVTESTPY312158-TTOARM15P312/casa6/casatestutils/nosedir/test_tool_simulator/
01-Oct-2026 18:59:31
01-Oct-2026 18:59:31 Setting Working Directory: /Users/casaci/bamboohome/xml-data/build-dir/CASASPECS-DEVTESTPY312158-TTOARM15P312/casa6/casatestutils/nosedir/test_tool_calibrater/
01-Oct-2026 18:59:31 Test Directory: /Users/casaci/bamboohome/xml-data/build-dir/CASASPECS-DEVTESTPY312158-TTOARM15P312/casa6/casatestutils/nosedir/test_tool_calibrater
01-Oct-2026 18:59:31
01-Oct-2026 18:59:31 Running Command: pytest --junitxml=/Users/casaci/bamboohome/xml-data/build-dir/CASASPECS-DEVTESTPY312158-TTOARM15P312/casa6/casatestutils/nosedir/xml/test_tool_calibrater/nose.xml -s --disable-pytest-warnings --verbose -ra --tb=short /Users/casaci/bamboohome/xml-data/build-dir/CASASPECS-DEVTESTPY312158-TTOARM15P312/casa6/casatestutils/nosedir/test_tool_calibrater/
01-Oct-2026 18:59:31
01-Oct-2026 18:59:31 Setting Working Directory: /Users/casaci/bamboohome/xml-data/build-dir/CASASPECS-DEVTESTPY312158-TTOARM15P312/casa6/casatestutils/nosedir/test_tool_image_subimage/
01-Oct-2026 18:59:31 Test Directory: /Users/casaci/bamboohome/xml-data/build-dir/CASASPECS-DEVTESTPY312158-TTOARM15P312/casa6/casatestutils/nosedir/test_tool_image_subimage
01-Oct-2026 18:59:31
01-Oct-2026 18:59:31 Running Command: pytest --junitxml=/Users/casaci/bamboohome/xml-data/build-dir/CASASPECS-DEVTESTPY312158-TTOARM15P312/casa6/casatestutils/nosedir/xml/test_tool_image_subimage/nose.xml -s --disable-pytest-warnings --verbose -ra --tb=short /Users/casaci/bamboohome/xml-data/build-dir/CASASPECS-DEVTESTPY312158-TTOARM15P312/casa6/casatestutils/nosedir/test_tool_image_subimage/
01-Oct-2026 18:59:31
01-Oct-2026 18:59:31 Setting Working Directory: /Users/casaci/bamboohome/xml-data/build-dir/CASASPECS-DEVTESTPY312158-TTOARM15P312/casa6/casatestutils/nosedir/test_tool_image_transpose/
01-Oct-2026 18:59:31 Test Directory: /Users/casaci/bamboohome/xml-data/build-dir/CASASPECS-DEVTESTPY312158-TTOARM15P312/casa6/casatestutils/nosedir/test_tool_image_transpose
01-Oct-2026 18:59:31
01-Oct-2026 18:59:31 Running Command: pytest --junitxml=/Users/casaci/bamboohome/xml-data/build-dir/CASASPECS-DEVTESTPY312158-TTOARM15P312/casa6/casatestutils/nosedir/xml/test_tool_image_transpose/nose.xml -s --disable-pytest-warnings --verbose -ra --tb=short /Users/casaci/bamboohome/xml-data/build-dir/CASASPECS-DEVTESTPY312158-TTOARM15P312/casa6/casatestutils/nosedir/test_tool_image_transpose/
01-Oct-2026 18:59:31
01-Oct-2026 18:59:31 Setting Working Directory: /Users/casaci/bamboohome/xml-data/build-dir/CASASPECS-DEVTESTPY312158-TTOARM15P312/casa6/casatestutils/nosedir/test_tool_ms_createmultims/
01-Oct-2026 18:59:31 Test Directory: /Users/casaci/bamboohome/xml-data/build-dir/CASASPECS-DEVTESTPY312158-TTOARM15P312/casa6/casatestutils/nosedir/test_tool_ms_createmultims
01-Oct-2026 18:59:31
01-Oct-2026 18:59:31 Running Command: pytest --junitxml=/Users/casaci/bamboohome/xml-data/build-dir/CASASPECS-DEVTESTPY312158-TTOARM15P312/casa6/casatestutils/nosedir/xml/test_tool_ms_createmultims/nose.xml -s --disable-pytest-warnings --verbose -ra --tb=short /Users/casaci/bamboohome/xml-data/build-dir/CASASPECS-DEVTESTPY312158-TTOARM15P312/casa6/casatestutils/nosedir/test_tool_ms_createmultims/
01-Oct-2026 18:59:31
01-Oct-2026 18:59:31 Setting Working Directory: /Users/casaci/bamboohome/xml-data/build-dir/CASASPECS-DEVTESTPY312158-TTOARM15P312/casa6/casatestutils/nosedir/test_tool_measures/
01-Oct-2026 18:59:31 Test Directory: /Users/casaci/bamboohome/xml-data/build-dir/CASASPECS-DEVTESTPY312158-TTOARM15P312/casa6/casatestutils/nosedir/test_tool_measures
01-Oct-2026 18:59:31
01-Oct-2026 18:59:31 Running Command: pytest --junitxml=/Users/casaci/bamboohome/xml-data/build-dir/CASASPECS-DEVTESTPY312158-TTOARM15P312/casa6/casatestutils/nosedir/xml/test_tool_measures/nose.xml -s --disable-pytest-warnings --verbose -ra --tb=short /Users/casaci/bamboohome/xml-data/build-dir/CASASPECS-DEVTESTPY312158-TTOARM15P312/casa6/casatestutils/nosedir/test_tool_measures/
01-Oct-2026 18:59:31
01-Oct-2026 18:59:31 Setting Working Directory: /Users/casaci/bamboohome/xml-data/build-dir/CASASPECS-DEVTESTPY312158-TTOARM15P312/casa6/casatestutils/nosedir/test_tool_quanta/
01-Oct-2026 18:59:31 Test Directory: /Users/casaci/bamboohome/xml-data/build-dir/CASASPECS-DEVTESTPY312158-TTOARM15P312/casa6/casatestutils/nosedir/test_tool_quanta
01-Oct-2026 18:59:31
01-Oct-2026 18:59:31 Running Command: pytest --junitxml=/Users/casaci/bamboohome/xml-data/build-dir/CASASPECS-DEVTESTPY312158-TTOARM15P312/casa6/casatestutils/nosedir/xml/test_tool_quanta/nose.xml -s --disable-pytest-warnings --verbose -ra --tb=short /Users/casaci/bamboohome/xml-data/build-dir/CASASPECS-DEVTESTPY312158-TTOARM15P312/casa6/casatestutils/nosedir/test_tool_quanta/
01-Oct-2026 18:59:31
01-Oct-2026 18:59:31 Setting Working Directory: /Users/casaci/bamboohome/xml-data/build-dir/CASASPECS-DEVTESTPY312158-TTOARM15P312/casa6/casatestutils/nosedir/test_tool_ms/
01-Oct-2026 18:59:31 Test Directory: /Users/casaci/bamboohome/xml-data/build-dir/CASASPECS-DEVTESTPY312158-TTOARM15P312/casa6/casatestutils/nosedir/test_tool_ms
01-Oct-2026 18:59:31
01-Oct-2026 18:59:31 Running Command: pytest --junitxml=/Users/casaci/bamboohome/xml-data/build-dir/CASASPECS-DEVTESTPY312158-TTOARM15P312/casa6/casatestutils/nosedir/xml/test_tool_ms/nose.xml -s --disable-pytest-warnings --verbose -ra --tb=short /Users/casaci/bamboohome/xml-data/build-dir/CASASPECS-DEVTESTPY312158-TTOARM15P312/casa6/casatestutils/nosedir/test_tool_ms/
01-Oct-2026 18:59:31
01-Oct-2026 18:59:31 Setting Working Directory: /Users/casaci/bamboohome/xml-data/build-dir/CASASPECS-DEVTESTPY312158-TTOARM15P312/casa6/casatestutils/nosedir/test_tool_componentlist/
01-Oct-2026 18:59:31 Test Directory: /Users/casaci/bamboohome/xml-data/build-dir/CASASPECS-DEVTESTPY312158-TTOARM15P312/casa6/casatestutils/nosedir/test_tool_componentlist
01-Oct-2026 18:59:31
01-Oct-2026 18:59:31 Running Command: pytest --junitxml=/Users/casaci/bamboohome/xml-data/build-dir/CASASPECS-DEVTESTPY312158-TTOARM15P312/casa6/casatestutils/nosedir/xml/test_tool_componentlist/nose.xml -s --disable-pytest-warnings --verbose -ra --tb=short /Users/casaci/bamboohome/xml-data/build-dir/CASASPECS-DEVTESTPY312158-TTOARM15P312/casa6/casatestutils/nosedir/test_tool_componentlist/
01-Oct-2026 18:59:31
01-Oct-2026 18:59:31 Setting Working Directory: /Users/casaci/bamboohome/xml-data/build-dir/CASASPECS-DEVTESTPY312158-TTOARM15P312/casa6/casatestutils/nosedir/test_tool_ms_statwt/
01-Oct-2026 18:59:31 Test Directory: /Users/casaci/bamboohome/xml-data/build-dir/CASASPECS-DEVTESTPY312158-TTOARM15P312/casa6/casatestutils/nosedir/test_tool_ms_statwt
01-Oct-2026 18:59:31
01-Oct-2026 18:59:31 Running Command: pytest --junitxml=/Users/casaci/bamboohome/xml-data/build-dir/CASASPECS-DEVTESTPY312158-TTOARM15P312/casa6/casatestutils/nosedir/xml/test_tool_ms_statwt/nose.xml -s --disable-pytest-warnings --verbose -ra --tb=short /Users/casaci/bamboohome/xml-data/build-dir/CASASPECS-DEVTESTPY312158-TTOARM15P312/casa6/casatestutils/nosedir/test_tool_ms_statwt/
01-Oct-2026 18:59:31
01-Oct-2026 18:59:31 Setting Working Directory: /Users/casaci/bamboohome/xml-data/build-dir/CASASPECS-DEVTESTPY312158-TTOARM15P312/casa6/casatestutils/nosedir/test_tool_image_deviation/
01-Oct-2026 18:59:31 Test Directory: /Users/casaci/bamboohome/xml-data/build-dir/CASASPECS-DEVTESTPY312158-TTOARM15P312/casa6/casatestutils/nosedir/test_tool_image_deviation
01-Oct-2026 18:59:31
01-Oct-2026 18:59:31 Running Command: pytest --junitxml=/Users/casaci/bamboohome/xml-data/build-dir/CASASPECS-DEVTESTPY312158-TTOARM15P312/casa6/casatestutils/nosedir/xml/test_tool_image_deviation/nose.xml -s --disable-pytest-warnings --verbose -ra --tb=short /Users/casaci/bamboohome/xml-data/build-dir/CASASPECS-DEVTESTPY312158-TTOARM15P312/casa6/casatestutils/nosedir/test_tool_image_deviation/
01-Oct-2026 18:59:31
01-Oct-2026 18:59:31 Setting Working Directory: /Users/casaci/bamboohome/xml-data/build-dir/CASASPECS-DEVTESTPY312158-TTOARM15P312/casa6/casatestutils/nosedir/test_tool_logsink/
01-Oct-2026 18:59:31 Test Directory: /Users/casaci/bamboohome/xml-data/build-dir/CASASPECS-DEVTESTPY312158-TTOARM15P312/casa6/casatestutils/nosedir/test_tool_logsink
01-Oct-2026 18:59:31
01-Oct-2026 18:59:31 Running Command: pytest --junitxml=/Users/casaci/bamboohome/xml-data/build-dir/CASASPECS-DEVTESTPY312158-TTOARM15P312/casa6/casatestutils/nosedir/xml/test_tool_logsink/nose.xml -s --disable-pytest-warnings --verbose -ra --tb=short /Users/casaci/bamboohome/xml-data/build-dir/CASASPECS-DEVTESTPY312158-TTOARM15P312/casa6/casatestutils/nosedir/test_tool_logsink/
01-Oct-2026 18:59:31
01-Oct-2026 18:59:31 Setting Working Directory: /Users/casaci/bamboohome/xml-data/build-dir/CASASPECS-DEVTESTPY312158-TTOARM15P312/casa6/casatestutils/nosedir/test_tool_table/
01-Oct-2026 18:59:31 Test Directory: /Users/casaci/bamboohome/xml-data/build-dir/CASASPECS-DEVTESTPY312158-TTOARM15P312/casa6/casatestutils/nosedir/test_tool_table
01-Oct-2026 18:59:31
01-Oct-2026 18:59:31 Running Command: pytest --junitxml=/Users/casaci/bamboohome/xml-data/build-dir/CASASPECS-DEVTESTPY312158-TTOARM15P312/casa6/casatestutils/nosedir/xml/test_tool_table/nose.xml -s --disable-pytest-warnings --verbose -ra --tb=short /Users/casaci/bamboohome/xml-data/build-dir/CASASPECS-DEVTESTPY312158-TTOARM15P312/casa6/casatestutils/nosedir/test_tool_table/
01-Oct-2026 18:59:31
01-Oct-2026 18:59:31 Setting Working Directory: /Users/casaci/bamboohome/xml-data/build-dir/CASASPECS-DEVTESTPY312158-TTOARM15P312/casa6/casatestutils/nosedir/test_tool_msuvbinner/
01-Oct-2026 18:59:31 Test Directory: /Users/casaci/bamboohome/xml-data/build-dir/CASASPECS-DEVTESTPY312158-TTOARM15P312/casa6/casatestutils/nosedir/test_tool_msuvbinner
01-Oct-2026 18:59:31
01-Oct-2026 18:59:31 Running Command: pytest --junitxml=/Users/casaci/bamboohome/xml-data/build-dir/CASASPECS-DEVTESTPY312158-TTOARM15P312/casa6/casatestutils/nosedir/xml/test_tool_msuvbinner/nose.xml -s --disable-pytest-warnings --verbose -ra --tb=short /Users/casaci/bamboohome/xml-data/build-dir/CASASPECS-DEVTESTPY312158-TTOARM15P312/casa6/casatestutils/nosedir/test_tool_msuvbinner/
01-Oct-2026 18:59:31
01-Oct-2026 18:59:31 Setting Working Directory: /Users/casaci/bamboohome/xml-data/build-dir/CASASPECS-DEVTESTPY312158-TTOARM15P312/casa6/casatestutils/nosedir/test_tool_sdm_toms/
01-Oct-2026 18:59:31 Test Directory: /Users/casaci/bamboohome/xml-data/build-dir/CASASPECS-DEVTESTPY312158-TTOARM15P312/casa6/casatestutils/nosedir/test_tool_sdm_toms
01-Oct-2026 18:59:31
01-Oct-2026 18:59:31 Running Command: pytest --junitxml=/Users/casaci/bamboohome/xml-data/build-dir/CASASPECS-DEVTESTPY312158-TTOARM15P312/casa6/casatestutils/nosedir/xml/test_tool_sdm_toms/nose.xml -s --disable-pytest-warnings --verbose -ra --tb=short /Users/casaci/bamboohome/xml-data/build-dir/CASASPECS-DEVTESTPY312158-TTOARM15P312/casa6/casatestutils/nosedir/test_tool_sdm_toms/
01-Oct-2026 18:59:31
01-Oct-2026 18:59:31 Setting Working Directory: /Users/casaci/bamboohome/xml-data/build-dir/CASASPECS-DEVTESTPY312158-TTOARM15P312/casa6/casatestutils/nosedir/test_tool_image/
01-Oct-2026 18:59:31 Test Directory: /Users/casaci/bamboohome/xml-data/build-dir/CASASPECS-DEVTESTPY312158-TTOARM15P312/casa6/casatestutils/nosedir/test_tool_image
01-Oct-2026 18:59:31
01-Oct-2026 18:59:31 Running Command: pytest --junitxml=/Users/casaci/bamboohome/xml-data/build-dir/CASASPECS-DEVTESTPY312158-TTOARM15P312/casa6/casatestutils/nosedir/xml/test_tool_image/nose.xml -s --disable-pytest-warnings --verbose -ra --tb=short /Users/casaci/bamboohome/xml-data/build-dir/CASASPECS-DEVTESTPY312158-TTOARM15P312/casa6/casatestutils/nosedir/test_tool_image/
01-Oct-2026 18:59:31
01-Oct-2026 18:59:31 Setting Working Directory: /Users/casaci/bamboohome/xml-data/build-dir/CASASPECS-DEVTESTPY312158-TTOARM15P312/casa6/casatestutils/nosedir/test_tool_image_collapse/
01-Oct-2026 18:59:31 Test Directory: /Users/casaci/bamboohome/xml-data/build-dir/CASASPECS-DEVTESTPY312158-TTOARM15P312/casa6/casatestutils/nosedir/test_tool_image_collapse
01-Oct-2026 18:59:31
01-Oct-2026 18:59:31 Running Command: pytest --junitxml=/Users/casaci/bamboohome/xml-data/build-dir/CASASPECS-DEVTESTPY312158-TTOARM15P312/casa6/casatestutils/nosedir/xml/test_tool_image_collapse/nose.xml -s --disable-pytest-warnings --verbose -ra --tb=short /Users/casaci/bamboohome/xml-data/build-dir/CASASPECS-DEVTESTPY312158-TTOARM15P312/casa6/casatestutils/nosedir/test_tool_image_collapse/
01-Oct-2026 18:59:31
01-Oct-2026 18:59:31 Setting Working Directory: /Users/casaci/bamboohome/xml-data/build-dir/CASASPECS-DEVTESTPY312158-TTOARM15P312/casa6/casatestutils/nosedir/test_tool_agentflagger/
01-Oct-2026 18:59:31 Test Directory: /Users/casaci/bamboohome/xml-data/build-dir/CASASPECS-DEVTESTPY312158-TTOARM15P312/casa6/casatestutils/nosedir/test_tool_agentflagger
01-Oct-2026 18:59:31
01-Oct-2026 18:59:31 Running Command: pytest --junitxml=/Users/casaci/bamboohome/xml-data/build-dir/CASASPECS-DEVTESTPY312158-TTOARM15P312/casa6/casatestutils/nosedir/xml/test_tool_agentflagger/nose.xml -s --disable-pytest-warnings --verbose -ra --tb=short /Users/casaci/bamboohome/xml-data/build-dir/CASASPECS-DEVTESTPY312158-TTOARM15P312/casa6/casatestutils/nosedir/test_tool_agentflagger/
01-Oct-2026 18:59:31
01-Oct-2026 18:59:31 Setting Working Directory: /Users/casaci/bamboohome/xml-data/build-dir/CASASPECS-DEVTESTPY312158-TTOARM15P312/casa6/casatestutils/nosedir/test_tool_image_pv/
01-Oct-2026 18:59:31 Test Directory: /Users/casaci/bamboohome/xml-data/build-dir/CASASPECS-DEVTESTPY312158-TTOARM15P312/casa6/casatestutils/nosedir/test_tool_image_pv
01-Oct-2026 18:59:31
01-Oct-2026 18:59:31 Running Command: pytest --junitxml=/Users/casaci/bamboohome/xml-data/build-dir/CASASPECS-DEVTESTPY312158-TTOARM15P312/casa6/casatestutils/nosedir/xml/test_tool_image_pv/nose.xml -s --disable-pytest-warnings --verbose -ra --tb=short /Users/casaci/bamboohome/xml-data/build-dir/CASASPECS-DEVTESTPY312158-TTOARM15P312/casa6/casatestutils/nosedir/test_tool_image_pv/
01-Oct-2026 18:59:31
01-Oct-2026 18:59:31 Setting Working Directory: /Users/casaci/bamboohome/xml-data/build-dir/CASASPECS-DEVTESTPY312158-TTOARM15P312/casa6/casatestutils/nosedir/test_tool_vpmanager/
01-Oct-2026 18:59:31 Test Directory: /Users/casaci/bamboohome/xml-data/build-dir/CASASPECS-DEVTESTPY312158-TTOARM15P312/casa6/casatestutils/nosedir/test_tool_vpmanager
01-Oct-2026 18:59:31
01-Oct-2026 18:59:31 Running Command: pytest --junitxml=/Users/casaci/bamboohome/xml-data/build-dir/CASASPECS-DEVTESTPY312158-TTOARM15P312/casa6/casatestutils/nosedir/xml/test_tool_vpmanager/nose.xml -s --disable-pytest-warnings --verbose -ra --tb=short /Users/casaci/bamboohome/xml-data/build-dir/CASASPECS-DEVTESTPY312158-TTOARM15P312/casa6/casatestutils/nosedir/test_tool_vpmanager/
01-Oct-2026 18:59:31
01-Oct-2026 18:59:31 Setting Working Directory: /Users/casaci/bamboohome/xml-data/build-dir/CASASPECS-DEVTESTPY312158-TTOARM15P312/casa6/casatestutils/nosedir/test_tool_msmetadata/
01-Oct-2026 18:59:31 Test Directory: /Users/casaci/bamboohome/xml-data/build-dir/CASASPECS-DEVTESTPY312158-TTOARM15P312/casa6/casatestutils/nosedir/test_tool_msmetadata
01-Oct-2026 18:59:31
01-Oct-2026 18:59:31 Running Command: pytest --junitxml=/Users/casaci/bamboohome/xml-data/build-dir/CASASPECS-DEVTESTPY312158-TTOARM15P312/casa6/casatestutils/nosedir/xml/test_tool_msmetadata/nose.xml -s --disable-pytest-warnings --verbose -ra --tb=short /Users/casaci/bamboohome/xml-data/build-dir/CASASPECS-DEVTESTPY312158-TTOARM15P312/casa6/casatestutils/nosedir/test_tool_msmetadata/
01-Oct-2026 18:59:31
01-Oct-2026 18:59:31 Setting Working Directory: /Users/casaci/bamboohome/xml-data/build-dir/CASASPECS-DEVTESTPY312158-TTOARM15P312/casa6/casatestutils/nosedir/test_tool_image_regrid/
01-Oct-2026 18:59:31 Test Directory: /Users/casaci/bamboohome/xml-data/build-dir/CASASPECS-DEVTESTPY312158-TTOARM15P312/casa6/casatestutils/nosedir/test_tool_image_regrid
01-Oct-2026 18:59:31
01-Oct-2026 18:59:31 Running Command: pytest --junitxml=/Users/casaci/bamboohome/xml-data/build-dir/CASASPECS-DEVTESTPY312158-TTOARM15P312/casa6/casatestutils/nosedir/xml/test_tool_image_regrid/nose.xml -s --disable-pytest-warnings --verbose -ra --tb=short /Users/casaci/bamboohome/xml-data/build-dir/CASASPECS-DEVTESTPY312158-TTOARM15P312/casa6/casatestutils/nosedir/test_tool_image_regrid/
01-Oct-2026 18:59:31
01-Oct-2026 18:59:31 Setting Working Directory: /Users/casaci/bamboohome/xml-data/build-dir/CASASPECS-DEVTESTPY312158-TTOARM15P312/casa6/casatestutils/nosedir/test_tool_imagepol/
01-Oct-2026 18:59:31 Test Directory: /Users/casaci/bamboohome/xml-data/build-dir/CASASPECS-DEVTESTPY312158-TTOARM15P312/casa6/casatestutils/nosedir/test_tool_imagepol
01-Oct-2026 18:59:31
01-Oct-2026 18:59:31 Running Command: pytest --junitxml=/Users/casaci/bamboohome/xml-data/build-dir/CASASPECS-DEVTESTPY312158-TTOARM15P312/casa6/casatestutils/nosedir/xml/test_tool_imagepol/nose.xml -s --disable-pytest-warnings --verbose -ra --tb=short /Users/casaci/bamboohome/xml-data/build-dir/CASASPECS-DEVTESTPY312158-TTOARM15P312/casa6/casatestutils/nosedir/test_tool_imagepol/
01-Oct-2026 18:59:31
01-Oct-2026 18:59:31 Setting Working Directory: /Users/casaci/bamboohome/xml-data/build-dir/CASASPECS-DEVTESTPY312158-TTOARM15P312/casa6/casatestutils/nosedir/test_tool_regionmanager/
01-Oct-2026 18:59:31 Test Directory: /Users/casaci/bamboohome/xml-data/build-dir/CASASPECS-DEVTESTPY312158-TTOARM15P312/casa6/casatestutils/nosedir/test_tool_regionmanager
01-Oct-2026 18:59:31
01-Oct-2026 18:59:31 Running Command: pytest --junitxml=/Users/casaci/bamboohome/xml-data/build-dir/CASASPECS-DEVTESTPY312158-TTOARM15P312/casa6/casatestutils/nosedir/xml/test_tool_regionmanager/nose.xml -s --disable-pytest-warnings --verbose -ra --tb=short /Users/casaci/bamboohome/xml-data/build-dir/CASASPECS-DEVTESTPY312158-TTOARM15P312/casa6/casatestutils/nosedir/test_tool_regionmanager/
01-Oct-2026 18:59:31 Finished task 'Test wheel' with result: Success
01-Oct-2026 18:59:31 Starting task 'Parse tests' of type 'com.atlassian.bamboo.plugins.testresultparser:task.testresultparser.junit'
01-Oct-2026 18:59:31 Parsing test results under /Users/casaci/bamboohome/xml-data/build-dir/CASASPECS-DEVTESTPY312158-TTOARM15P312...
01-Oct-2026 18:59:31 Finished task 'Parse tests' with result: Success
01-Oct-2026 18:59:31
Substituting variable: ${bamboo.agentId} with 142606338
01-Oct-2026 18:59:31
Substituting variable: ${bamboo.agentId} with 142606338
01-Oct-2026 18:59:31 Starting task 'Upload wheels' of type 'com.atlassian.bamboo.plugins.scripttask:task.builder.script'
01-Oct-2026 18:59:31
Beginning to execute external process for build 'CASASPECS - Dev Test 3.12 - CAS-14803 - Test Tools macOS 15 Py3.12 #1 (CASASPECS-DEVTESTPY312158-TTOARM15P312-1)'
... running command line:
/Users/casaci/bamboohome/temp/CASASPECS-DEVTESTPY312158-TTOARM15P312-1-ScriptBuildTask-6838198067266652344.sh
... in: /Users/casaci/bamboohome/xml-data/build-dir/CASASPECS-DEVTESTPY312158-TTOARM15P312
01-Oct-2026 18:59:31 Cloning into 'casa-build-utils'...
01-Oct-2026 18:59:32 /Users/casaci/bamboohome/xml-data/build-dir/CASASPECS-DEVTESTPY312158-TTOARM15P312
01-Oct-2026 18:59:34 Collecting twine
01-Oct-2026 18:59:34   Using cached twine-6.2.0-py3-none-any.whl (42 kB)
01-Oct-2026 18:59:34 Collecting readme-renderer>=35.0
01-Oct-2026 18:59:34   Using cached readme_renderer-44.0-py3-none-any.whl (13 kB)
01-Oct-2026 18:59:34 Collecting importlib-metadata>=3.6
01-Oct-2026 18:59:34   Using cached importlib_metadata-8.7.1-py3-none-any.whl (27 kB)
01-Oct-2026 18:59:34 Collecting id
01-Oct-2026 18:59:34   Using cached id-1.6.1-py3-none-any.whl (14 kB)
01-Oct-2026 18:59:34 Collecting urllib3>=1.26.0
01-Oct-2026 18:59:34   Using cached urllib3-2.6.3-py3-none-any.whl (131 kB)
01-Oct-2026 18:59:34 Collecting requests>=2.20
01-Oct-2026 18:59:34   Using cached requests-2.32.5-py3-none-any.whl (64 kB)
01-Oct-2026 18:59:34 Collecting requests-toolbelt!=0.9.0,>=0.8.0
01-Oct-2026 18:59:34   Using cached requests_toolbelt-1.0.0-py2.py3-none-any.whl (54 kB)
01-Oct-2026 18:59:34 Collecting packaging>=24.0
01-Oct-2026 18:59:34   Using cached packaging-26.3-py3-none-any.whl (129 kB)
01-Oct-2026 18:59:34 Collecting keyring>=21.2.0
01-Oct-2026 18:59:34   Using cached keyring-25.7.0-py3-none-any.whl (39 kB)
01-Oct-2026 18:59:34 Collecting rfc3986>=1.4.0
01-Oct-2026 18:59:34   Using cached rfc3986-2.0.0-py2.py3-none-any.whl (31 kB)
01-Oct-2026 18:59:34 Collecting rich>=12.0.0
01-Oct-2026 18:59:34   Using cached rich-15.0.0-py3-none-any.whl (310 kB)
01-Oct-2026 18:59:34 Collecting zipp>=3.20
01-Oct-2026 18:59:34   Using cached zipp-3.23.1-py3-none-any.whl (10 kB)
01-Oct-2026 18:59:34 Collecting jaraco.functools
01-Oct-2026 18:59:34   Using cached jaraco_functools-4.4.0-py3-none-any.whl (10 kB)
01-Oct-2026 18:59:34 Collecting jaraco.context
01-Oct-2026 18:59:34   Using cached jaraco_context-6.1.1-py3-none-any.whl (7.0 kB)
01-Oct-2026 18:59:34 Collecting jaraco.classes
01-Oct-2026 18:59:34   Using cached jaraco.classes-3.4.0-py3-none-any.whl (6.8 kB)
01-Oct-2026 18:59:34 Collecting Pygments>=2.5.1
01-Oct-2026 18:59:34   Using cached pygments-2.21.0-py3-none-any.whl (1.3 MB)
01-Oct-2026 18:59:35 Collecting docutils>=0.21.2
01-Oct-2026 18:59:35   Using cached docutils-0.23-py3-none-any.whl (634 kB)
01-Oct-2026 18:59:35 Collecting nh3>=0.2.14
01-Oct-2026 18:59:35   Using cached nh3-0.3.7-cp38-abi3-macosx_10_12_x86_64.macosx_11_0_arm64.macosx_10_12_universal2.whl (1.5 MB)
01-Oct-2026 18:59:35 Collecting idna<4,>=2.5
01-Oct-2026 18:59:35   Using cached idna-3.20-py3-none-any.whl (69 kB)
01-Oct-2026 18:59:35 Collecting charset_normalizer<4,>=2
01-Oct-2026 18:59:35   Using cached charset_normalizer-3.5.2-cp39-cp39-macosx_10_9_universal2.whl (374 kB)
01-Oct-2026 18:59:35 Collecting certifi>=2017.4.17
01-Oct-2026 18:59:35   Using cached certifi-2026.7.22-py3-none-any.whl (136 kB)
01-Oct-2026 18:59:35 Collecting markdown-it-py>=2.2.0
01-Oct-2026 18:59:35   Using cached markdown_it_py-3.0.0-py3-none-any.whl (87 kB)
01-Oct-2026 18:59:35 Collecting mdurl~=0.1
01-Oct-2026 18:59:35   Using cached mdurl-0.1.2-py3-none-any.whl (10.0 kB)
01-Oct-2026 18:59:35 Collecting more-itertools
01-Oct-2026 18:59:35   Using cached more_itertools-10.8.0-py3-none-any.whl (69 kB)
01-Oct-2026 18:59:35 Collecting backports.tarfile
01-Oct-2026 18:59:35   Using cached backports.tarfile-1.2.0-py3-none-any.whl (30 kB)
01-Oct-2026 18:59:35 Installing collected packages: zipp, urllib3, more-itertools, mdurl, idna, charset-normalizer, certifi, backports.tarfile, requests, Pygments, nh3, markdown-it-py, jaraco.functools, jaraco.context, jaraco.classes, importlib-metadata, docutils, rich, rfc3986, requests-toolbelt, readme-renderer, packaging, keyring, id, twine
01-Oct-2026 18:59:37 Successfully installed Pygments-2.21.0 backports.tarfile-1.2.0 certifi-2026.7.22 charset-normalizer-3.5.2 docutils-0.23 id-1.6.1 idna-3.20 importlib-metadata-8.7.1 jaraco.classes-3.4.0 jaraco.context-6.1.1 jaraco.functools-4.4.0 keyring-25.7.0 markdown-it-py-3.0.0 mdurl-0.1.2 more-itertools-10.8.0 nh3-0.3.7 packaging-26.3 readme-renderer-44.0 requests-2.32.5 requests-toolbelt-1.0.0 rfc3986-2.0.0 rich-15.0.0 twine-6.2.0 urllib3-2.6.3 zipp-3.23.1
01-Oct-2026 18:59:37 WARNING: You are using pip version 21.2.4; however, version 26.0.1 is available.
01-Oct-2026 18:59:37 You should consider upgrading via the '/Users/casaci/bamboohome/xml-data/build-dir/CASASPECS-DEVTESTPY312158-TTOARM15P312/wheeldirectory/casa6testenv/bin/python3 -m pip install --upgrade pip' command.
01-Oct-2026 18:59:37 /Users/casaci/bamboohome/xml-data/build-dir/CASASPECS-DEVTESTPY312158-TTOARM15P312/wheeldirectory/casa6testenv/lib/python3.9/site-packages/urllib3/__init__.py:35: NotOpenSSLWarning: urllib3 v2 only supports OpenSSL 1.1.1+, currently the 'ssl' module is compiled with 'LibreSSL 2.8.3'. See: https://github.com/urllib3/urllib3/issues/3020
01-Oct-2026 18:59:37   warnings.warn(
01-Oct-2026 18:59:37 Uploading distributions to
01-Oct-2026 18:59:37 https://casa-pip.nrao.edu:443/repository/casa-dev-wheel/
01-Oct-2026 18:59:37 Uploading casatools-6.7.7.8a14803.dev1+dirty-cp312-cp312-macosx_15_0_arm64.whl
01-Oct-2026 18:59:37
01-Oct-2026 18:59:38   0% ━━━━━━━━━━━━━━━━━━━━━━━━━━━━━━━━━━━━━━━━ 0.0/72.2 MB • --:-- • ?
01-Oct-2026 18:59:38   7% ━━╸━━━━━━━━━━━━━━━━━━━━━━━━━━━━━━━━━━━━━ 4.8/72.2 MB • 00:01 • 71.0 MB/s
01-Oct-2026 18:59:38 16% ━━━━━━╺━━━━━━━━━━━━━━━━━━━━━━━━━━━━━━━━━ 11.3/72.2 MB • 00:01 • 62.7 MB/s
01-Oct-2026 18:59:38 23% ━━━━━━━━━╺━━━━━━━━━━━━━━━━━━━━━━━━━━━━━━ 16.5/72.2 MB • 00:01 • 64.2 MB/s
01-Oct-2026 18:59:38 29% ━━━━━━━━━━━╺━━━━━━━━━━━━━━━━━━━━━━━━━━━━ 20.6/72.2 MB • 00:02 • 48.5 MB/s
01-Oct-2026 18:59:38 31% ━━━━━━━━━━━━╺━━━━━━━━━━━━━━━━━━━━━━━━━━━ 22.5/72.2 MB • 00:02 • 40.3 MB/s
01-Oct-2026 18:59:38 37% ━━━━━━━━━━━━━━╸━━━━━━━━━━━━━━━━━━━━━━━━━ 26.5/72.2 MB • 00:02 • 37.9 MB/s
01-Oct-2026 18:59:38 43% ━━━━━━━━━━━━━━━━━╺━━━━━━━━━━━━━━━━━━━━━━ 31.0/72.2 MB • 00:02 • 33.7 MB/s
01-Oct-2026 18:59:38 50% ━━━━━━━━━━━━━━━━━━━╸━━━━━━━━━━━━━━━━━━━━ 36.0/72.2 MB • 00:01 • 37.0 MB/s
01-Oct-2026 18:59:39 53% ━━━━━━━━━━━━━━━━━━━━━╺━━━━━━━━━━━━━━━━━━ 38.4/72.2 MB • 00:01 • 36.6 MB/s
01-Oct-2026 18:59:39 60% ━━━━━━━━━━━━━━━━━━━━━━━╸━━━━━━━━━━━━━━━━ 42.9/72.2 MB • 00:01 • 41.0 MB/s
01-Oct-2026 18:59:39 67% ━━━━━━━━━━━━━━━━━━━━━━━━━━╸━━━━━━━━━━━━━ 48.0/72.2 MB • 00:01 • 44.3 MB/s
01-Oct-2026 18:59:39 73% ━━━━━━━━━━━━━━━━━━━━━━━━━━━━━╺━━━━━━━━━━ 52.4/72.2 MB • 00:01 • 35.5 MB/s
01-Oct-2026 18:59:39 77% ━━━━━━━━━━━━━━━━━━━━━━━━━━━━━━╸━━━━━━━━━ 55.3/72.2 MB • 00:01 • 36.4 MB/s
01-Oct-2026 18:59:39 81% ━━━━━━━━━━━━━━━━━━━━━━━━━━━━━━━━╺━━━━━━━ 58.1/72.2 MB • 00:01 • 31.1 MB/s
01-Oct-2026 18:59:39 85% ━━━━━━━━━━━━━━━━━━━━━━━━━━━━━━━━━━╺━━━━━ 61.6/72.2 MB • 00:01 • 34.0 MB/s
01-Oct-2026 18:59:39 91% ━━━━━━━━━━━━━━━━━━━━━━━━━━━━━━━━━━━━╸━━━ 65.8/72.2 MB • 00:01 • 34.1 MB/s
01-Oct-2026 18:59:39 97% ━━━━━━━━━━━━━━━━━━━━━━━━━━━━━━━━━━━━━━╸━ 70.3/72.2 MB • 00:01 • 35.5 MB/s
01-Oct-2026 18:59:40 100% ━━━━━━━━━━━━━━━━━━━━━━━━━━━━━━━━━━━━━━━━ 72.2/72.2 MB • 00:01 • 32.2 MB/s
01-Oct-2026 18:59:40 100% ━━━━━━━━━━━━━━━━━━━━━━━━━━━━━━━━━━━━━━━━ 72.2/72.2 MB • 00:01 • 32.2 MB/s
01-Oct-2026 18:59:40 100% ━━━━━━━━━━━━━━━━━━━━━━━━━━━━━━━━━━━━━━━━ 72.2/72.2 MB • 00:01 • 32.2 MB/s
01-Oct-2026 18:59:40 100% ━━━━━━━━━━━━━━━━━━━━━━━━━━━━━━━━━━━━━━━━ 72.2/72.2 MB • 00:01 • 32.2 MB/s
01-Oct-2026 18:59:40 100% ━━━━━━━━━━━━━━━━━━━━━━━━━━━━━━━━━━━━━━━━ 72.2/72.2 MB • 00:01 • 32.2 MB/s
01-Oct-2026 18:59:40 /Users/casaci/bamboohome/xml-data/build-dir/CASASPECS-DEVTESTPY312158-TTOARM15P312
01-Oct-2026 18:59:40 Finished task 'Upload wheels' with result: Success
01-Oct-2026 18:59:40 Running post build plugin 'Docker Container Cleanup'
01-Oct-2026 18:59:40 Running post build plugin 'NCover Results Collector'
01-Oct-2026 18:59:40 Running post build plugin 'Build Results Label Collector'
01-Oct-2026 18:59:40 Running post build plugin 'Clover Results Collector'
01-Oct-2026 18:59:40 Running post build plugin 'npm Cache Cleanup'
01-Oct-2026 18:59:40 Running post build plugin 'Artifact Copier'
01-Oct-2026 18:59:40 Finalising the build...
01-Oct-2026 18:59:40 Stopping timer.
01-Oct-2026 18:59:40 Build CASASPECS-DEVTESTPY312158-TTOARM15P312-1 completed.
01-Oct-2026 18:59:40 Running on server: post build plugin 'Build Hanging Detection Configuration'
01-Oct-2026 18:59:40 Running on server: post build plugin 'NCover Results Collector'
01-Oct-2026 18:59:40 Running on server: post build plugin 'Build Labeller'
01-Oct-2026 18:59:40 Running on server: post build plugin 'Clover Delta Calculator'
01-Oct-2026 18:59:40 Running on server: post build plugin 'Maven Dependencies Postprocessor'
01-Oct-2026 18:59:40 All post build plugins have finished
01-Oct-2026 18:59:40 Generating build results summary...
01-Oct-2026 18:59:40 Saving build results to disk...
01-Oct-2026 18:59:40 Store variable context...
01-Oct-2026 18:59:40 Finished building CASASPECS-DEVTESTPY312158-TTOARM15P312-1.