Build: #1 failed
Job: Test Tools Many Linux 2.28 Py3.12 was successful
Build log
The build generated 53,658 lines of output. The output is too long and has been truncated to the last 1,000 lines. Download or view full build log.
| 13-Sep-2026 22:50:27 | 2026-09-14 02:50:28 INFO Display::processAntennaPair Going to process requested baseline (0,2) |
| 13-Sep-2026 22:50:27 | 2026-09-14 02:50:28 INFO Display::processAntennaPair Going to process requested baseline (0,3) |
| 13-Sep-2026 22:50:27 | 2026-09-14 02:50:28 INFO Display::processAntennaPair Going to process requested baseline (1,2) |
| 13-Sep-2026 22:50:27 | 2026-09-14 02:50:28 INFO Display::processAntennaPair Going to process requested baseline (1,3) |
| 13-Sep-2026 22:50:27 | 2026-09-14 02:50:28 INFO Display::processAntennaPair Going to process requested baseline (2,3) |
| 13-Sep-2026 22:50:27 | 2026-09-14 02:50:28 INFO Display::getChunkInfo FlagAgentDisplay::getChunkInfo Field : 1 , 3C286_A Spw : 14 Scan : 31 : 31 |
| 13-Sep-2026 22:50:27 | 2026-09-14 02:50:28 INFO Display::processAntennaPair Going to process requested baseline (0,1) |
| 13-Sep-2026 22:50:27 | 2026-09-14 02:50:28 INFO Display::processAntennaPair Going to process requested baseline (0,2) |
| 13-Sep-2026 22:50:27 | 2026-09-14 02:50:28 INFO Display::processAntennaPair Going to process requested baseline (0,3) |
| 13-Sep-2026 22:50:27 | 2026-09-14 02:50:28 INFO Display::processAntennaPair Going to process requested baseline (1,2) |
| 13-Sep-2026 22:50:27 | 2026-09-14 02:50:28 INFO Display::processAntennaPair Going to process requested baseline (1,3) |
| 13-Sep-2026 22:50:27 | 2026-09-14 02:50:28 INFO Display::processAntennaPair Going to process requested baseline (2,3) |
| 13-Sep-2026 22:50:27 | 2026-09-14 02:50:28 INFO FlagMSHandler:: Chunk = 32 [progress: 100%], Observation = 0, Array = 0, Scan = 31, Field = 1 (3C286_A), Spw = 15, Channels = 64, Corrs = [ RR RL LR LL ], Total Rows = 540 |
| 13-Sep-2026 22:50:27 | 2026-09-14 02:50:28 INFO Display::getChunkInfo FlagAgentDisplay::getChunkInfo Field : 1 , 3C286_A Spw : 15 Scan : 31 : 31 |
| 13-Sep-2026 22:50:27 | 2026-09-14 02:50:28 INFO Display::processAntennaPair Going to process requested baseline (0,1) |
| 13-Sep-2026 22:50:27 | 2026-09-14 02:50:28 INFO Display::processAntennaPair Going to process requested baseline (0,2) |
| 13-Sep-2026 22:50:27 | 2026-09-14 02:50:28 INFO Display::processAntennaPair Going to process requested baseline (0,3) |
| 13-Sep-2026 22:50:27 | 2026-09-14 02:50:28 INFO Display::processAntennaPair Going to process requested baseline (1,2) |
| 13-Sep-2026 22:50:27 | 2026-09-14 02:50:28 INFO Display::processAntennaPair Going to process requested baseline (1,3) |
| 13-Sep-2026 22:50:27 | 2026-09-14 02:50:28 INFO Display::processAntennaPair Going to process requested baseline (2,3) |
| 13-Sep-2026 22:50:27 | 2026-09-14 02:50:28 INFO Manual::chunkSummary => Data flagged so far 32.8125% (136080/414720) |
| 13-Sep-2026 22:50:27 | 2026-09-14 02:50:28 INFO FlagMSHandler::nextChunk ==================================================================================== |
| 13-Sep-2026 22:50:27 | 2026-09-14 02:50:28 INFO Manual::tableSummary => Percentage of data flagged in table selection: 32.8125% |
| 13-Sep-2026 22:50:27 | 2026-09-14 02:50:28 INFO AgentFlagger::run => Writing flags to the MS |
| 13-Sep-2026 22:50:27 | 2026-09-14 02:50:28 INFO Summary::getResult observation 0 flagged: 1.44346e+06 total: 4.3991e+06 (32.8%) |
| 13-Sep-2026 22:50:27 | 2026-09-14 02:50:28 INFO Summary::getResult scan 31 flagged: 725760 total: 2.21184e+06 (32.8%) |
| 13-Sep-2026 22:50:27 | 2026-09-14 02:50:28 INFO Summary::getResult scan 30 flagged: 717696 total: 2.18726e+06 (32.8%) |
| 13-Sep-2026 22:50:27 | 2026-09-14 02:50:28 INFO Summary::getResult antenna ea24 flagged: 721728 total: 2.19955e+06 (32.8%) |
| 13-Sep-2026 22:50:27 | 2026-09-14 02:50:28 INFO Summary::getResult antenna ea19 flagged: 721728 total: 2.19955e+06 (32.8%) |
| 13-Sep-2026 22:50:27 | 2026-09-14 02:50:28 INFO Summary::getResult antenna ea01 flagged: 721728 total: 2.19955e+06 (32.8%) |
| 13-Sep-2026 22:50:27 | 2026-09-14 02:50:28 INFO Summary::getResult antenna ea11 flagged: 721728 total: 2.19955e+06 (32.8%) |
| 13-Sep-2026 22:50:27 | 2026-09-14 02:50:28 INFO Summary::getResult field 3C286_A flagged: 1.44346e+06 total: 4.3991e+06 (32.8%) |
| 13-Sep-2026 22:50:27 | 2026-09-14 02:50:28 INFO Summary::getResult spw 15 flagged: 90216 total: 274944 (32.8%) |
| 13-Sep-2026 22:50:27 | 2026-09-14 02:50:28 INFO Summary::getResult spw 14 flagged: 90216 total: 274944 (32.8%) |
| 13-Sep-2026 22:50:27 | 2026-09-14 02:50:28 INFO Summary::getResult spw 10 flagged: 90216 total: 274944 (32.8%) |
| 13-Sep-2026 22:50:27 | 2026-09-14 02:50:28 INFO Summary::getResult spw 7 flagged: 90216 total: 274944 (32.8%) |
| 13-Sep-2026 22:50:27 | 2026-09-14 02:50:28 INFO Summary::getResult spw 12 flagged: 90216 total: 274944 (32.8%) |
| 13-Sep-2026 22:50:27 | 2026-09-14 02:50:28 INFO Summary::getResult spw 6 flagged: 90216 total: 274944 (32.8%) |
| 13-Sep-2026 22:50:27 | 2026-09-14 02:50:28 INFO Summary::getResult spw 8 flagged: 90216 total: 274944 (32.8%) |
| 13-Sep-2026 22:50:27 | 2026-09-14 02:50:28 INFO Summary::getResult spw 5 flagged: 90216 total: 274944 (32.8%) |
| 13-Sep-2026 22:50:27 | 2026-09-14 02:50:28 INFO Summary::getResult spw 0 flagged: 90216 total: 274944 (32.8%) |
| 13-Sep-2026 22:50:27 | 2026-09-14 02:50:28 INFO Summary::getResult spw 11 flagged: 90216 total: 274944 (32.8%) |
| 13-Sep-2026 22:50:27 | 2026-09-14 02:50:28 INFO Summary::getResult spw 9 flagged: 90216 total: 274944 (32.8%) |
| 13-Sep-2026 22:50:27 | 2026-09-14 02:50:28 INFO Summary::getResult spw 4 flagged: 90216 total: 274944 (32.8%) |
| 13-Sep-2026 22:50:27 | 2026-09-14 02:50:28 INFO Summary::getResult spw 1 flagged: 90216 total: 274944 (32.8%) |
| 13-Sep-2026 22:50:27 | 2026-09-14 02:50:28 INFO Summary::getResult spw 2 flagged: 90216 total: 274944 (32.8%) |
| 13-Sep-2026 22:50:27 | 2026-09-14 02:50:28 INFO Summary::getResult spw 13 flagged: 90216 total: 274944 (32.8%) |
| 13-Sep-2026 22:50:27 | 2026-09-14 02:50:28 INFO Summary::getResult spw 3 flagged: 90216 total: 274944 (32.8%) |
| 13-Sep-2026 22:50:27 | 2026-09-14 02:50:28 INFO Summary::getResult correlation LL flagged: 360864 total: 1.09978e+06 (32.8%) |
| 13-Sep-2026 22:50:27 | 2026-09-14 02:50:28 INFO Summary::getResult correlation LR flagged: 360864 total: 1.09978e+06 (32.8%) |
| 13-Sep-2026 22:50:27 | 2026-09-14 02:50:28 INFO Summary::getResult correlation RR flagged: 360864 total: 1.09978e+06 (32.8%) |
| 13-Sep-2026 22:50:27 | 2026-09-14 02:50:28 INFO Summary::getResult correlation RL flagged: 360864 total: 1.09978e+06 (32.8%) |
| 13-Sep-2026 22:50:27 | 2026-09-14 02:50:28 INFO Summary::getResult array 0 flagged: 1.44346e+06 total: 4.3991e+06 (32.8%) |
| 13-Sep-2026 22:50:27 | 2026-09-14 02:50:28 INFO Summary::getResult Total Flagged: 1.44346e+06 Total Counts: 4.3991e+06 (32.8%) |
| 13-Sep-2026 22:50:27 | 2026-09-14 02:50:28 INFO Display::displayReports Report Displays are turned OFF |
| 13-Sep-2026 22:50:27 | test_tool_agentflagger.py::test_display::test_display_data_single_channel_selection |
| 13-Sep-2026 22:50:27 | AgentFlagger:: Check nominal behaviour for single spw:chan selection |
| 13-Sep-2026 22:50:27 | The MS is already around, just unflag |
| 13-Sep-2026 22:50:27 | PASSED |
| 13-Sep-2026 22:50:27 | |
| 13-Sep-2026 22:50:27 | 2026-09-14 02:50:28 INFO AgentFlagger::open Table type is Measurement Set |
| 13-Sep-2026 22:50:27 | 2026-09-14 02:50:28 INFO AgentFlagger::initAgents There are initially 1 agents in the list. Agents: unflag |
| 13-Sep-2026 22:50:27 | 2026-09-14 02:50:28 INFO AgentFlagger::initAgents There are 1 valid agents in the list. Agents: unflag |
| 13-Sep-2026 22:50:27 | 2026-09-14 02:50:28 INFO FlagMSHandler:: Chunk = 1 [progress: 6%], Observation = 0, Array = 0, Scan = 1, Field = 0 (r aqr), Spw = 0, Channels = 4, Corrs = [ XX ], Total Rows = 1 |
| 13-Sep-2026 22:50:27 | 2026-09-14 02:50:28 INFO FlagMSHandler:: Chunk = 2 [progress: 13%], Observation = 0, Array = 0, Scan = 1, Field = 0 (r aqr), Spw = 1, Channels = 512, Corrs = [ XX YY ], Total Rows = 1 |
| 13-Sep-2026 22:50:27 | 2026-09-14 02:50:28 INFO Unflag::chunkSummary => Data unflagged so far 100% (1028/1028) |
| 13-Sep-2026 22:50:27 | 2026-09-14 02:50:28 INFO FlagMSHandler:: Chunk = 3 [progress: 20%], Observation = 0, Array = 0, Scan = 1, Field = 0 (r aqr), Spw = 2, Channels = 1, Corrs = [ XX YY ], Total Rows = 1 |
| 13-Sep-2026 22:50:27 | 2026-09-14 02:50:28 INFO Unflag::chunkSummary => Data unflagged so far 100% (2/2) |
| 13-Sep-2026 22:50:27 | 2026-09-14 02:50:28 INFO FlagMSHandler:: Chunk = 5 [progress: 33%], Observation = 0, Array = 0, Scan = 1, Field = 0 (r aqr), Spw = 4, Channels = 1, Corrs = [ XX YY ], Total Rows = 1 |
| 13-Sep-2026 22:50:27 | 2026-09-14 02:50:28 INFO Unflag::chunkSummary => Data unflagged so far 100% (1026/1026) |
| 13-Sep-2026 22:50:27 | 2026-09-14 02:50:28 INFO FlagMSHandler:: Chunk = 6 [progress: 40%], Observation = 0, Array = 0, Scan = 2, Field = 0 (r aqr), Spw = 0, Channels = 4, Corrs = [ XX ], Total Rows = 1 |
| 13-Sep-2026 22:50:27 | 2026-09-14 02:50:28 INFO Unflag::chunkSummary => Data unflagged so far 100% (4/4) |
| 13-Sep-2026 22:50:27 | 2026-09-14 02:50:28 INFO FlagMSHandler:: Chunk = 8 [progress: 53%], Observation = 0, Array = 0, Scan = 2, Field = 0 (r aqr), Spw = 6, Channels = 1, Corrs = [ XX YY ], Total Rows = 1 |
| 13-Sep-2026 22:50:27 | 2026-09-14 02:50:28 INFO Unflag::chunkSummary => Data unflagged so far 100% (2050/2050) |
| 13-Sep-2026 22:50:27 | 2026-09-14 02:50:28 INFO FlagMSHandler:: Chunk = 9 [progress: 60%], Observation = 0, Array = 0, Scan = 2, Field = 0 (r aqr), Spw = 7, Channels = 2048, Corrs = [ XX YY ], Total Rows = 1 |
| 13-Sep-2026 22:50:27 | 2026-09-14 02:50:28 INFO Unflag::chunkSummary => Data unflagged so far 100% (4096/4096) |
| 13-Sep-2026 22:50:27 | 2026-09-14 02:50:28 INFO FlagMSHandler:: Chunk = 11 [progress: 73%], Observation = 0, Array = 0, Scan = 3, Field = 0 (r aqr), Spw = 0, Channels = 4, Corrs = [ XX ], Total Rows = 1 |
| 13-Sep-2026 22:50:27 | 2026-09-14 02:50:28 INFO Unflag::chunkSummary => Data unflagged so far 100% (6/6) |
| 13-Sep-2026 22:50:27 | 2026-09-14 02:50:28 INFO FlagMSHandler:: Chunk = 12 [progress: 80%], Observation = 0, Array = 0, Scan = 3, Field = 0 (r aqr), Spw = 5, Channels = 1024, Corrs = [ XX YY ], Total Rows = 1 |
| 13-Sep-2026 22:50:27 | 2026-09-14 02:50:28 INFO Unflag::chunkSummary => Data unflagged so far 100% (2048/2048) |
| 13-Sep-2026 22:50:27 | 2026-09-14 02:50:28 INFO FlagMSHandler:: Chunk = 14 [progress: 93%], Observation = 0, Array = 0, Scan = 3, Field = 0 (r aqr), Spw = 7, Channels = 2048, Corrs = [ XX YY ], Total Rows = 1 |
| 13-Sep-2026 22:50:27 | 2026-09-14 02:50:28 INFO Unflag::chunkSummary => Data unflagged so far 100% (4098/4098) |
| 13-Sep-2026 22:50:27 | 2026-09-14 02:50:28 INFO FlagMSHandler:: Chunk = 15 [progress: 100%], Observation = 0, Array = 0, Scan = 3, Field = 0 (r aqr), Spw = 8, Channels = 1, Corrs = [ XX YY ], Total Rows = 1 |
| 13-Sep-2026 22:50:27 | 2026-09-14 02:50:28 INFO Unflag::chunkSummary => Data unflagged so far 100% (2/2) |
| 13-Sep-2026 22:50:27 | 2026-09-14 02:50:28 INFO FlagMSHandler::nextChunk ==================================================================================== |
| 13-Sep-2026 22:50:27 | 2026-09-14 02:50:28 INFO Unflag::tableSummary => Percentage of data un-flagged in table selection: 100% |
| 13-Sep-2026 22:50:27 | 2026-09-14 02:50:28 INFO AgentFlagger::run => Writing flags to the MS |
| 13-Sep-2026 22:50:27 | 2026-09-14 02:50:28 INFO AgentFlagger::open Table type is Measurement Set |
| 13-Sep-2026 22:50:27 | 2026-09-14 02:50:28 INFO FlagMSHandler::selectData Selected spw-channels ids are Axis Lengths: [4, 4] (NB: Matrix in Row/Column order) |
| 13-Sep-2026 22:50:27 | 2026-09-14 02:50:28 INFO FlagMSHandler::selectData + [1, 0, 511, 1 |
| 13-Sep-2026 22:50:27 | 2026-09-14 02:50:28 INFO FlagMSHandler::selectData + 2, 0, 0, 1 |
| 13-Sep-2026 22:50:27 | 2026-09-14 02:50:28 INFO FlagMSHandler::selectData + 3, 0, 511, 1 |
| 13-Sep-2026 22:50:27 | 2026-09-14 02:50:28 INFO FlagMSHandler::selectData + 4, 0, 0, 1] |
| 13-Sep-2026 22:50:27 | 2026-09-14 02:50:28 INFO AgentFlagger::initAgents There are initially 3 agents in the list. Agents: manual, summary, display |
| 13-Sep-2026 22:50:27 | 2026-09-14 02:50:28 INFO Manual::setAgentParameters autocorr is 0 |
| 13-Sep-2026 22:50:27 | 2026-09-14 02:50:28 INFO Display::setAgentParameters data column is FLOAT_DATA |
| 13-Sep-2026 22:50:27 | 2026-09-14 02:50:28 INFO Display::setAgentParameters Visibility expression is REAL XX,YY |
| 13-Sep-2026 22:50:27 | 2026-09-14 02:50:28 INFO Display::setAgentParameters pause is 0 |
| 13-Sep-2026 22:50:27 | 2026-09-14 02:50:28 INFO Display::setAgentParameters datadisplay is 1 |
| 13-Sep-2026 22:50:27 | 2026-09-14 02:50:28 INFO Display::setAgentParameters reportdisplay is 0 |
| 13-Sep-2026 22:50:27 | 2026-09-14 02:50:28 INFO Display::setAgentParameters format is screen |
| 13-Sep-2026 22:50:27 | 2026-09-14 02:50:28 INFO AgentFlagger::initAgents There are 3 valid agents in the list. Agents: manual, summary, display |
| 13-Sep-2026 22:50:27 | 2026-09-14 02:50:28 INFO FlagDataHandler::preLoadColumn Setting row blocking to number of rows in selected table: 4 |
| 13-Sep-2026 22:50:27 | 2026-09-14 02:50:28 INFO FlagMSHandler:: Chunk = 1 [progress: 25%], Observation = 0, Array = 0, Scan = 1, Field = 0 (r aqr), Spw = 1, Channels = 512, Corrs = [ XX YY ], Total Rows = 1 |
| 13-Sep-2026 22:50:27 | 2026-09-14 02:50:28 INFO Display::getChunkInfo FlagAgentDisplay::getChunkInfo Field : 0 , r aqr Spw : 1 Scan : 1 : 1 |
| 13-Sep-2026 22:50:27 | 2026-09-14 02:50:28 INFO Display::processAntennaPair Going to process requested baseline (0,0) |
| 13-Sep-2026 22:50:27 | /home/casatest/venv/bin/python3.12: No module named casaplotserver |
| 13-Sep-2026 22:50:27 | 2026-09-14 02:50:28 INFO Manual::chunkSummary => Data flagged so far 100% (1024/1024) |
| 13-Sep-2026 22:50:27 | 2026-09-14 02:50:28 INFO FlagMSHandler:: Chunk = 2 [progress: 50%], Observation = 0, Array = 0, Scan = 1, Field = 0 (r aqr), Spw = 2, Channels = 1, Corrs = [ XX YY ], Total Rows = 1 |
| 13-Sep-2026 22:50:27 | 2026-09-14 02:50:28 INFO Display::getChunkInfo FlagAgentDisplay::getChunkInfo Field : 0 , r aqr Spw : 2 Scan : 1 : 1 |
| 13-Sep-2026 22:50:27 | 2026-09-14 02:50:28 INFO Display::processAntennaPair Going to process requested baseline (0,0) |
| 13-Sep-2026 22:50:27 | 2026-09-14 02:50:28 INFO Manual::chunkSummary => Data flagged so far 100% (2/2) |
| 13-Sep-2026 22:50:27 | 2026-09-14 02:50:28 INFO FlagMSHandler:: Chunk = 3 [progress: 75%], Observation = 0, Array = 0, Scan = 1, Field = 0 (r aqr), Spw = 3, Channels = 512, Corrs = [ XX YY ], Total Rows = 1 |
| 13-Sep-2026 22:50:27 | 2026-09-14 02:50:28 INFO Display::getChunkInfo FlagAgentDisplay::getChunkInfo Field : 0 , r aqr Spw : 3 Scan : 1 : 1 |
| 13-Sep-2026 22:50:27 | 2026-09-14 02:50:28 INFO Display::processAntennaPair Going to process requested baseline (0,0) |
| 13-Sep-2026 22:50:27 | 2026-09-14 02:50:28 INFO Manual::chunkSummary => Data flagged so far 100% (1024/1024) |
| 13-Sep-2026 22:50:27 | 2026-09-14 02:50:28 INFO FlagMSHandler:: Chunk = 4 [progress: 100%], Observation = 0, Array = 0, Scan = 1, Field = 0 (r aqr), Spw = 4, Channels = 1, Corrs = [ XX YY ], Total Rows = 1 |
| 13-Sep-2026 22:50:27 | 2026-09-14 02:50:28 INFO Display::getChunkInfo FlagAgentDisplay::getChunkInfo Field : 0 , r aqr Spw : 4 Scan : 1 : 1 |
| 13-Sep-2026 22:50:27 | 2026-09-14 02:50:28 INFO Display::processAntennaPair Going to process requested baseline (0,0) |
| 13-Sep-2026 22:50:27 | 2026-09-14 02:50:28 INFO Manual::chunkSummary => Data flagged so far 100% (2/2) |
| 13-Sep-2026 22:50:27 | 2026-09-14 02:50:28 INFO FlagMSHandler::nextChunk ==================================================================================== |
| 13-Sep-2026 22:50:27 | 2026-09-14 02:50:28 INFO Manual::tableSummary => Percentage of data flagged in table selection: 100% |
| 13-Sep-2026 22:50:27 | 2026-09-14 02:50:28 INFO AgentFlagger::run => Writing flags to the MS |
| 13-Sep-2026 22:50:27 | 2026-09-14 02:50:28 INFO Summary::getResult observation 0 flagged: 2052 total: 2052 (100%) |
| 13-Sep-2026 22:50:27 | 2026-09-14 02:50:28 INFO Summary::getResult scan 1 flagged: 2052 total: 2052 (100%) |
| 13-Sep-2026 22:50:27 | 2026-09-14 02:50:28 INFO Summary::getResult antenna PM04 flagged: 2052 total: 2052 (100%) |
| 13-Sep-2026 22:50:27 | 2026-09-14 02:50:28 INFO Summary::getResult field r aqr flagged: 2052 total: 2052 (100%) |
| 13-Sep-2026 22:50:27 | 2026-09-14 02:50:28 INFO Summary::getResult spw 4 flagged: 2 total: 2 (100%) |
| 13-Sep-2026 22:50:27 | 2026-09-14 02:50:28 INFO Summary::getResult spw 3 flagged: 1024 total: 1024 (100%) |
| 13-Sep-2026 22:50:27 | 2026-09-14 02:50:28 INFO Summary::getResult spw 1 flagged: 1024 total: 1024 (100%) |
| 13-Sep-2026 22:50:27 | 2026-09-14 02:50:28 INFO Summary::getResult spw 2 flagged: 2 total: 2 (100%) |
| 13-Sep-2026 22:50:27 | 2026-09-14 02:50:28 INFO Summary::getResult correlation YY flagged: 1026 total: 1026 (100%) |
| 13-Sep-2026 22:50:27 | 2026-09-14 02:50:28 INFO Summary::getResult correlation XX flagged: 1026 total: 1026 (100%) |
| 13-Sep-2026 22:50:27 | 2026-09-14 02:50:28 INFO Summary::getResult array 0 flagged: 2052 total: 2052 (100%) |
| 13-Sep-2026 22:50:27 | 2026-09-14 02:50:28 INFO Summary::getResult Total Flagged: 2052 Total Counts: 2052 (100%) |
| 13-Sep-2026 22:50:27 | 2026-09-14 02:50:28 INFO Display::displayReports Report Displays are turned OFF |
| 13-Sep-2026 22:50:27 | test_tool_agentflagger.py::test_display::test_display_float_data |
| 13-Sep-2026 22:50:27 | AgentFlagger: Select spw, display and flag single-dish MS |
| 13-Sep-2026 22:50:27 | Moving data... |
| 13-Sep-2026 22:50:27 | PASSED |
| 13-Sep-2026 22:50:27 | |
| 13-Sep-2026 22:50:27 | - generated xml file: /home/casatest/casa6/casatestutils/nosedir/xml/test_tool_agentflagger/nose.xml - |
| 13-Sep-2026 22:50:27 | ======================== 35 passed, 1 warning in 39.48s ======================== |
| 13-Sep-2026 22:50:28 | ============================= test session starts ============================== |
| 13-Sep-2026 22:50:28 | platform linux -- Python 3.12.9, pytest-9.1.1, pluggy-1.6.0 -- /home/casatest/venv/bin/python3.12 |
| 13-Sep-2026 22:50:28 | cachedir: .pytest_cache |
| 13-Sep-2026 22:50:28 | rootdir: /home/casatest/casa6/casatestutils/nosedir/test_tool_imagepol |
| 13-Sep-2026 22:50:28 | configfile: pytest.ini |
| 13-Sep-2026 22:50:28 | collecting ... collected 17 items |
| 13-Sep-2026 22:50:28 | |
| 13-Sep-2026 22:50:28 | |
| 13-Sep-2026 22:50:28 | 2026-09-14 02:50:28 INFO ImageFITSConverter::readBeamsTable Loading multiple beams from BEAMS table |
| 13-Sep-2026 22:50:28 | 2026-09-14 02:50:28 INFO imagepol::complexFractionalLinearPolarization(...) Creating image 'g' of shape [10, 10, 10, 1] |
| 13-Sep-2026 22:50:28 | 2026-09-14 02:50:28 INFO ImageFITSConverter::readBeamsTable Loading multiple beams from BEAMS table |
| 13-Sep-2026 22:50:28 | 2026-09-14 02:50:28 INFO imagepol::complexFractionalLinearPolarization(...) Creating image 'hh' of shape [10, 10, 10, 1] |
| 13-Sep-2026 22:50:28 | 2026-09-14 02:50:28 SEVERE imagepol::complexfraclinpol Exception Reported: Exception: Input image has multiple beams and the corresponding beams for the stokes planes necessary for this computation are not equal.. |
| 13-Sep-2026 22:50:28 | 2026-09-14 02:50:28 SEVERE imagepol::complexfraclinpol+ ... thrown by casacore::Bool casa::ImagePolarimetry::_checkBeams(const std::vector<casa::ImagePolarimetry::StokesTypes>&, casacore::Bool, casacore::Bool) const at File: /source/casa6/casatools/src/code/imageanalysis/ImageAnalysis/ImagePolarimetry.cc, line: 1626 |
| 13-Sep-2026 22:50:28 | test_tool_imagepol.py::po_complexfraclinpol_test::test_multibeam |
| 13-Sep-2026 22:50:28 | Test multibeam images for correct behavior |
| 13-Sep-2026 22:50:28 | pol_eq_beams.fits |
| 13-Sep-2026 22:50:28 | PASSED |
| 13-Sep-2026 22:50:28 | |
| 13-Sep-2026 22:50:28 | 2026-09-14 02:50:28 INFO ImageFITSConverter::readBeamsTable Loading multiple beams from BEAMS table |
| 13-Sep-2026 22:50:28 | 2026-09-14 02:50:28 INFO ImagePolProxy::complexlinpol Creating image 'g' of shape [10, 10, 10, 1] |
| 13-Sep-2026 22:50:28 | 2026-09-14 02:50:28 INFO ImageFITSConverter::readBeamsTable Loading multiple beams from BEAMS table |
| 13-Sep-2026 22:50:28 | 2026-09-14 02:50:28 INFO ImagePolProxy::complexlinpol Creating image 'hh' of shape [10, 10, 10, 1] |
| 13-Sep-2026 22:50:28 | 2026-09-14 02:50:28 SEVERE imagepol::complexlinpol Exception Reported: Exception: Input image has multiple beams and the corresponding beams for the stokes planes necessary for this computation are not equal.. |
| 13-Sep-2026 22:50:28 | 2026-09-14 02:50:28 SEVERE imagepol::complexlinpol+ ... thrown by casacore::Bool casa::ImagePolarimetry::_checkBeams(const std::vector<casa::ImagePolarimetry::StokesTypes>&, casacore::Bool, casacore::Bool) const at File: /source/casa6/casatools/src/code/imageanalysis/ImageAnalysis/ImagePolarimetry.cc, line: 1626 |
| 13-Sep-2026 22:50:28 | 2026-09-14 02:50:28 INFO name:: No table opened. |
| 13-Sep-2026 22:50:28 | 2026-09-14 02:50:28 INFO showcache:: The Table Cache is empty. |
| 13-Sep-2026 22:50:28 | test_tool_imagepol.py::po_complexlinpol_test::test_multibeam |
| 13-Sep-2026 22:50:28 | Test multibeam images for correct behavior |
| 13-Sep-2026 22:50:28 | PASSED |
| 13-Sep-2026 22:50:28 | |
| 13-Sep-2026 22:50:28 | 2026-09-14 02:50:28 INFO ImageFITSConverter::readBeamsTable Loading multiple beams from BEAMS table |
| 13-Sep-2026 22:50:28 | 2026-09-14 02:50:28 INFO ImageFITSConverter::readBeamsTable Loading multiple beams from BEAMS table |
| 13-Sep-2026 22:50:28 | 2026-09-14 02:50:28 INFO ImageFITSConverter::readBeamsTable Loading multiple beams from BEAMS table |
| 13-Sep-2026 22:50:28 | 2026-09-14 02:50:28 INFO ImageFITSConverter::readBeamsTable Loading multiple beams from BEAMS table |
| 13-Sep-2026 22:50:28 | 2026-09-14 02:50:28 SEVERE imagepol::depolratio Exception Reported: Exception: Input image has multiple beams and the corresponding beams for the stokes planes necessary for this computation are not equal.. |
| 13-Sep-2026 22:50:28 | 2026-09-14 02:50:28 SEVERE imagepol::depolratio+ ... thrown by casacore::Bool casa::ImagePolarimetry::_checkBeams(const std::vector<casa::ImagePolarimetry::StokesTypes>&, casacore::Bool, casacore::Bool) const at File: /source/casa6/casatools/src/code/imageanalysis/ImageAnalysis/ImagePolarimetry.cc, line: 1626 |
| 13-Sep-2026 22:50:28 | 2026-09-14 02:50:28 INFO ImageFITSConverter::readBeamsTable Loading multiple beams from BEAMS table |
| 13-Sep-2026 22:50:28 | 2026-09-14 02:50:28 SEVERE imagepol::depolratio Exception Reported: Exception: Input image has multiple beams and the corresponding beams for the stokes planes necessary for this computation are not equal.. |
| 13-Sep-2026 22:50:28 | 2026-09-14 02:50:28 SEVERE imagepol::depolratio+ ... thrown by casacore::Bool casa::ImagePolarimetry::_checkBeams(const std::vector<casa::ImagePolarimetry::StokesTypes>&, casacore::Bool, casacore::Bool) const at File: /source/casa6/casatools/src/code/imageanalysis/ImageAnalysis/ImagePolarimetry.cc, line: 1626 |
| 13-Sep-2026 22:50:28 | test_tool_imagepol.py::po_depolratio_test::test_multibeam |
| 13-Sep-2026 22:50:28 | Test multibeam images for correct behavior |
| 13-Sep-2026 22:50:28 | pol_eq_beams.fits |
| 13-Sep-2026 22:50:28 | PASSED |
| 13-Sep-2026 22:50:28 | |
| 13-Sep-2026 22:50:28 | 2026-09-14 02:50:28 INFO ImageFITSConverter::readBeamsTable Loading multiple beams from BEAMS table |
| 13-Sep-2026 22:50:28 | 2026-09-14 02:50:28 SEVERE imagepol::fourierRotationMeasure (file /source/casa6/casatools/src/code/imageanalysis/ImageAnalysis/ImagePolProxy.cc, line 623) Cannot run fourierRotationMeasure on an image with multiple beams |
| 13-Sep-2026 22:50:28 | 2026-09-14 02:50:28 SEVERE imagepol::fourierrotationmeasure Exception Reported: 2026-09-14 02:50:28 SEVERE imagepol::fourierRotationMeasure (file /source/casa6/casatools/src/code/imageanalysis/ImageAnalysis/ImagePolProxy.cc, line 623) Cannot run fourierRotationMeasure on an image with multiple beams |
| 13-Sep-2026 22:50:28 | 2026-09-14 02:50:28 INFO ImageFITSConverter::readBeamsTable Loading multiple beams from BEAMS table |
| 13-Sep-2026 22:50:28 | 2026-09-14 02:50:29 SEVERE imagepol::fourierRotationMeasure (file /source/casa6/casatools/src/code/imageanalysis/ImageAnalysis/ImagePolProxy.cc, line 623) Cannot run fourierRotationMeasure on an image with multiple beams |
| 13-Sep-2026 22:50:28 | 2026-09-14 02:50:29 SEVERE imagepol::fourierrotationmeasure Exception Reported: 2026-09-14 02:50:29 SEVERE imagepol::fourierRotationMeasure (file /source/casa6/casatools/src/code/imageanalysis/ImageAnalysis/ImagePolProxy.cc, line 623) Cannot run fourierRotationMeasure on an image with multiple beams |
| 13-Sep-2026 22:50:28 | test_tool_imagepol.py::po_fourierrotationmeasure_test::test_multibeam |
| 13-Sep-2026 22:50:28 | Test multibeam images for correct behavior |
| 13-Sep-2026 22:50:28 | pol_eq_beams.fits |
| 13-Sep-2026 22:50:28 | PASSED |
| 13-Sep-2026 22:50:28 | |
| 13-Sep-2026 22:50:28 | 2026-09-14 02:50:29 INFO ImageFITSConverter::readBeamsTable Loading multiple beams from BEAMS table |
| 13-Sep-2026 22:50:28 | 2026-09-14 02:50:29 INFO ImagePolarimetry::sigma Determined noise from V image to be 1.0119 |
| 13-Sep-2026 22:50:28 | 2026-09-14 02:50:29 INFO ImagePolarimetry::fracLinPol Debiasing with sigma = 1.0119 |
| 13-Sep-2026 22:50:28 | 2026-09-14 02:50:29 INFO ImageFITSConverter::readBeamsTable Loading multiple beams from BEAMS table |
| 13-Sep-2026 22:50:28 | test_tool_imagepol.py::po_fraclinpol_test::test_multibeam |
| 13-Sep-2026 22:50:28 | Test multibeam images for correct behavior |
| 13-Sep-2026 22:50:28 | pol_eq_beams.fits |
| 13-Sep-2026 22:50:28 | PASSED |
| 13-Sep-2026 22:50:28 | |
| 13-Sep-2026 22:50:28 | 2026-09-14 02:50:29 INFO ImageFITSConverter::readBeamsTable Loading multiple beams from BEAMS table |
| 13-Sep-2026 22:50:28 | 2026-09-14 02:50:29 INFO ImagePolarimetry::sigma Determined noise from V image to be 1.0119 |
| 13-Sep-2026 22:50:28 | 2026-09-14 02:50:29 INFO ImagePolarimetry::fracTotPol Debiasing with sigma = 1.0119 |
| 13-Sep-2026 22:50:28 | 2026-09-14 02:50:29 INFO ImageFITSConverter::readBeamsTable Loading multiple beams from BEAMS table |
| 13-Sep-2026 22:50:28 | test_tool_imagepol.py::po_fractotpol_test::test_multibeam |
| 13-Sep-2026 22:50:28 | Test multibeam images for correct behavior |
| 13-Sep-2026 22:50:28 | pol_eq_beams.fits |
| 13-Sep-2026 22:50:28 | PASSED |
| 13-Sep-2026 22:50:28 | |
| 13-Sep-2026 22:50:28 | 2026-09-14 02:50:29 INFO ImageFITSConverter::readBeamsTable Loading multiple beams from BEAMS table |
| 13-Sep-2026 22:50:28 | 2026-09-14 02:50:29 INFO ImagePolTask::_sigma Determined noise from V image to be 1.0119 |
| 13-Sep-2026 22:50:28 | 2026-09-14 02:50:29 INFO ImagePolTask::_sigma Debiasing with sigma = 1.0119 |
| 13-Sep-2026 22:50:28 | 2026-09-14 02:50:29 INFO ImageFITSConverter::readBeamsTable Loading multiple beams from BEAMS table |
| 13-Sep-2026 22:50:28 | test_tool_imagepol.py::po_linpolint_test::test_multibeam |
| 13-Sep-2026 22:50:28 | Test multibeam images for correct behavior |
| 13-Sep-2026 22:50:28 | pol_eq_beams.fits |
| 13-Sep-2026 22:50:28 | PASSED |
| 13-Sep-2026 22:50:28 | |
| 13-Sep-2026 22:50:28 | 2026-09-14 02:50:29 INFO ImageFITSConverter::readBeamsTable Loading multiple beams from BEAMS table |
| 13-Sep-2026 22:50:28 | 2026-09-14 02:50:29 WARN LinearPolarizationAngleCalculator::compute (file /source/casa6/casatools/src/code/imageanalysis/ImageAnalysis/LinearPolarizationAngleCalculator.cc, line 40) The input image has multiple beams. Because these beams can vary with stokes/polarization, they will not be copied to the output image |
| 13-Sep-2026 22:50:28 | 2026-09-14 02:50:29 INFO SubImageFactory::createImage Creating image 'g' of shape [10, 10, 10, 1] |
| 13-Sep-2026 22:50:28 | 2026-09-14 02:50:29 INFO ImageFITSConverter::readBeamsTable Loading multiple beams from BEAMS table |
| 13-Sep-2026 22:50:28 | 2026-09-14 02:50:29 SEVERE imagepol::linpolposang Exception Reported: Exception: Input image has multiple beams and the corresponding beams for the stokes planes necessary for this computation are not equal.. |
| 13-Sep-2026 22:50:28 | 2026-09-14 02:50:29 SEVERE imagepol::linpolposang+ ... thrown by casacore::Bool casa::ImagePolTask::_checkBeams(const std::vector<casa::ImagePolTask::StokesTypes>&, casacore::Bool, casacore::Bool) const at File: /source/casa6/casatools/src/code/imageanalysis/ImageAnalysis/ImagePolTask.cc, line: 79 |
| 13-Sep-2026 22:50:28 | test_tool_imagepol.py::po_linpolposang_test::test_multibeam |
| 13-Sep-2026 22:50:28 | Test multibeam images for correct behavior |
| 13-Sep-2026 22:50:28 | pol_eq_beams.fits |
| 13-Sep-2026 22:50:28 | PASSED |
| 13-Sep-2026 22:50:28 | |
| 13-Sep-2026 22:50:28 | 2026-09-14 02:50:29 INFO ImageFactory::createImage Created Paged image 'rm_input.im' of shape [20, 20, 4, 20] with float valued pixels. |
| 13-Sep-2026 22:50:28 | 2026-09-14 02:50:29 INFO ImagePol::rotationMeasure Creating image 'rm.im' of shape [20, 20] |
| 13-Sep-2026 22:50:28 | 2026-09-14 02:50:29 INFO ImagePol::rotationMeasure Creating image 'pa0.im' of shape [20, 20, 1] |
| 13-Sep-2026 22:50:28 | 2026-09-14 02:50:29 INFO image::statistics Determining stats for image rm.im |
| 13-Sep-2026 22:50:28 | 2026-09-14 02:50:29 INFO CasacRegionManager::fromBCS No directional region specified. Using full positional plane. |
| 13-Sep-2026 22:50:28 | 2026-09-14 02:50:29 INFO ImageRegion::fromRecord Selected bounding box : |
| 13-Sep-2026 22:50:28 | 2026-09-14 02:50:29 INFO ImageRegion::fromRecord+ [0, 0] to [19, 19] (00:00:40.000, -00.10.00.001 to 23:59:24.000, +00.09.00.001) |
| 13-Sep-2026 22:50:28 | 2026-09-14 02:50:29 INFO ImageStatsCalculator::_logStartup Statistics calculated using Classic algorithm |
| 13-Sep-2026 22:50:28 | 2026-09-14 02:50:29 INFO ImageStatsCalculator::_logStartup Regions --- |
| 13-Sep-2026 22:50:28 | 2026-09-14 02:50:29 INFO ImageStatsCalculator::_logStartup -- bottom-left corner (pixel) [blc]: [0, 0] |
| 13-Sep-2026 22:50:28 | 2026-09-14 02:50:29 INFO ImageStatsCalculator::_logStartup -- top-right corner (pixel) [trc]: [19, 19] |
| 13-Sep-2026 22:50:28 | 2026-09-14 02:50:29 INFO ImageStatsCalculator::_logStartup -- bottom-left corner (world) [blcf]: 00:00:40.000, -00.10.00.001 |
| 13-Sep-2026 22:50:28 | 2026-09-14 02:50:29 INFO ImageStatsCalculator::_logStartup -- top-right corner (world) [trcf]: 23:59:24.000, +00.09.00.001 |
| 13-Sep-2026 22:50:28 | 2026-09-14 02:50:29 INFO Values --- |
| 13-Sep-2026 22:50:28 | 2026-09-14 02:50:29 INFO -- number of points [npts]: 400 |
| 13-Sep-2026 22:50:28 | 2026-09-14 02:50:29 INFO -- maximum value [max]: 9.60001 rad/m/m |
| 13-Sep-2026 22:50:28 | 2026-09-14 02:50:29 INFO -- minimum value [min]: 9.59997 rad/m/m |
| 13-Sep-2026 22:50:28 | 2026-09-14 02:50:29 INFO -- position of max value (pixel) [maxpos]: [3, 0] |
| 13-Sep-2026 22:50:28 | 2026-09-14 02:50:29 INFO -- position of min value (pixel) [minpos]: [1, 0] |
| 13-Sep-2026 22:50:28 | 2026-09-14 02:50:29 INFO -- position of max value (world) [maxposf]: 00:00:28.000, -00.10.00.001 |
| 13-Sep-2026 22:50:28 | 2026-09-14 02:50:29 INFO -- position of min value (world) [minposf]: 00:00:36.000, -00.10.00.001 |
| 13-Sep-2026 22:50:28 | 2026-09-14 02:50:29 INFO -- Sum of pixel values [sum]: 3839.99 rad/m/m |
| 13-Sep-2026 22:50:28 | 2026-09-14 02:50:29 INFO -- Sum of squared pixel values [sumsq]: 36863.9 rad/m/m.rad/m/m |
| 13-Sep-2026 22:50:28 | 2026-09-14 02:50:29 INFO Statistics --- |
| 13-Sep-2026 22:50:28 | 2026-09-14 02:50:29 INFO -- Mean of the pixel values [mean]: 9.59998 rad/m/m |
| 13-Sep-2026 22:50:28 | 2026-09-14 02:50:29 INFO -- Variance of the pixel values : 9.48741e-11 rad/m/m |
| 13-Sep-2026 22:50:28 | 2026-09-14 02:50:29 INFO -- Standard deviation of the Mean [sigma]: 9.74033e-06 rad/m/m |
| 13-Sep-2026 22:50:28 | 2026-09-14 02:50:29 INFO -- Root mean square [rms]: 9.59998 rad/m/m |
| 13-Sep-2026 22:50:28 | 2026-09-14 02:50:29 INFO ImageStatsCalculator::statistics Sum column unit = rad/m/m |
| 13-Sep-2026 22:50:28 | 2026-09-14 02:50:29 INFO ImageStatsCalculator::statistics+ Mean column unit = rad/m/m |
| 13-Sep-2026 22:50:28 | 2026-09-14 02:50:29 INFO ImageStatsCalculator::statistics+ Std_dev column unit = rad/m/m |
| 13-Sep-2026 22:50:28 | 2026-09-14 02:50:29 INFO ImageStatsCalculator::statistics+ Minimum column unit = rad/m/m |
| 13-Sep-2026 22:50:28 | 2026-09-14 02:50:29 INFO ImageStatsCalculator::statistics+ Maximum column unit = rad/m/m |
| 13-Sep-2026 22:50:28 | 2026-09-14 02:50:29 INFO ImageStatsCalculator::statistics Npts Sum Mean Rms Std_dev Minimum Maximum |
| 13-Sep-2026 22:50:28 | 2026-09-14 02:50:29 INFO ImageStatsCalculator::statistics 4.000000e+02 3.839993e+03 9.599982e+00 9.599982e+00 9.740334e-06 9.599969e+00 9.600007e+00 |
| 13-Sep-2026 22:50:28 | 2026-09-14 02:50:29 INFO deleted table /home/casatest/casa6/casatestutils/nosedir/test_tool_imagepol/rm.im |
| 13-Sep-2026 22:50:28 | 2026-09-14 02:50:29 INFO image::statistics Determining stats for image pa0.im |
| 13-Sep-2026 22:50:28 | 2026-09-14 02:50:29 INFO CasacRegionManager::fromBCS No directional region specified. Using full positional plane. |
| 13-Sep-2026 22:50:28 | 2026-09-14 02:50:29 INFO CasacRegionManager::fromBCS Using polarizations ALL |
| 13-Sep-2026 22:50:28 | 2026-09-14 02:50:29 INFO ImageRegion::fromRecord Selected bounding box : |
| 13-Sep-2026 22:50:28 | 2026-09-14 02:50:29 INFO ImageRegion::fromRecord+ [0, 0, 0] to [19, 19, 0] (00:00:40.000, -00.10.00.001, Pangle to 23:59:24.000, +00.09.00.001, Pangle) |
| 13-Sep-2026 22:50:28 | 2026-09-14 02:50:29 INFO ImageStatsCalculator::_logStartup Statistics calculated using Classic algorithm |
| 13-Sep-2026 22:50:28 | 2026-09-14 02:50:29 INFO ImageStatsCalculator::_logStartup Regions --- |
| 13-Sep-2026 22:50:28 | 2026-09-14 02:50:29 INFO ImageStatsCalculator::_logStartup -- bottom-left corner (pixel) [blc]: [0, 0, 0] |
| 13-Sep-2026 22:50:28 | 2026-09-14 02:50:29 INFO ImageStatsCalculator::_logStartup -- top-right corner (pixel) [trc]: [19, 19, 0] |
| 13-Sep-2026 22:50:28 | 2026-09-14 02:50:29 INFO ImageStatsCalculator::_logStartup -- bottom-left corner (world) [blcf]: 00:00:40.000, -00.10.00.001, Pangle |
| 13-Sep-2026 22:50:28 | 2026-09-14 02:50:29 INFO ImageStatsCalculator::_logStartup -- top-right corner (world) [trcf]: 23:59:24.000, +00.09.00.001, Pangle |
| 13-Sep-2026 22:50:28 | 2026-09-14 02:50:29 INFO Values --- |
| 13-Sep-2026 22:50:28 | 2026-09-14 02:50:29 INFO -- number of points [npts]: 400 |
| 13-Sep-2026 22:50:28 | 2026-09-14 02:50:29 INFO -- maximum value [max]: 22.5001 deg |
| 13-Sep-2026 22:50:28 | 2026-09-14 02:50:29 INFO -- minimum value [min]: 22.5 deg |
| 13-Sep-2026 22:50:28 | 2026-09-14 02:50:29 INFO -- position of max value (pixel) [maxpos]: [1, 0, 0] |
| 13-Sep-2026 22:50:28 | 2026-09-14 02:50:29 INFO -- position of min value (pixel) [minpos]: [3, 0, 0] |
| 13-Sep-2026 22:50:28 | 2026-09-14 02:50:29 INFO -- position of max value (world) [maxposf]: 00:00:36.000, -00.10.00.001, Pangle |
| 13-Sep-2026 22:50:28 | 2026-09-14 02:50:29 INFO -- position of min value (world) [minposf]: 00:00:28.000, -00.10.00.001, Pangle |
| 13-Sep-2026 22:50:28 | 2026-09-14 02:50:29 INFO -- Sum of pixel values [sum]: 9000.02 deg |
| 13-Sep-2026 22:50:28 | 2026-09-14 02:50:29 INFO -- Sum of squared pixel values [sumsq]: 202501 deg.deg |
| 13-Sep-2026 22:50:28 | 2026-09-14 02:50:29 INFO Statistics --- |
| 13-Sep-2026 22:50:28 | 2026-09-14 02:50:29 INFO -- Mean of the pixel values [mean]: 22.5 deg |
| 13-Sep-2026 22:50:28 | 2026-09-14 02:50:29 INFO -- Variance of the pixel values : 6.26899e-10 deg |
| 13-Sep-2026 22:50:28 | 2026-09-14 02:50:29 INFO -- Standard deviation of the Mean [sigma]: 2.5038e-05 deg |
| 13-Sep-2026 22:50:28 | 2026-09-14 02:50:29 INFO -- Root mean square [rms]: 22.5 deg |
| 13-Sep-2026 22:50:28 | 2026-09-14 02:50:29 INFO ImageStatsCalculator::statistics Sum column unit = deg |
| 13-Sep-2026 22:50:28 | 2026-09-14 02:50:29 INFO ImageStatsCalculator::statistics+ Mean column unit = deg |
| 13-Sep-2026 22:50:28 | 2026-09-14 02:50:29 INFO ImageStatsCalculator::statistics+ Std_dev column unit = deg |
| 13-Sep-2026 22:50:28 | 2026-09-14 02:50:29 INFO ImageStatsCalculator::statistics+ Minimum column unit = deg |
| 13-Sep-2026 22:50:28 | 2026-09-14 02:50:29 INFO ImageStatsCalculator::statistics+ Maximum column unit = deg |
| 13-Sep-2026 22:50:28 | 2026-09-14 02:50:29 INFO ImageStatsCalculator::statistics Npts Sum Mean Rms Std_dev Minimum Maximum |
| 13-Sep-2026 22:50:28 | 2026-09-14 02:50:29 INFO ImageStatsCalculator::statistics 4.000000e+02 9.000018e+03 2.250005e+01 2.250005e+01 2.503796e-05 2.249998e+01 2.250008e+01 |
| 13-Sep-2026 22:50:28 | 2026-09-14 02:50:29 INFO deleted table /home/casatest/casa6/casatestutils/nosedir/test_tool_imagepol/pa0.im |
| 13-Sep-2026 22:50:28 | test_tool_imagepol.py::po_rotationmeasure_test::test_algorithm |
| 13-Sep-2026 22:50:28 | Test rotation measure computation algorithm |
| 13-Sep-2026 22:50:28 | PASSED |
| 13-Sep-2026 22:50:28 | |
| 13-Sep-2026 22:50:28 | 2026-09-14 02:50:29 INFO ImageFITSConverter::readBeamsTable Loading multiple beams from BEAMS table |
| 13-Sep-2026 22:50:28 | 2026-09-14 02:50:29 INFO ImagePol::rotationMeasure Creating image 'g' of shape [10, 10] |
| 13-Sep-2026 22:50:28 | 2026-09-14 02:50:29 INFO ImagePolarimetry::sigma Determined noise from V image to be 1.0119 |
| 13-Sep-2026 22:50:28 | 2026-09-14 02:50:29 INFO ImageFITSConverter::readBeamsTable Loading multiple beams from BEAMS table |
| 13-Sep-2026 22:50:28 | 2026-09-14 02:50:29 INFO ImagePol::rotationMeasure Creating image 'hh' of shape [10, 10] |
| 13-Sep-2026 22:50:28 | 2026-09-14 02:50:29 SEVERE imagepol::rotationmeasure Exception Reported: Exception: Input image has multiple beams and the corresponding beams for the stokes planes necessary for this computation are not equal.. |
| 13-Sep-2026 22:50:28 | 2026-09-14 02:50:29 SEVERE imagepol::rotationmeasure+ ... thrown by casacore::Bool casa::ImagePolarimetry::_checkBeams(const std::vector<casa::ImagePolarimetry::StokesTypes>&, casacore::Bool, casacore::Bool) const at File: /source/casa6/casatools/src/code/imageanalysis/ImageAnalysis/ImagePolarimetry.cc, line: 1626 |
| 13-Sep-2026 22:50:28 | test_tool_imagepol.py::po_rotationmeasure_test::test_multibeam |
| 13-Sep-2026 22:50:28 | Test multibeam images for correct behavior |
| 13-Sep-2026 22:50:28 | PASSED |
| 13-Sep-2026 22:50:28 | |
| 13-Sep-2026 22:50:28 | 2026-09-14 02:50:29 INFO ImageFITSConverter::readBeamsTable Loading multiple beams from BEAMS table |
| 13-Sep-2026 22:50:28 | 2026-09-14 02:50:29 INFO ImagePolarimetry::sigma Determined noise from V image to be 1.0119 |
| 13-Sep-2026 22:50:28 | 2026-09-14 02:50:29 INFO ImageFITSConverter::readBeamsTable Loading multiple beams from BEAMS table |
| 13-Sep-2026 22:50:28 | 2026-09-14 02:50:29 INFO ImagePolarimetry::sigma Determined noise from V image to be 1.0119 |
| 13-Sep-2026 22:50:28 | test_tool_imagepol.py::po_sigma_test::test_multibeam |
| 13-Sep-2026 22:50:28 | Test multibeam images for correct behavior |
| 13-Sep-2026 22:50:28 | pol_eq_beams.fits |
| 13-Sep-2026 22:50:28 | PASSED |
| 13-Sep-2026 22:50:28 | |
| 13-Sep-2026 22:50:28 | 2026-09-14 02:50:29 INFO ImageFITSConverter::readBeamsTable Loading multiple beams from BEAMS table |
| 13-Sep-2026 22:50:28 | 2026-09-14 02:50:29 INFO ImageFITSConverter::readBeamsTable Loading multiple beams from BEAMS table |
| 13-Sep-2026 22:50:28 | 2026-09-14 02:50:29 INFO ImagePolarimetry::sigmaLinPolInt Determined noise from Q&U images to be |
| 13-Sep-2026 22:50:28 | 2026-09-14 02:50:29 INFO ImagePolarimetry::sigmaLinPolInt Determined noise from Q&U images to be |
| 13-Sep-2026 22:50:28 | 2026-09-14 02:50:29 INFO ImageFITSConverter::readBeamsTable Loading multiple beams from BEAMS table |
| 13-Sep-2026 22:50:28 | 2026-09-14 02:50:29 INFO ImageFITSConverter::readBeamsTable Loading multiple beams from BEAMS table |
| 13-Sep-2026 22:50:28 | 2026-09-14 02:50:29 SEVERE imagepol::sigmadepolratio Exception Reported: Exception: Beams or beamsets are not equal between the two images, caonnot perform calculation. |
| 13-Sep-2026 22:50:28 | 2026-09-14 02:50:29 SEVERE imagepol::sigmadepolratio+ ... thrown by static void casa::ImagePolarimetry::_checkBeams(const casa::ImagePolarimetry&, const casa::ImagePolarimetry&, const casacore::Vector<casa::ImagePolarimetry::StokesTypes>&) at File: /source/casa6/casatools/src/code/imageanalysis/ImageAnalysis/ImagePolarimetry.cc, line: 1686 |
| 13-Sep-2026 22:50:28 | test_tool_imagepol.py::po_sigmadepolratio_test::test_multibeam |
| 13-Sep-2026 22:50:28 | Test multibeam images for correct behavior |
| 13-Sep-2026 22:50:28 | PASSED |
| 13-Sep-2026 22:50:28 | |
| 13-Sep-2026 22:50:28 | 2026-09-14 02:50:29 INFO ImageFITSConverter::readBeamsTable Loading multiple beams from BEAMS table |
| 13-Sep-2026 22:50:28 | 2026-09-14 02:50:29 INFO ImagePolarimetry::sigmaLinPolInt Determined noise from Q&U images to be |
| 13-Sep-2026 22:50:28 | 2026-09-14 02:50:29 INFO imagepol::sigmaFracLinPol Creating image 'g' of shape [10, 10, 10, 1] |
| 13-Sep-2026 22:50:28 | 2026-09-14 02:50:29 INFO ImageFITSConverter::readBeamsTable Loading multiple beams from BEAMS table |
| 13-Sep-2026 22:50:28 | 2026-09-14 02:50:29 SEVERE imagepol::sigmafraclinpol Exception Reported: Exception: Input image has multiple beams and the corresponding beams for the stokes planes necessary for this computation are not equal.. |
| 13-Sep-2026 22:50:28 | 2026-09-14 02:50:29 SEVERE imagepol::sigmafraclinpol+ ... thrown by casacore::Bool casa::ImagePolarimetry::_checkBeams(const std::vector<casa::ImagePolarimetry::StokesTypes>&, casacore::Bool, casacore::Bool) const at File: /source/casa6/casatools/src/code/imageanalysis/ImageAnalysis/ImagePolarimetry.cc, line: 1626 |
| 13-Sep-2026 22:50:28 | test_tool_imagepol.py::po_sigmafraclinpol_test::test_multibeam |
| 13-Sep-2026 22:50:28 | Test multibeam images for correct behavior |
| 13-Sep-2026 22:50:28 | PASSED |
| 13-Sep-2026 22:50:28 | |
| 13-Sep-2026 22:50:28 | 2026-09-14 02:50:29 INFO ImageFITSConverter::readBeamsTable Loading multiple beams from BEAMS table |
| 13-Sep-2026 22:50:28 | 2026-09-14 02:50:29 INFO ImagePolarimetry::sigma Determined noise from V image to be 1.0119 |
| 13-Sep-2026 22:50:28 | 2026-09-14 02:50:29 INFO imagepol::sigmaFracTotPol Creating image 'g' of shape [10, 10, 10, 1] |
| 13-Sep-2026 22:50:28 | 2026-09-14 02:50:29 INFO ImageFITSConverter::readBeamsTable Loading multiple beams from BEAMS table |
| 13-Sep-2026 22:50:28 | 2026-09-14 02:50:29 WARN ImagePolarimetry::_setDoLinDoCirc (file /source/casa6/casatools/src/code/imageanalysis/ImageAnalysis/ImagePolarimetry.cc, line 272) I, Q, and U beams are not the same, cannot do linear portion |
| 13-Sep-2026 22:50:28 | 2026-09-14 02:50:29 WARN ImagePolarimetry::_setDoLinDoCirc (file /source/casa6/casatools/src/code/imageanalysis/ImageAnalysis/ImagePolarimetry.cc, line 272) I and V beams are not the same, cannot do circular portion |
| 13-Sep-2026 22:50:28 | 2026-09-14 02:50:29 SEVERE imagepol::sigmafractotpol Exception Reported: Exception: Can do neither linear nor circular portions. |
| 13-Sep-2026 22:50:28 | 2026-09-14 02:50:29 SEVERE imagepol::sigmafractotpol+ ... thrown by void casa::ImagePolarimetry::_setDoLinDoCirc(casacore::Bool&, casacore::Bool&) const at File: /source/casa6/casatools/src/code/imageanalysis/ImageAnalysis/ImagePolarimetry.cc, line: 292 |
| 13-Sep-2026 22:50:28 | test_tool_imagepol.py::po_sigmafractotpol_test::test_multibeam |
| 13-Sep-2026 22:50:28 | Test multibeam images for correct behavior |
| 13-Sep-2026 22:50:28 | PASSED |
| 13-Sep-2026 22:50:28 | |
| 13-Sep-2026 22:50:28 | 2026-09-14 02:50:29 INFO ImageFITSConverter::readBeamsTable Loading multiple beams from BEAMS table |
| 13-Sep-2026 22:50:28 | 2026-09-14 02:50:29 INFO ImagePolarimetry::sigmaLinPolInt Determined noise from Q&U images to be |
| 13-Sep-2026 22:50:28 | 2026-09-14 02:50:29 INFO ImageFITSConverter::readBeamsTable Loading multiple beams from BEAMS table |
| 13-Sep-2026 22:50:28 | 2026-09-14 02:50:29 SEVERE imagepol::sigmalinpolint Exception Reported: Exception: Input image has multiple beams and the corresponding beams for the stokes planes necessary for this computation are not equal.. |
| 13-Sep-2026 22:50:28 | 2026-09-14 02:50:29 SEVERE imagepol::sigmalinpolint+ ... thrown by casacore::Bool casa::ImagePolarimetry::_checkBeams(const std::vector<casa::ImagePolarimetry::StokesTypes>&, casacore::Bool, casacore::Bool) const at File: /source/casa6/casatools/src/code/imageanalysis/ImageAnalysis/ImagePolarimetry.cc, line: 1626 |
| 13-Sep-2026 22:50:28 | test_tool_imagepol.py::po_sigmalinpolint_test::test_multibeam |
| 13-Sep-2026 22:50:28 | Test multibeam images for correct behavior |
| 13-Sep-2026 22:50:28 | PASSED |
| 13-Sep-2026 22:50:28 | |
| 13-Sep-2026 22:50:28 | 2026-09-14 02:50:29 INFO ImageFITSConverter::readBeamsTable Loading multiple beams from BEAMS table |
| 13-Sep-2026 22:50:28 | 2026-09-14 02:50:29 INFO ImagePolarimetry::sigma Determined noise from V image to be 1.0119 |
| 13-Sep-2026 22:50:28 | 2026-09-14 02:50:29 INFO imagepol::sigmaLinPolPosAng Creating image 'g' of shape [10, 10, 10, 1] |
| 13-Sep-2026 22:50:28 | 2026-09-14 02:50:29 INFO ImageFITSConverter::readBeamsTable Loading multiple beams from BEAMS table |
| 13-Sep-2026 22:50:28 | 2026-09-14 02:50:29 SEVERE imagepol::sigmalinpolposang Exception Reported: Exception: Input image has multiple beams and the corresponding beams for the stokes planes necessary for this computation are not equal.. |
| 13-Sep-2026 22:50:28 | 2026-09-14 02:50:29 SEVERE imagepol::sigmalinpolposang+ ... thrown by casacore::Bool casa::ImagePolarimetry::_checkBeams(const std::vector<casa::ImagePolarimetry::StokesTypes>&, casacore::Bool, casacore::Bool) const at File: /source/casa6/casatools/src/code/imageanalysis/ImageAnalysis/ImagePolarimetry.cc, line: 1626 |
| 13-Sep-2026 22:50:28 | test_tool_imagepol.py::po_sigmalinpolposang_test::test_multibeam |
| 13-Sep-2026 22:50:28 | Test multibeam images for correct behavior |
| 13-Sep-2026 22:50:28 | PASSED |
| 13-Sep-2026 22:50:28 | |
| 13-Sep-2026 22:50:28 | 2026-09-14 02:50:29 INFO ImageFITSConverter::readBeamsTable Loading multiple beams from BEAMS table |
| 13-Sep-2026 22:50:28 | 2026-09-14 02:50:29 INFO ImagePolTask::_sigma Determined noise from V image to be 1.0119 |
| 13-Sep-2026 22:50:28 | 2026-09-14 02:50:29 INFO ImagePolTask::_sigma Debiasing with sigma = 1.0119 |
| 13-Sep-2026 22:50:28 | 2026-09-14 02:50:29 INFO ImageFITSConverter::readBeamsTable Loading multiple beams from BEAMS table |
| 13-Sep-2026 22:50:28 | test_tool_imagepol.py::po_totpolint_test::test_multibeam |
| 13-Sep-2026 22:50:28 | Test multibeam images for correct behavior |
| 13-Sep-2026 22:50:28 | PASSED |
| 13-Sep-2026 22:50:28 | |
| 13-Sep-2026 22:50:28 | - generated xml file: /home/casatest/casa6/casatestutils/nosedir/xml/test_tool_imagepol/nose.xml - |
| 13-Sep-2026 22:50:28 | ======================== 17 passed, 1 warning in 0.60s ========================= |
| 13-Sep-2026 22:50:28 | |
| 13-Sep-2026 22:50:28 | |
| 13-Sep-2026 22:50:28 | Setting Working Directory: /home/casatest/casa6/casatestutils/nosedir/test_tool_image_statistics/ |
| 13-Sep-2026 22:50:28 | Test Directory: /home/casatest/casa6/casatestutils/nosedir/test_tool_image_statistics |
| 13-Sep-2026 22:50:28 | |
| 13-Sep-2026 22:50:28 | Running Command: pytest --junitxml=/home/casatest/casa6/casatestutils/nosedir/xml/test_tool_image_statistics/nose.xml -s --disable-pytest-warnings --verbose -ra --tb=short /home/casatest/casa6/casatestutils/nosedir/test_tool_image_statistics/ |
| 13-Sep-2026 22:50:28 | |
| 13-Sep-2026 22:50:28 | Setting Working Directory: /home/casatest/casa6/casatestutils/nosedir/test_tool_quanta/ |
| 13-Sep-2026 22:50:28 | Test Directory: /home/casatest/casa6/casatestutils/nosedir/test_tool_quanta |
| 13-Sep-2026 22:50:28 | |
| 13-Sep-2026 22:50:28 | Running Command: pytest --junitxml=/home/casatest/casa6/casatestutils/nosedir/xml/test_tool_quanta/nose.xml -s --disable-pytest-warnings --verbose -ra --tb=short /home/casatest/casa6/casatestutils/nosedir/test_tool_quanta/ |
| 13-Sep-2026 22:50:28 | |
| 13-Sep-2026 22:50:28 | Setting Working Directory: /home/casatest/casa6/casatestutils/nosedir/test_tool_coordsys/ |
| 13-Sep-2026 22:50:28 | Test Directory: /home/casatest/casa6/casatestutils/nosedir/test_tool_coordsys |
| 13-Sep-2026 22:50:28 | |
| 13-Sep-2026 22:50:28 | Running Command: pytest --junitxml=/home/casatest/casa6/casatestutils/nosedir/xml/test_tool_coordsys/nose.xml -s --disable-pytest-warnings --verbose -ra --tb=short /home/casatest/casa6/casatestutils/nosedir/test_tool_coordsys/ |
| 13-Sep-2026 22:50:28 | |
| 13-Sep-2026 22:50:28 | Setting Working Directory: /home/casatest/casa6/casatestutils/nosedir/test_tool_image_collapse/ |
| 13-Sep-2026 22:50:28 | Test Directory: /home/casatest/casa6/casatestutils/nosedir/test_tool_image_collapse |
| 13-Sep-2026 22:50:28 | |
| 13-Sep-2026 22:50:28 | Running Command: pytest --junitxml=/home/casatest/casa6/casatestutils/nosedir/xml/test_tool_image_collapse/nose.xml -s --disable-pytest-warnings --verbose -ra --tb=short /home/casatest/casa6/casatestutils/nosedir/test_tool_image_collapse/ |
| 13-Sep-2026 22:50:28 | |
| 13-Sep-2026 22:50:28 | Setting Working Directory: /home/casatest/casa6/casatestutils/nosedir/test_tool_calibrater/ |
| 13-Sep-2026 22:50:28 | Test Directory: /home/casatest/casa6/casatestutils/nosedir/test_tool_calibrater |
| 13-Sep-2026 22:50:28 | |
| 13-Sep-2026 22:50:28 | Running Command: pytest --junitxml=/home/casatest/casa6/casatestutils/nosedir/xml/test_tool_calibrater/nose.xml -s --disable-pytest-warnings --verbose -ra --tb=short /home/casatest/casa6/casatestutils/nosedir/test_tool_calibrater/ |
| 13-Sep-2026 22:50:28 | |
| 13-Sep-2026 22:50:28 | Setting Working Directory: /home/casatest/casa6/casatestutils/nosedir/test_tool_measures/ |
| 13-Sep-2026 22:50:28 | Test Directory: /home/casatest/casa6/casatestutils/nosedir/test_tool_measures |
| 13-Sep-2026 22:50:28 | |
| 13-Sep-2026 22:50:28 | Running Command: pytest --junitxml=/home/casatest/casa6/casatestutils/nosedir/xml/test_tool_measures/nose.xml -s --disable-pytest-warnings --verbose -ra --tb=short /home/casatest/casa6/casatestutils/nosedir/test_tool_measures/ |
| 13-Sep-2026 22:50:28 | |
| 13-Sep-2026 22:50:28 | Setting Working Directory: /home/casatest/casa6/casatestutils/nosedir/test_tool_sdm/ |
| 13-Sep-2026 22:50:28 | Test Directory: /home/casatest/casa6/casatestutils/nosedir/test_tool_sdm |
| 13-Sep-2026 22:50:28 | |
| 13-Sep-2026 22:50:28 | Running Command: pytest --junitxml=/home/casatest/casa6/casatestutils/nosedir/xml/test_tool_sdm/nose.xml -s --disable-pytest-warnings --verbose -ra --tb=short /home/casatest/casa6/casatestutils/nosedir/test_tool_sdm/ |
| 13-Sep-2026 22:50:28 | |
| 13-Sep-2026 22:50:28 | Setting Working Directory: /home/casatest/casa6/casatestutils/nosedir/test_tool_msuvbinner/ |
| 13-Sep-2026 22:50:28 | Test Directory: /home/casatest/casa6/casatestutils/nosedir/test_tool_msuvbinner |
| 13-Sep-2026 22:50:28 | |
| 13-Sep-2026 22:50:28 | Running Command: pytest --junitxml=/home/casatest/casa6/casatestutils/nosedir/xml/test_tool_msuvbinner/nose.xml -s --disable-pytest-warnings --verbose -ra --tb=short /home/casatest/casa6/casatestutils/nosedir/test_tool_msuvbinner/ |
| 13-Sep-2026 22:50:28 | |
| 13-Sep-2026 22:50:28 | Setting Working Directory: /home/casatest/casa6/casatestutils/nosedir/test_tool_ms_createmultims/ |
| 13-Sep-2026 22:50:28 | Test Directory: /home/casatest/casa6/casatestutils/nosedir/test_tool_ms_createmultims |
| 13-Sep-2026 22:50:28 | |
| 13-Sep-2026 22:50:28 | Running Command: pytest --junitxml=/home/casatest/casa6/casatestutils/nosedir/xml/test_tool_ms_createmultims/nose.xml -s --disable-pytest-warnings --verbose -ra --tb=short /home/casatest/casa6/casatestutils/nosedir/test_tool_ms_createmultims/ |
| 13-Sep-2026 22:50:28 | |
| 13-Sep-2026 22:50:28 | Setting Working Directory: /home/casatest/casa6/casatestutils/nosedir/test_tool_ms/ |
| 13-Sep-2026 22:50:28 | Test Directory: /home/casatest/casa6/casatestutils/nosedir/test_tool_ms |
| 13-Sep-2026 22:50:28 | |
| 13-Sep-2026 22:50:28 | Running Command: pytest --junitxml=/home/casatest/casa6/casatestutils/nosedir/xml/test_tool_ms/nose.xml -s --disable-pytest-warnings --verbose -ra --tb=short /home/casatest/casa6/casatestutils/nosedir/test_tool_ms/ |
| 13-Sep-2026 22:50:28 | |
| 13-Sep-2026 22:50:28 | Setting Working Directory: /home/casatest/casa6/casatestutils/nosedir/test_tool_linearmosaic/ |
| 13-Sep-2026 22:50:28 | Test Directory: /home/casatest/casa6/casatestutils/nosedir/test_tool_linearmosaic |
| 13-Sep-2026 22:50:28 | |
| 13-Sep-2026 22:50:28 | Running Command: pytest --junitxml=/home/casatest/casa6/casatestutils/nosedir/xml/test_tool_linearmosaic/nose.xml -s --disable-pytest-warnings --verbose -ra --tb=short /home/casatest/casa6/casatestutils/nosedir/test_tool_linearmosaic/ |
| 13-Sep-2026 22:50:28 | |
| 13-Sep-2026 22:50:28 | Setting Working Directory: /home/casatest/casa6/casatestutils/nosedir/test_tool_image_subimage/ |
| 13-Sep-2026 22:50:28 | Test Directory: /home/casatest/casa6/casatestutils/nosedir/test_tool_image_subimage |
| 13-Sep-2026 22:50:28 | |
| 13-Sep-2026 22:50:28 | Running Command: pytest --junitxml=/home/casatest/casa6/casatestutils/nosedir/xml/test_tool_image_subimage/nose.xml -s --disable-pytest-warnings --verbose -ra --tb=short /home/casatest/casa6/casatestutils/nosedir/test_tool_image_subimage/ |
| 13-Sep-2026 22:50:28 | |
| 13-Sep-2026 22:50:28 | Setting Working Directory: /home/casatest/casa6/casatestutils/nosedir/test_tool_logsink/ |
| 13-Sep-2026 22:50:28 | Test Directory: /home/casatest/casa6/casatestutils/nosedir/test_tool_logsink |
| 13-Sep-2026 22:50:28 | |
| 13-Sep-2026 22:50:28 | Running Command: pytest --junitxml=/home/casatest/casa6/casatestutils/nosedir/xml/test_tool_logsink/nose.xml -s --disable-pytest-warnings --verbose -ra --tb=short /home/casatest/casa6/casatestutils/nosedir/test_tool_logsink/ |
| 13-Sep-2026 22:50:28 | |
| 13-Sep-2026 22:50:28 | Setting Working Directory: /home/casatest/casa6/casatestutils/nosedir/test_tool_image_deviation/ |
| 13-Sep-2026 22:50:28 | Test Directory: /home/casatest/casa6/casatestutils/nosedir/test_tool_image_deviation |
| 13-Sep-2026 22:50:28 | |
| 13-Sep-2026 22:50:28 | Running Command: pytest --junitxml=/home/casatest/casa6/casatestutils/nosedir/xml/test_tool_image_deviation/nose.xml -s --disable-pytest-warnings --verbose -ra --tb=short /home/casatest/casa6/casatestutils/nosedir/test_tool_image_deviation/ |
| 13-Sep-2026 22:50:28 | |
| 13-Sep-2026 22:50:28 | Setting Working Directory: /home/casatest/casa6/casatestutils/nosedir/test_tool_image_rebin/ |
| 13-Sep-2026 22:50:28 | Test Directory: /home/casatest/casa6/casatestutils/nosedir/test_tool_image_rebin |
| 13-Sep-2026 22:50:28 | |
| 13-Sep-2026 22:50:28 | Running Command: pytest --junitxml=/home/casatest/casa6/casatestutils/nosedir/xml/test_tool_image_rebin/nose.xml -s --disable-pytest-warnings --verbose -ra --tb=short /home/casatest/casa6/casatestutils/nosedir/test_tool_image_rebin/ |
| 13-Sep-2026 22:50:28 | |
| 13-Sep-2026 22:50:28 | Setting Working Directory: /home/casatest/casa6/casatestutils/nosedir/test_tool_image_fitprofile/ |
| 13-Sep-2026 22:50:28 | Test Directory: /home/casatest/casa6/casatestutils/nosedir/test_tool_image_fitprofile |
| 13-Sep-2026 22:50:28 | |
| 13-Sep-2026 22:50:28 | Running Command: pytest --junitxml=/home/casatest/casa6/casatestutils/nosedir/xml/test_tool_image_fitprofile/nose.xml -s --disable-pytest-warnings --verbose -ra --tb=short /home/casatest/casa6/casatestutils/nosedir/test_tool_image_fitprofile/ |
| 13-Sep-2026 22:50:28 | |
| 13-Sep-2026 22:50:28 | Setting Working Directory: /home/casatest/casa6/casatestutils/nosedir/test_tool_agentflagger/ |
| 13-Sep-2026 22:50:28 | Test Directory: /home/casatest/casa6/casatestutils/nosedir/test_tool_agentflagger |
| 13-Sep-2026 22:50:28 | |
| 13-Sep-2026 22:50:28 | Running Command: pytest --junitxml=/home/casatest/casa6/casatestutils/nosedir/xml/test_tool_agentflagger/nose.xml -s --disable-pytest-warnings --verbose -ra --tb=short /home/casatest/casa6/casatestutils/nosedir/test_tool_agentflagger/ |
| 13-Sep-2026 22:50:28 | |
| 13-Sep-2026 22:50:28 | Setting Working Directory: /home/casatest/casa6/casatestutils/nosedir/test_tool_imagepol/ |
| 13-Sep-2026 22:50:28 | Test Directory: /home/casatest/casa6/casatestutils/nosedir/test_tool_imagepol |
| 13-Sep-2026 22:50:28 | |
| 13-Sep-2026 22:50:28 | Running Command: pytest --junitxml=/home/casatest/casa6/casatestutils/nosedir/xml/test_tool_imagepol/nose.xml -s --disable-pytest-warnings --verbose -ra --tb=short /home/casatest/casa6/casatestutils/nosedir/test_tool_imagepol/ |
| 13-Sep-2026 22:50:29 | total 77812 |
| 13-Sep-2026 22:50:29 | -rw-r--r-- 1 casaci 15001 161131 Sep 14 02:37 casatestutils-6.7.7.7a14882.dev1-py3-none-any.whl |
| 13-Sep-2026 22:50:29 | -rw-r--r-- 1 casaci 15001 79346756 Sep 14 02:37 casatools-6.7.7.7a14882.dev1-cp312-cp312-manylinux_2_28_x86_64.whl |
| 13-Sep-2026 22:50:29 | -rw-r--r-- 1 casaci root 4340 Sep 14 02:50 test_tool_agentflagger.xml |
| 13-Sep-2026 22:50:29 | -rw-r--r-- 1 casaci root 1006 Sep 14 02:50 test_tool_calanalysis.xml |
| 13-Sep-2026 22:50:29 | -rw-r--r-- 1 casaci root 2667 Sep 14 02:50 test_tool_calibrater.xml |
| 13-Sep-2026 22:50:29 | -rw-r--r-- 1 casaci root 687 Sep 14 02:50 test_tool_componentlist.xml |
| 13-Sep-2026 22:50:29 | -rw-r--r-- 1 casaci root 7467 Sep 14 02:50 test_tool_coordsys.xml |
| 13-Sep-2026 22:50:29 | -rw-r--r-- 1 casaci root 12935 Sep 14 02:50 test_tool_image.xml |
| 13-Sep-2026 22:50:29 | -rw-r--r-- 1 casaci root 2220 Sep 14 02:50 test_tool_image_collapse.xml |
| 13-Sep-2026 22:50:29 | -rw-r--r-- 1 casaci root 1048 Sep 14 02:50 test_tool_image_deviation.xml |
| 13-Sep-2026 22:50:29 | -rw-r--r-- 1 casaci root 2574 Sep 14 02:50 test_tool_image_fitprofile.xml |
| 13-Sep-2026 22:50:29 | -rw-r--r-- 1 casaci root 1178 Sep 14 02:50 test_tool_image_pbcor.xml |
| 13-Sep-2026 22:50:29 | -rw-r--r-- 1 casaci root 883 Sep 14 02:50 test_tool_image_pv.xml |
| 13-Sep-2026 22:50:29 | -rw-r--r-- 1 casaci root 1006 Sep 14 02:50 test_tool_image_rebin.xml |
| 13-Sep-2026 22:50:29 | -rw-r--r-- 1 casaci root 1336 Sep 14 02:50 test_tool_image_regrid.xml |
| 13-Sep-2026 22:50:29 | -rw-r--r-- 1 casaci root 1639 Sep 14 02:50 test_tool_image_statistics.xml |
| 13-Sep-2026 22:50:29 | -rw-r--r-- 1 casaci root 765 Sep 14 02:50 test_tool_image_subimage.xml |
| 13-Sep-2026 22:50:29 | -rw-r--r-- 1 casaci root 890 Sep 14 02:50 test_tool_image_transpose.xml |
| 13-Sep-2026 22:50:29 | -rw-r--r-- 1 casaci root 1966 Sep 14 02:50 test_tool_imagepol.xml |
| 13-Sep-2026 22:50:29 | -rw-r--r-- 1 casaci root 838 Sep 14 02:50 test_tool_linearmosaic.xml |
| 13-Sep-2026 22:50:29 | -rw-r--r-- 1 casaci root 669 Sep 14 02:50 test_tool_logsink.xml |
| 13-Sep-2026 22:50:29 | -rw-r--r-- 1 casaci root 549 Sep 14 02:50 test_tool_measures.xml |
| 13-Sep-2026 22:50:29 | -rw-r--r-- 1 casaci root 5224 Sep 14 02:50 test_tool_ms.xml |
| 13-Sep-2026 22:50:29 | -rw-r--r-- 1 casaci root 367 Sep 14 02:50 test_tool_ms_createmultims.xml |
| 13-Sep-2026 22:50:29 | -rw-r--r-- 1 casaci root 2099 Sep 14 02:50 test_tool_ms_statwt.xml |
| 13-Sep-2026 22:50:29 | -rw-r--r-- 1 casaci root 8633 Sep 14 02:50 test_tool_msmetadata.xml |
| 13-Sep-2026 22:50:29 | -rw-r--r-- 1 casaci root 359 Sep 14 02:50 test_tool_msuvbinner.xml |
| 13-Sep-2026 22:50:29 | -rw-r--r-- 1 casaci root 1171 Sep 14 02:50 test_tool_quanta.xml |
| 13-Sep-2026 22:50:29 | -rw-r--r-- 1 casaci root 3975 Sep 14 02:50 test_tool_regionmanager.xml |
| 13-Sep-2026 22:50:29 | -rw-r--r-- 1 casaci root 2071 Sep 14 02:50 test_tool_sdm.xml |
| 13-Sep-2026 22:50:29 | -rw-r--r-- 1 casaci root 2190 Sep 14 02:50 test_tool_sdm_toms.xml |
| 13-Sep-2026 22:50:29 | -rw-r--r-- 1 casaci root 670 Sep 14 02:50 test_tool_simulator.xml |
| 13-Sep-2026 22:50:29 | -rw-r--r-- 1 casaci root 1716 Sep 14 02:50 test_tool_synthesisutils.xml |
| 13-Sep-2026 22:50:29 | -rw-r--r-- 1 casaci root 1462 Sep 14 02:50 test_tool_table.xml |
| 13-Sep-2026 22:50:29 | -rw-r--r-- 1 casaci root 1717 Sep 14 02:50 test_tool_vpmanager.xml |
| 13-Sep-2026 22:50:29 | Finished task 'Test wheel' with result: Success |
| 13-Sep-2026 22:50:29 | Substituting variable: ${bamboo.agentId} with 153550852 |
| 13-Sep-2026 22:50:29 | Substituting variable: ${bamboo.agentId} with 153550852 |
| 13-Sep-2026 22:50:29 | Substituting variable: ${bamboo.agentId} with 153550852 |
| 13-Sep-2026 22:50:29 | Substituting variable: ${bamboo.agentId} with 153550852 |
| 13-Sep-2026 22:50:29 | Starting task 'Tar work directory' of type 'com.atlassian.bamboo.plugins.scripttask:task.builder.script' |
| 13-Sep-2026 22:50:29 | Beginning to execute external process for build 'CASASPECS - Dev Test 3.12 - CAS-14882 - Test Tools Many Linux 2.28 Py3.12 #1 (CASASPECS-DEVTESTPY312149-TTOMLPY312-1)' ... running command line: /opt/ci_workspace/casa/bamboo/agent4/temp/CASASPECS-DEVTESTPY312149-TTOMLPY312-1-ScriptBuildTask-7422984525198739052.sh ... in: /opt/ci_workspace/casa/bamboo/agent4/xml-data/build-dir/CASASPECS-DEVTESTPY312149-TTOMLPY312 |
| 13-Sep-2026 22:50:29 | Package working directory |
| 13-Sep-2026 22:50:29 | nosedir/ |
| 13-Sep-2026 22:50:29 | nosedir/test_tool_ms_statwt/ |
| 13-Sep-2026 22:50:29 | nosedir/test_tool_ms_statwt/test_tool_ms_statwt.py |
| 13-Sep-2026 22:50:29 | nosedir/test_tool_ms_statwt/conftest.py |
| 13-Sep-2026 22:50:29 | nosedir/test_tool_ms_statwt/casa-20260914-023936.log |
| 13-Sep-2026 22:50:29 | nosedir/test_tool_ms_statwt/short_summary.log |
| 13-Sep-2026 22:50:29 | nosedir/xml/ |
| 13-Sep-2026 22:50:29 | nosedir/xml/test_tool_ms_statwt/ |
| 13-Sep-2026 22:50:29 | nosedir/xml/test_tool_ms_statwt/nose.xml |
| 13-Sep-2026 22:50:29 | nosedir/xml/test_tool_image_transpose/ |
| 13-Sep-2026 22:50:29 | nosedir/xml/test_tool_image_transpose/nose.xml |
| 13-Sep-2026 22:50:29 | nosedir/xml/test_tool_regionmanager/ |
| 13-Sep-2026 22:50:29 | nosedir/xml/test_tool_regionmanager/nose.xml |
| 13-Sep-2026 22:50:29 | nosedir/xml/test_tool_vpmanager/ |
| 13-Sep-2026 22:50:29 | nosedir/xml/test_tool_vpmanager/nose.xml |
| 13-Sep-2026 22:50:29 | nosedir/xml/test_tool_simulator/ |
| 13-Sep-2026 22:50:29 | nosedir/xml/test_tool_simulator/nose.xml |
| 13-Sep-2026 22:50:29 | nosedir/xml/test_tool_image/ |
| 13-Sep-2026 22:50:29 | nosedir/xml/test_tool_image/nose.xml |
| 13-Sep-2026 22:50:29 | nosedir/xml/test_tool_calanalysis/ |
| 13-Sep-2026 22:50:29 | nosedir/xml/test_tool_calanalysis/nose.xml |
| 13-Sep-2026 22:50:29 | nosedir/xml/test_tool_image_pbcor/ |
| 13-Sep-2026 22:50:29 | nosedir/xml/test_tool_image_pbcor/nose.xml |
| 13-Sep-2026 22:50:29 | nosedir/xml/test_tool_image_pv/ |
| 13-Sep-2026 22:50:29 | nosedir/xml/test_tool_image_pv/nose.xml |
| 13-Sep-2026 22:50:29 | nosedir/xml/test_tool_sdm_toms/ |
| 13-Sep-2026 22:50:29 | nosedir/xml/test_tool_sdm_toms/nose.xml |
| 13-Sep-2026 22:50:29 | nosedir/xml/test_tool_componentlist/ |
| 13-Sep-2026 22:50:29 | nosedir/xml/test_tool_componentlist/nose.xml |
| 13-Sep-2026 22:50:29 | nosedir/xml/test_tool_image_regrid/ |
| 13-Sep-2026 22:50:29 | nosedir/xml/test_tool_image_regrid/nose.xml |
| 13-Sep-2026 22:50:29 | nosedir/xml/test_tool_synthesisutils/ |
| 13-Sep-2026 22:50:29 | nosedir/xml/test_tool_synthesisutils/nose.xml |
| 13-Sep-2026 22:50:29 | nosedir/xml/test_tool_table/ |
| 13-Sep-2026 22:50:29 | nosedir/xml/test_tool_table/nose.xml |
| 13-Sep-2026 22:50:29 | nosedir/xml/test_tool_msmetadata/ |
| 13-Sep-2026 22:50:29 | nosedir/xml/test_tool_msmetadata/nose.xml |
| 13-Sep-2026 22:50:29 | nosedir/xml/test_tool_image_statistics/ |
| 13-Sep-2026 22:50:29 | nosedir/xml/test_tool_image_statistics/nose.xml |
| 13-Sep-2026 22:50:29 | nosedir/xml/test_tool_quanta/ |
| 13-Sep-2026 22:50:29 | nosedir/xml/test_tool_quanta/nose.xml |
| 13-Sep-2026 22:50:29 | nosedir/xml/test_tool_coordsys/ |
| 13-Sep-2026 22:50:29 | nosedir/xml/test_tool_coordsys/nose.xml |
| 13-Sep-2026 22:50:29 | nosedir/xml/test_tool_image_collapse/ |
| 13-Sep-2026 22:50:29 | nosedir/xml/test_tool_image_collapse/nose.xml |
| 13-Sep-2026 22:50:29 | nosedir/xml/test_tool_calibrater/ |
| 13-Sep-2026 22:50:29 | nosedir/xml/test_tool_calibrater/nose.xml |
| 13-Sep-2026 22:50:29 | nosedir/xml/test_tool_measures/ |
| 13-Sep-2026 22:50:29 | nosedir/xml/test_tool_measures/nose.xml |
| 13-Sep-2026 22:50:29 | nosedir/xml/test_tool_sdm/ |
| 13-Sep-2026 22:50:29 | nosedir/xml/test_tool_sdm/nose.xml |
| 13-Sep-2026 22:50:29 | nosedir/xml/test_tool_msuvbinner/ |
| 13-Sep-2026 22:50:29 | nosedir/xml/test_tool_msuvbinner/nose.xml |
| 13-Sep-2026 22:50:29 | nosedir/xml/test_tool_ms_createmultims/ |
| 13-Sep-2026 22:50:29 | nosedir/xml/test_tool_ms_createmultims/nose.xml |
| 13-Sep-2026 22:50:29 | nosedir/xml/test_tool_ms/ |
| 13-Sep-2026 22:50:29 | nosedir/xml/test_tool_ms/nose.xml |
| 13-Sep-2026 22:50:29 | nosedir/xml/test_tool_linearmosaic/ |
| 13-Sep-2026 22:50:29 | nosedir/xml/test_tool_linearmosaic/nose.xml |
| 13-Sep-2026 22:50:29 | nosedir/xml/test_tool_image_subimage/ |
| 13-Sep-2026 22:50:29 | nosedir/xml/test_tool_image_subimage/nose.xml |
| 13-Sep-2026 22:50:29 | nosedir/xml/test_tool_logsink/ |
| 13-Sep-2026 22:50:29 | nosedir/xml/test_tool_logsink/nose.xml |
| 13-Sep-2026 22:50:29 | nosedir/xml/test_tool_image_deviation/ |
| 13-Sep-2026 22:50:29 | nosedir/xml/test_tool_image_deviation/nose.xml |
| 13-Sep-2026 22:50:29 | nosedir/xml/test_tool_image_rebin/ |
| 13-Sep-2026 22:50:29 | nosedir/xml/test_tool_image_rebin/nose.xml |
| 13-Sep-2026 22:50:29 | nosedir/xml/test_tool_image_fitprofile/ |
| 13-Sep-2026 22:50:29 | nosedir/xml/test_tool_image_fitprofile/nose.xml |
| 13-Sep-2026 22:50:29 | nosedir/xml/test_tool_agentflagger/ |
| 13-Sep-2026 22:50:29 | nosedir/xml/test_tool_agentflagger/nose.xml |
| 13-Sep-2026 22:50:29 | nosedir/xml/test_tool_imagepol/ |
| 13-Sep-2026 22:50:29 | nosedir/xml/test_tool_imagepol/nose.xml |
| 13-Sep-2026 22:50:29 | nosedir/test_tool_image_transpose/ |
| 13-Sep-2026 22:50:29 | nosedir/test_tool_image_transpose/test_tool_image_transpose.py |
| 13-Sep-2026 22:50:29 | nosedir/test_tool_image_transpose/conftest.py |
| 13-Sep-2026 22:50:29 | nosedir/test_tool_image_transpose/casa-20260914-024141.log |
| 13-Sep-2026 22:50:29 | nosedir/test_tool_image_transpose/short_summary.log |
| 13-Sep-2026 22:50:29 | nosedir/test_tool_regionmanager/ |
| 13-Sep-2026 22:50:29 | nosedir/test_tool_regionmanager/test_tool_regionmanager.py |
| 13-Sep-2026 22:50:29 | nosedir/test_tool_regionmanager/conftest.py |
| 13-Sep-2026 22:50:29 | nosedir/test_tool_regionmanager/casa-20260914-024142.log |
| 13-Sep-2026 22:50:29 | nosedir/test_tool_regionmanager/short_summary.log |
| 13-Sep-2026 22:50:29 | nosedir/test_tool_vpmanager/ |
| 13-Sep-2026 22:50:29 | nosedir/test_tool_vpmanager/test_tool_vpmanager.py |
| 13-Sep-2026 22:50:29 | nosedir/test_tool_vpmanager/conftest.py |
| 13-Sep-2026 22:50:29 | nosedir/test_tool_vpmanager/casa-20260914-024151.log |
| 13-Sep-2026 22:50:29 | nosedir/test_tool_vpmanager/short_summary.log |
| 13-Sep-2026 22:50:29 | nosedir/test_tool_simulator/ |
| 13-Sep-2026 22:50:29 | nosedir/test_tool_simulator/test_tool_simulator.py |
| 13-Sep-2026 22:50:29 | nosedir/test_tool_simulator/conftest.py |
| 13-Sep-2026 22:50:29 | nosedir/test_tool_simulator/casa-20260914-024153.log |
| 13-Sep-2026 22:50:29 | nosedir/test_tool_simulator/short_summary.log |
| 13-Sep-2026 22:50:29 | nosedir/summary_of_failed.log |
| 13-Sep-2026 22:50:29 | nosedir/test_tool_image/ |
| 13-Sep-2026 22:50:29 | nosedir/test_tool_image/test_tool_image.py |
| 13-Sep-2026 22:50:29 | nosedir/test_tool_image/conftest.py |
| 13-Sep-2026 22:50:29 | nosedir/test_tool_image/casa-20260914-024159.log |
| 13-Sep-2026 22:50:29 | nosedir/test_tool_image/short_summary.log |
| 13-Sep-2026 22:50:29 | nosedir/test_tool_calanalysis/ |
| 13-Sep-2026 22:50:29 | nosedir/test_tool_calanalysis/test_tool_calanalysis.py |
| 13-Sep-2026 22:50:29 | nosedir/test_tool_calanalysis/conftest.py |
| 13-Sep-2026 22:50:29 | nosedir/test_tool_calanalysis/casa-20260914-024231.log |
| 13-Sep-2026 22:50:29 | nosedir/test_tool_calanalysis/short_summary.log |
| 13-Sep-2026 22:50:29 | nosedir/test_tool_image_pbcor/ |
| 13-Sep-2026 22:50:29 | nosedir/test_tool_image_pbcor/test_tool_image_pbcor.py |
| 13-Sep-2026 22:50:29 | nosedir/test_tool_image_pbcor/conftest.py |
| 13-Sep-2026 22:50:29 | nosedir/test_tool_image_pbcor/casa-20260914-024233.log |
| 13-Sep-2026 22:50:29 | nosedir/test_tool_image_pbcor/short_summary.log |
| 13-Sep-2026 22:50:29 | nosedir/test_tool_image_pv/ |
| 13-Sep-2026 22:50:29 | nosedir/test_tool_image_pv/test_tool_image_pv.py |
| 13-Sep-2026 22:50:29 | nosedir/test_tool_image_pv/conftest.py |
| 13-Sep-2026 22:50:29 | nosedir/test_tool_image_pv/casa-20260914-024233.log |
| 13-Sep-2026 22:50:29 | nosedir/test_tool_image_pv/short_summary.log |
| 13-Sep-2026 22:50:29 | nosedir/test_tool_sdm_toms/ |
| 13-Sep-2026 22:50:29 | nosedir/test_tool_sdm_toms/test_tool_sdm_toms.py |
| 13-Sep-2026 22:50:29 | nosedir/test_tool_sdm_toms/conftest.py |
| 13-Sep-2026 22:50:29 | nosedir/test_tool_sdm_toms/casa-20260914-024235.log |
| 13-Sep-2026 22:50:29 | nosedir/test_tool_sdm_toms/short_summary.log |
| 13-Sep-2026 22:50:29 | nosedir/test_tool_componentlist/ |
| 13-Sep-2026 22:50:29 | nosedir/test_tool_componentlist/test_tool_componentlist.py |
| 13-Sep-2026 22:50:29 | nosedir/test_tool_componentlist/conftest.py |
| 13-Sep-2026 22:50:29 | nosedir/test_tool_componentlist/casa-20260914-024448.log |
| 13-Sep-2026 22:50:29 | nosedir/test_tool_componentlist/short_summary.log |
| 13-Sep-2026 22:50:29 | nosedir/test_tool_image_regrid/ |
| 13-Sep-2026 22:50:29 | nosedir/test_tool_image_regrid/test_tool_image_regrid.py |
| 13-Sep-2026 22:50:29 | nosedir/test_tool_image_regrid/conftest.py |
| 13-Sep-2026 22:50:29 | nosedir/test_tool_image_regrid/casa-20260914-024448.log |
| 13-Sep-2026 22:50:29 | nosedir/test_tool_image_regrid/short_summary.log |
| 13-Sep-2026 22:50:29 | nosedir/test_tool_synthesisutils/ |
| 13-Sep-2026 22:50:29 | nosedir/test_tool_synthesisutils/test_tool_synthesisutils.py |
| 13-Sep-2026 22:50:29 | nosedir/test_tool_synthesisutils/conftest.py |
| 13-Sep-2026 22:50:29 | nosedir/test_tool_synthesisutils/casa-20260914-024450.log |
| 13-Sep-2026 22:50:29 | nosedir/test_tool_synthesisutils/short_summary.log |
| 13-Sep-2026 22:50:29 | nosedir/test_tool_table/ |
| 13-Sep-2026 22:50:29 | nosedir/test_tool_table/test_tool_table.py |
| 13-Sep-2026 22:50:29 | nosedir/test_tool_table/conftest.py |
| 13-Sep-2026 22:50:29 | nosedir/test_tool_table/casa-20260914-024455.log |
| 13-Sep-2026 22:50:29 | nosedir/test_tool_table/short_summary.log |
| 13-Sep-2026 22:50:29 | nosedir/test_tool_msmetadata/ |
| 13-Sep-2026 22:50:29 | nosedir/test_tool_msmetadata/test_tool_msmetadata.py |
| 13-Sep-2026 22:50:29 | nosedir/test_tool_msmetadata/conftest.py |
| 13-Sep-2026 22:50:29 | nosedir/test_tool_msmetadata/casa-20260914-024456.log |
| 13-Sep-2026 22:50:29 | nosedir/test_tool_msmetadata/short_summary.log |
| 13-Sep-2026 22:50:29 | nosedir/test_tool_image_statistics/ |
| 13-Sep-2026 22:50:29 | nosedir/test_tool_image_statistics/test_tool_image_statistics.py |
| 13-Sep-2026 22:50:29 | nosedir/test_tool_image_statistics/conftest.py |
| 13-Sep-2026 22:50:29 | nosedir/test_tool_image_statistics/casa-20260914-024459.log |
| 13-Sep-2026 22:50:29 | nosedir/test_tool_image_statistics/short_summary.log |
| 13-Sep-2026 22:50:29 | nosedir/test_tool_quanta/ |
| 13-Sep-2026 22:50:29 | nosedir/test_tool_quanta/test_tool_quanta.py |
| 13-Sep-2026 22:50:29 | nosedir/test_tool_quanta/conftest.py |
| 13-Sep-2026 22:50:29 | nosedir/test_tool_quanta/casa-20260914-024628.log |
| 13-Sep-2026 22:50:29 | nosedir/test_tool_quanta/short_summary.log |
| 13-Sep-2026 22:50:29 | nosedir/test_tool_coordsys/ |
| 13-Sep-2026 22:50:29 | nosedir/test_tool_coordsys/test_tool_coordsys.py |
| 13-Sep-2026 22:50:29 | nosedir/test_tool_coordsys/conftest.py |
| 13-Sep-2026 22:50:29 | nosedir/test_tool_coordsys/casa-20260914-024628.log |
| 13-Sep-2026 22:50:29 | nosedir/test_tool_coordsys/short_summary.log |
| 13-Sep-2026 22:50:29 | nosedir/test_tool_image_collapse/ |
| 13-Sep-2026 22:50:29 | nosedir/test_tool_image_collapse/test_tool_image_collapse.py |
| 13-Sep-2026 22:50:29 | nosedir/test_tool_image_collapse/conftest.py |
| 13-Sep-2026 22:50:29 | nosedir/test_tool_image_collapse/casa-20260914-024629.log |
| 13-Sep-2026 22:50:29 | nosedir/test_tool_image_collapse/short_summary.log |
| 13-Sep-2026 22:50:29 | nosedir/test_tool_calibrater/ |
| 13-Sep-2026 22:50:29 | nosedir/test_tool_calibrater/test_tool_calibrater.py |
| 13-Sep-2026 22:50:29 | nosedir/test_tool_calibrater/conftest.py |
| 13-Sep-2026 22:50:29 | nosedir/test_tool_calibrater/casa-20260914-024630.log |
| 13-Sep-2026 22:50:29 | nosedir/test_tool_calibrater/short_summary.log |
| 13-Sep-2026 22:50:29 | nosedir/test_tool_measures/ |
| 13-Sep-2026 22:50:29 | nosedir/test_tool_measures/test_tool_measures.py |
| 13-Sep-2026 22:50:29 | nosedir/test_tool_measures/conftest.py |
| 13-Sep-2026 22:50:29 | nosedir/test_tool_measures/casa-20260914-024852.log |
| 13-Sep-2026 22:50:29 | nosedir/test_tool_measures/short_summary.log |
| 13-Sep-2026 22:50:29 | nosedir/test_tool_sdm/ |
| 13-Sep-2026 22:50:29 | nosedir/test_tool_sdm/test_tool_sdm.py |
| 13-Sep-2026 22:50:29 | nosedir/test_tool_sdm/conftest.py |
| 13-Sep-2026 22:50:29 | nosedir/test_tool_sdm/casa-20260914-024852.log |
| 13-Sep-2026 22:50:29 | nosedir/test_tool_sdm/short_summary.log |
| 13-Sep-2026 22:50:29 | nosedir/test_tool_msuvbinner/ |
| 13-Sep-2026 22:50:29 | nosedir/test_tool_msuvbinner/test_tool_msuvbinner.py |
| 13-Sep-2026 22:50:29 | nosedir/test_tool_msuvbinner/conftest.py |
| 13-Sep-2026 22:50:29 | nosedir/test_tool_msuvbinner/casa-20260914-024900.log |
| 13-Sep-2026 22:50:29 | nosedir/test_tool_msuvbinner/short_summary.log |
| 13-Sep-2026 22:50:29 | nosedir/test_tool_ms_createmultims/ |
| 13-Sep-2026 22:50:29 | nosedir/test_tool_ms_createmultims/test_tool_ms_createmultims.py |
| 13-Sep-2026 22:50:29 | nosedir/test_tool_ms_createmultims/conftest.py |
| 13-Sep-2026 22:50:29 | nosedir/test_tool_ms_createmultims/casa-20260914-024901.log |
| 13-Sep-2026 22:50:29 | nosedir/test_tool_ms_createmultims/short_summary.log |
| 13-Sep-2026 22:50:29 | nosedir/test_tool_ms/ |
| 13-Sep-2026 22:50:29 | nosedir/test_tool_ms/test_tool_ms.py |
| 13-Sep-2026 22:50:29 | nosedir/test_tool_ms/conftest.py |
| 13-Sep-2026 22:50:29 | nosedir/test_tool_ms/casa-20260914-024905.log |
| 13-Sep-2026 22:50:29 | nosedir/test_tool_ms/short_summary.log |
| 13-Sep-2026 22:50:29 | nosedir/test_tool_linearmosaic/ |
| 13-Sep-2026 22:50:29 | nosedir/test_tool_linearmosaic/test_tool_linearmosaic.py |
| 13-Sep-2026 22:50:29 | nosedir/test_tool_linearmosaic/conftest.py |
| 13-Sep-2026 22:50:29 | nosedir/test_tool_linearmosaic/casa-20260914-024931.log |
| 13-Sep-2026 22:50:29 | nosedir/test_tool_linearmosaic/short_summary.log |
| 13-Sep-2026 22:50:29 | nosedir/test_tool_image_subimage/ |
| 13-Sep-2026 22:50:29 | nosedir/test_tool_image_subimage/test_tool_image_subimage.py |
| 13-Sep-2026 22:50:29 | nosedir/test_tool_image_subimage/conftest.py |
| 13-Sep-2026 22:50:29 | nosedir/test_tool_image_subimage/casa-20260914-024937.log |
| 13-Sep-2026 22:50:29 | nosedir/test_tool_image_subimage/short_summary.log |
| 13-Sep-2026 22:50:29 | nosedir/test_tool_logsink/ |
| 13-Sep-2026 22:50:29 | nosedir/test_tool_logsink/test_tool_logsink.py |
| 13-Sep-2026 22:50:29 | nosedir/test_tool_logsink/conftest.py |
| 13-Sep-2026 22:50:29 | nosedir/test_tool_logsink/casa-20260914-024938.log |
| 13-Sep-2026 22:50:29 | nosedir/test_tool_logsink/short_summary.log |
| 13-Sep-2026 22:50:29 | nosedir/test_tool_image_deviation/ |
| 13-Sep-2026 22:50:29 | nosedir/test_tool_image_deviation/test_tool_image_deviation.py |
| 13-Sep-2026 22:50:29 | nosedir/test_tool_image_deviation/conftest.py |
| 13-Sep-2026 22:50:29 | nosedir/test_tool_image_deviation/casa-20260914-024938.log |
| 13-Sep-2026 22:50:29 | nosedir/test_tool_image_deviation/short_summary.log |
| 13-Sep-2026 22:50:29 | nosedir/test_tool_image_rebin/ |
| 13-Sep-2026 22:50:29 | nosedir/test_tool_image_rebin/test_tool_image_rebin.py |
| 13-Sep-2026 22:50:29 | nosedir/test_tool_image_rebin/conftest.py |
| 13-Sep-2026 22:50:29 | nosedir/test_tool_image_rebin/casa-20260914-024942.log |
| 13-Sep-2026 22:50:29 | nosedir/test_tool_image_rebin/short_summary.log |
| 13-Sep-2026 22:50:29 | nosedir/test_tool_image_fitprofile/ |
| 13-Sep-2026 22:50:29 | nosedir/test_tool_image_fitprofile/test_tool_image_fitprofile.py |
| 13-Sep-2026 22:50:29 | nosedir/test_tool_image_fitprofile/conftest.py |
| 13-Sep-2026 22:50:29 | nosedir/test_tool_image_fitprofile/casa-20260914-024943.log |
| 13-Sep-2026 22:50:29 | nosedir/test_tool_image_fitprofile/short_summary.log |
| 13-Sep-2026 22:50:29 | nosedir/test_tool_agentflagger/ |
| 13-Sep-2026 22:50:29 | nosedir/test_tool_agentflagger/test_tool_agentflagger.py |
| 13-Sep-2026 22:50:29 | nosedir/test_tool_agentflagger/conftest.py |
| 13-Sep-2026 22:50:29 | nosedir/test_tool_agentflagger/casa-20260914-024948.log |
| 13-Sep-2026 22:50:29 | nosedir/test_tool_agentflagger/short_summary.log |
| 13-Sep-2026 22:50:29 | nosedir/test_tool_imagepol/ |
| 13-Sep-2026 22:50:29 | nosedir/test_tool_imagepol/test_tool_imagepol.py |
| 13-Sep-2026 22:50:29 | nosedir/test_tool_imagepol/conftest.py |
| 13-Sep-2026 22:50:29 | nosedir/test_tool_imagepol/casa-20260914-025028.log |
| 13-Sep-2026 22:50:29 | nosedir/test_tool_imagepol/short_summary.log |
| 13-Sep-2026 22:50:29 | total 77996 |
| 13-Sep-2026 22:50:29 | -rw-r--r-- 1 casaci 15001 161131 Sep 14 02:37 casatestutils-6.7.7.7a14882.dev1-py3-none-any.whl |
| 13-Sep-2026 22:50:29 | -rw-r--r-- 1 casaci 15001 79346756 Sep 14 02:37 casatools-6.7.7.7a14882.dev1-cp312-cp312-manylinux_2_28_x86_64.whl |
| 13-Sep-2026 22:50:29 | -rw-r--r-- 1 casaci root 4340 Sep 14 02:50 test_tool_agentflagger.xml |
| 13-Sep-2026 22:50:29 | -rw-r--r-- 1 casaci root 1006 Sep 14 02:50 test_tool_calanalysis.xml |
| 13-Sep-2026 22:50:29 | -rw-r--r-- 1 casaci root 2667 Sep 14 02:50 test_tool_calibrater.xml |
| 13-Sep-2026 22:50:29 | -rw-r--r-- 1 casaci root 687 Sep 14 02:50 test_tool_componentlist.xml |
| 13-Sep-2026 22:50:29 | -rw-r--r-- 1 casaci root 7467 Sep 14 02:50 test_tool_coordsys.xml |
| 13-Sep-2026 22:50:29 | -rw-r--r-- 1 casaci root 12935 Sep 14 02:50 test_tool_image.xml |
| 13-Sep-2026 22:50:29 | -rw-r--r-- 1 casaci root 2220 Sep 14 02:50 test_tool_image_collapse.xml |
| 13-Sep-2026 22:50:29 | -rw-r--r-- 1 casaci root 1048 Sep 14 02:50 test_tool_image_deviation.xml |
| 13-Sep-2026 22:50:29 | -rw-r--r-- 1 casaci root 2574 Sep 14 02:50 test_tool_image_fitprofile.xml |
| 13-Sep-2026 22:50:29 | -rw-r--r-- 1 casaci root 1178 Sep 14 02:50 test_tool_image_pbcor.xml |
| 13-Sep-2026 22:50:29 | -rw-r--r-- 1 casaci root 883 Sep 14 02:50 test_tool_image_pv.xml |
| 13-Sep-2026 22:50:29 | -rw-r--r-- 1 casaci root 1006 Sep 14 02:50 test_tool_image_rebin.xml |
| 13-Sep-2026 22:50:29 | -rw-r--r-- 1 casaci root 1336 Sep 14 02:50 test_tool_image_regrid.xml |
| 13-Sep-2026 22:50:29 | -rw-r--r-- 1 casaci root 1639 Sep 14 02:50 test_tool_image_statistics.xml |
| 13-Sep-2026 22:50:29 | -rw-r--r-- 1 casaci root 765 Sep 14 02:50 test_tool_image_subimage.xml |
| 13-Sep-2026 22:50:29 | -rw-r--r-- 1 casaci root 890 Sep 14 02:50 test_tool_image_transpose.xml |
| 13-Sep-2026 22:50:29 | -rw-r--r-- 1 casaci root 1966 Sep 14 02:50 test_tool_imagepol.xml |
| 13-Sep-2026 22:50:29 | -rw-r--r-- 1 casaci root 838 Sep 14 02:50 test_tool_linearmosaic.xml |
| 13-Sep-2026 22:50:29 | -rw-r--r-- 1 casaci root 669 Sep 14 02:50 test_tool_logsink.xml |
| 13-Sep-2026 22:50:29 | -rw-r--r-- 1 casaci root 549 Sep 14 02:50 test_tool_measures.xml |
| 13-Sep-2026 22:50:29 | -rw-r--r-- 1 casaci root 5224 Sep 14 02:50 test_tool_ms.xml |
| 13-Sep-2026 22:50:29 | -rw-r--r-- 1 casaci root 367 Sep 14 02:50 test_tool_ms_createmultims.xml |
| 13-Sep-2026 22:50:29 | -rw-r--r-- 1 casaci root 2099 Sep 14 02:50 test_tool_ms_statwt.xml |
| 13-Sep-2026 22:50:29 | -rw-r--r-- 1 casaci root 8633 Sep 14 02:50 test_tool_msmetadata.xml |
| 13-Sep-2026 22:50:29 | -rw-r--r-- 1 casaci root 359 Sep 14 02:50 test_tool_msuvbinner.xml |
| 13-Sep-2026 22:50:29 | -rw-r--r-- 1 casaci root 1171 Sep 14 02:50 test_tool_quanta.xml |
| 13-Sep-2026 22:50:29 | -rw-r--r-- 1 casaci root 3975 Sep 14 02:50 test_tool_regionmanager.xml |
| 13-Sep-2026 22:50:29 | -rw-r--r-- 1 casaci root 2071 Sep 14 02:50 test_tool_sdm.xml |
| 13-Sep-2026 22:50:29 | -rw-r--r-- 1 casaci root 2190 Sep 14 02:50 test_tool_sdm_toms.xml |
| 13-Sep-2026 22:50:29 | -rw-r--r-- 1 casaci root 670 Sep 14 02:50 test_tool_simulator.xml |
| 13-Sep-2026 22:50:29 | -rw-r--r-- 1 casaci root 1716 Sep 14 02:50 test_tool_synthesisutils.xml |
| 13-Sep-2026 22:50:29 | -rw-r--r-- 1 casaci root 1462 Sep 14 02:50 test_tool_table.xml |
| 13-Sep-2026 22:50:29 | -rw-r--r-- 1 casaci root 1717 Sep 14 02:50 test_tool_vpmanager.xml |
| 13-Sep-2026 22:50:29 | -rw-r--r-- 1 casaci root 186846 Sep 14 02:50 work-manylinux_228_casatools-3.12.tar.gz |
| 13-Sep-2026 22:50:29 | Done packaging working directory |
| 13-Sep-2026 22:50:29 | Finished task 'Tar work directory' with result: Success |
| 13-Sep-2026 22:50:29 | Starting task 'Parse tests' of type 'com.atlassian.bamboo.plugins.testresultparser:task.testresultparser.junit' |
| 13-Sep-2026 22:50:29 | Parsing test results under /opt/ci_workspace/casa/bamboo/agent4/xml-data/build-dir/CASASPECS-DEVTESTPY312149-TTOMLPY312... |
| 13-Sep-2026 22:50:29 | Finished task 'Parse tests' with result: Success |
| 13-Sep-2026 22:50:29 | Substituting variable: ${bamboo.agentId} with 153550852 |
| 13-Sep-2026 22:50:29 | Substituting variable: ${bamboo.repository.branch.name} with CAS-14882 |
| 13-Sep-2026 22:50:29 | Substituting variable: ${bamboo.agentId} with 153550852 |
| 13-Sep-2026 22:50:29 | Substituting variable: ${bamboo.agentId} with 153550852 |
| 13-Sep-2026 22:50:29 | Substituting variable: ${bamboo.agentId} with 153550852 |
| 13-Sep-2026 22:50:29 | Substituting variable: ${bamboo.agentId} with 153550852 |
| 13-Sep-2026 22:50:29 | Substituting variable: ${bamboo.agentId} with 153550852 |
| 13-Sep-2026 22:50:29 | Starting task 'Upload wheel' of type 'com.atlassian.bamboo.plugins.scripttask:task.builder.script' |
| 13-Sep-2026 22:50:29 | Beginning to execute external process for build 'CASASPECS - Dev Test 3.12 - CAS-14882 - Test Tools Many Linux 2.28 Py3.12 #1 (CASASPECS-DEVTESTPY312149-TTOMLPY312-1)' ... running command line: /opt/ci_workspace/casa/bamboo/agent4/temp/CASASPECS-DEVTESTPY312149-TTOMLPY312-1-ScriptBuildTask-9742724408598707442.sh ... in: /opt/ci_workspace/casa/bamboo/agent4/xml-data/build-dir/CASASPECS-DEVTESTPY312149-TTOMLPY312 |
| 13-Sep-2026 22:50:29 | Collecting twine |
| 13-Sep-2026 22:50:29 | Downloading twine-7.0.0-py3-none-any.whl (43 kB) |
| 13-Sep-2026 22:50:29 | ━━━━━━━━━━━━━━━━━━━━━━━━━━━━━━━━━━━━━━━━ 43.2/43.2 kB 6.7 MB/s eta 0:00:00 |
| 13-Sep-2026 22:50:29 | Collecting keyring>=21.2.0 |
| 13-Sep-2026 22:50:29 | Downloading keyring-25.7.0-py3-none-any.whl (39 kB) |
| 13-Sep-2026 22:50:29 | Collecting requests-toolbelt!=0.9.0,>=0.8.0 |
| 13-Sep-2026 22:50:29 | Downloading requests_toolbelt-1.0.0-py2.py3-none-any.whl (54 kB) |
| 13-Sep-2026 22:50:29 | ━━━━━━━━━━━━━━━━━━━━━━━━━━━━━━━━━━━━━━━━ 54.5/54.5 kB 29.0 MB/s eta 0:00:00 |
| 13-Sep-2026 22:50:29 | Collecting urllib3>=1.26.0 |
| 13-Sep-2026 22:50:29 | Downloading urllib3-2.7.0-py3-none-any.whl (131 kB) |
| 13-Sep-2026 22:50:29 | ━━━━━━━━━━━━━━━━━━━━━━━━━━━━━━━━━━━━━━ 131.1/131.1 kB 28.4 MB/s eta 0:00:00 |
| 13-Sep-2026 22:50:29 | Collecting readme-renderer>=35.0 |
| 13-Sep-2026 22:50:29 | Downloading readme_renderer-46.0-py3-none-any.whl (14 kB) |
| 13-Sep-2026 22:50:29 | Collecting requests>=2.20 |
| 13-Sep-2026 22:50:29 | Downloading requests-2.34.2-py3-none-any.whl (73 kB) |
| 13-Sep-2026 22:50:29 | ━━━━━━━━━━━━━━━━━━━━━━━━━━━━━━━━━━━━━━━━ 73.1/73.1 kB 32.9 MB/s eta 0:00:00 |
| 13-Sep-2026 22:50:29 | Collecting rfc3986>=1.4.0 |
| 13-Sep-2026 22:50:29 | Downloading rfc3986-2.0.0-py2.py3-none-any.whl (31 kB) |
| 13-Sep-2026 22:50:29 | Collecting packaging>=26.1 |
| 13-Sep-2026 22:50:29 | Downloading packaging-26.3-py3-none-any.whl (129 kB) |
| 13-Sep-2026 22:50:29 | ━━━━━━━━━━━━━━━━━━━━━━━━━━━━━━━━━━━━━━ 130.0/130.0 kB 46.0 MB/s eta 0:00:00 |
| 13-Sep-2026 22:50:29 | Collecting rich>=14.3.3 |
| 13-Sep-2026 22:50:30 | Downloading rich-15.0.0-py3-none-any.whl (310 kB) |
| 13-Sep-2026 22:50:30 | ━━━━━━━━━━━━━━━━━━━━━━━━━━━━━━━━━━━━━━ 310.7/310.7 kB 58.9 MB/s eta 0:00:00 |
| 13-Sep-2026 22:50:30 | Collecting id |
| 13-Sep-2026 22:50:30 | Downloading id-1.6.1-py3-none-any.whl (14 kB) |
| 13-Sep-2026 22:50:30 | Collecting jaraco.classes |
| 13-Sep-2026 22:50:30 | Downloading jaraco.classes-3.4.0-py3-none-any.whl (6.8 kB) |
| 13-Sep-2026 22:50:30 | Collecting jaraco.context |
| 13-Sep-2026 22:50:30 | Downloading jaraco_context-6.1.2-py3-none-any.whl (7.9 kB) |
| 13-Sep-2026 22:50:30 | Collecting jaraco.functools |
| 13-Sep-2026 22:50:30 | Downloading jaraco_functools-4.6.0-py3-none-any.whl (11 kB) |
| 13-Sep-2026 22:50:30 | Collecting SecretStorage>=3.2 |
| 13-Sep-2026 22:50:30 | Downloading secretstorage-3.5.0-py3-none-any.whl (15 kB) |
| 13-Sep-2026 22:50:30 | Collecting importlib_metadata>=4.11.4 |
| 13-Sep-2026 22:50:30 | Downloading importlib_metadata-9.0.1-py3-none-any.whl (27 kB) |
| 13-Sep-2026 22:50:30 | Collecting jeepney>=0.4.2 |
| 13-Sep-2026 22:50:30 | Downloading jeepney-0.9.0-py3-none-any.whl (49 kB) |
| 13-Sep-2026 22:50:30 | ━━━━━━━━━━━━━━━━━━━━━━━━━━━━━━━━━━━━━━━━ 49.0/49.0 kB 32.3 MB/s eta 0:00:00 |
| 13-Sep-2026 22:50:30 | Collecting docutils>=0.21.2 |
| 13-Sep-2026 22:50:30 | Downloading docutils-0.23-py3-none-any.whl (634 kB) |
| 13-Sep-2026 22:50:30 | ━━━━━━━━━━━━━━━━━━━━━━━━━━━━━━━━━━━━━ 634.7/634.7 kB 100.1 MB/s eta 0:00:00 |
| 13-Sep-2026 22:50:30 | Collecting Pygments>=2.5.1 |
| 13-Sep-2026 22:50:30 | Downloading pygments-2.21.0-py3-none-any.whl (1.3 MB) |
| 13-Sep-2026 22:50:30 | ━━━━━━━━━━━━━━━━━━━━━━━━━━━━━━━━━━━━━━━━ 1.3/1.3 MB 123.0 MB/s eta 0:00:00 |
| 13-Sep-2026 22:50:30 | Collecting nh3>=0.2.14 |
| 13-Sep-2026 22:50:30 | Downloading nh3-0.3.7-cp38-abi3-manylinux_2_17_x86_64.manylinux2014_x86_64.whl (832 kB) |
| 13-Sep-2026 22:50:30 | ━━━━━━━━━━━━━━━━━━━━━━━━━━━━━━━━━━━━━━ 832.2/832.2 kB 98.4 MB/s eta 0:00:00 |
| 13-Sep-2026 22:50:30 | Collecting charset_normalizer<4,>=2 |
| 13-Sep-2026 22:50:30 | Downloading charset_normalizer-3.5.1-cp310-cp310-manylinux2014_x86_64.manylinux_2_17_x86_64.manylinux_2_28_x86_64.whl (261 kB) |
| 13-Sep-2026 22:50:30 | ━━━━━━━━━━━━━━━━━━━━━━━━━━━━━━━━━━━━━━ 261.6/261.6 kB 75.2 MB/s eta 0:00:00 |
| 13-Sep-2026 22:50:30 | Collecting certifi>=2023.5.7 |
| 13-Sep-2026 22:50:30 | Downloading certifi-2026.7.22-py3-none-any.whl (136 kB) |
| 13-Sep-2026 22:50:30 | ━━━━━━━━━━━━━━━━━━━━━━━━━━━━━━━━━━━━━━ 137.0/137.0 kB 53.5 MB/s eta 0:00:00 |
| 13-Sep-2026 22:50:30 | Collecting idna<4,>=2.5 |
| 13-Sep-2026 22:50:30 | Downloading idna-3.19-py3-none-any.whl (68 kB) |
| 13-Sep-2026 22:50:30 | ━━━━━━━━━━━━━━━━━━━━━━━━━━━━━━━━━━━━━━━━ 68.5/68.5 kB 35.7 MB/s eta 0:00:00 |
| 13-Sep-2026 22:50:30 | Collecting markdown-it-py>=2.2.0 |
| 13-Sep-2026 22:50:30 | Downloading markdown_it_py-4.2.0-py3-none-any.whl (91 kB) |
| 13-Sep-2026 22:50:30 | ━━━━━━━━━━━━━━━━━━━━━━━━━━━━━━━━━━━━━━━━ 91.7/91.7 kB 36.1 MB/s eta 0:00:00 |
| 13-Sep-2026 22:50:30 | Collecting zipp>=3.20 |
| 13-Sep-2026 22:50:30 | Downloading zipp-4.1.0-py3-none-any.whl (10 kB) |
| 13-Sep-2026 22:50:30 | Collecting mdurl~=0.1 |
| 13-Sep-2026 22:50:30 | Downloading mdurl-0.1.2-py3-none-any.whl (10.0 kB) |
| 13-Sep-2026 22:50:31 | Collecting cryptography>=2.0 |
| 13-Sep-2026 22:50:31 | Downloading cryptography-50.0.1-cp39-abi3-manylinux_2_28_x86_64.whl (4.8 MB) |
| 13-Sep-2026 22:50:31 | ━━━━━━━━━━━━━━━━━━━━━━━━━━━━━━━━━━━━━━━━ 4.8/4.8 MB 111.3 MB/s eta 0:00:00 |
| 13-Sep-2026 22:50:31 | Collecting more-itertools |
| 13-Sep-2026 22:50:31 | Downloading more_itertools-11.1.0-py3-none-any.whl (72 kB) |
| 13-Sep-2026 22:50:31 | ━━━━━━━━━━━━━━━━━━━━━━━━━━━━━━━━━━━━━━━━ 72.2/72.2 kB 39.6 MB/s eta 0:00:00 |
| 13-Sep-2026 22:50:31 | Collecting backports.tarfile |
| 13-Sep-2026 22:50:31 | Downloading backports.tarfile-1.2.0-py3-none-any.whl (30 kB) |
| 13-Sep-2026 22:50:31 | Collecting typing-extensions>=4.13.2 |
| 13-Sep-2026 22:50:31 | Downloading typing_extensions-4.16.0-py3-none-any.whl (45 kB) |
| 13-Sep-2026 22:50:31 | ━━━━━━━━━━━━━━━━━━━━━━━━━━━━━━━━━━━━━━━━ 45.6/45.6 kB 22.3 MB/s eta 0:00:00 |
| 13-Sep-2026 22:50:31 | Collecting cffi>=2.0.0 |
| 13-Sep-2026 22:50:31 | Downloading cffi-2.1.1-cp310-cp310-manylinux2014_x86_64.manylinux_2_17_x86_64.whl (218 kB) |
| 13-Sep-2026 22:50:31 | ━━━━━━━━━━━━━━━━━━━━━━━━━━━━━━━━━━━━━━ 218.7/218.7 kB 79.7 MB/s eta 0:00:00 |
| 13-Sep-2026 22:50:31 | Collecting pycparser |
| 13-Sep-2026 22:50:31 | Downloading pycparser-3.0-py3-none-any.whl (48 kB) |
| 13-Sep-2026 22:50:31 | ━━━━━━━━━━━━━━━━━━━━━━━━━━━━━━━━━━━━━━━━ 48.2/48.2 kB 25.4 MB/s eta 0:00:00 |
| 13-Sep-2026 22:50:31 | Installing collected packages: zipp, urllib3, typing-extensions, rfc3986, Pygments, pycparser, packaging, nh3, more-itertools, mdurl, jeepney, idna, docutils, charset_normalizer, certifi, backports.tarfile, requests, readme-renderer, markdown-it-py, jaraco.functools, jaraco.context, jaraco.classes, importlib_metadata, id, cffi, rich, requests-toolbelt, cryptography, SecretStorage, keyring, twine |
| 13-Sep-2026 22:50:33 | Successfully installed Pygments-2.21.0 SecretStorage-3.5.0 backports.tarfile-1.2.0 certifi-2026.7.22 cffi-2.1.1 charset_normalizer-3.5.1 cryptography-50.0.1 docutils-0.23 id-1.6.1 idna-3.19 importlib_metadata-9.0.1 jaraco.classes-3.4.0 jaraco.context-6.1.2 jaraco.functools-4.6.0 jeepney-0.9.0 keyring-25.7.0 markdown-it-py-4.2.0 mdurl-0.1.2 more-itertools-11.1.0 nh3-0.3.7 packaging-26.3 pycparser-3.0 readme-renderer-46.0 requests-2.34.2 requests-toolbelt-1.0.0 rfc3986-2.0.0 rich-15.0.0 twine-7.0.0 typing-extensions-4.16.0 urllib3-2.7.0 zipp-4.1.0 |
| 13-Sep-2026 22:50:33 | WARNING: Running pip as the 'root' user can result in broken permissions and conflicting behaviour with the system package manager. It is recommended to use a virtual environment instead: https://pip.pypa.io/warnings/venv |
| 13-Sep-2026 22:50:33 | |
| 13-Sep-2026 22:50:33 | [notice] A new release of pip is available: 23.0.1 -> 26.2.1 |
| 13-Sep-2026 22:50:33 | [notice] To update, run: pip3 install --upgrade pip |
| 13-Sep-2026 22:50:33 | Cloning into 'casa-build-utils'... |
| 13-Sep-2026 22:50:33 | Uploading distributions to |
| 13-Sep-2026 22:50:33 | https://casa-pip.nrao.edu:443/repository/casa-dev-wheel/ |
| 13-Sep-2026 22:50:33 | Uploading casatools-6.7.7.7a14882.dev1-cp312-cp312-manylinux_2_28_x86_64.whl |
| 13-Sep-2026 22:50:33 | |
| 13-Sep-2026 22:50:34 | 0% ━━━━━━━━━━━━━━━━━━━━━━━━━━━━━━━━━━━━━━━━ 0.0/79.4 MB • --:-- • ? |
| 13-Sep-2026 22:50:34 | 12% ━━━━╸━━━━━━━━━━━━━━━━━━━━━━━━━━━━━━━━━━━ 9.5/79.4 MB • 00:01 • 163.3 MB/s |
| 13-Sep-2026 22:50:34 | 15% ━━━━━━╺━━━━━━━━━━━━━━━━━━━━━━━━━━━━━━━━━ 12.0/79.4 MB • 00:01 • 72.8 MB/s |
| 13-Sep-2026 22:50:34 | 17% ━━━━━━╸━━━━━━━━━━━━━━━━━━━━━━━━━━━━━━━━━ 13.6/79.4 MB • 00:02 • 56.6 MB/s |
| 13-Sep-2026 22:50:34 | 21% ━━━━━━━━╺━━━━━━━━━━━━━━━━━━━━━━━━━━━━━━━ 16.3/79.4 MB • 00:02 • 50.2 MB/s |
| 13-Sep-2026 22:50:34 | 23% ━━━━━━━━━╺━━━━━━━━━━━━━━━━━━━━━━━━━━━━━━ 18.6/79.4 MB • 00:02 • 38.6 MB/s |
| 13-Sep-2026 22:50:34 | 25% ━━━━━━━━━━╺━━━━━━━━━━━━━━━━━━━━━━━━━━━━━ 20.1/79.4 MB • 00:02 • 32.7 MB/s |
| 13-Sep-2026 22:50:34 | 29% ━━━━━━━━━━━╺━━━━━━━━━━━━━━━━━━━━━━━━━━━━ 22.6/79.4 MB • 00:03 • 26.1 MB/s |
| 13-Sep-2026 22:50:34 | 29% ━━━━━━━━━━━╺━━━━━━━━━━━━━━━━━━━━━━━━━━━━ 22.6/79.4 MB • 00:03 • 26.1 MB/s |
| 13-Sep-2026 22:50:34 | 31% ━━━━━━━━━━━━╸━━━━━━━━━━━━━━━━━━━━━━━━━━━ 24.9/79.4 MB • 00:03 • 22.1 MB/s |
| 13-Sep-2026 22:50:35 | 34% ━━━━━━━━━━━━━╸━━━━━━━━━━━━━━━━━━━━━━━━━━ 27.1/79.4 MB • 00:03 • 20.6 MB/s |
| 13-Sep-2026 22:50:35 | 36% ━━━━━━━━━━━━━━╺━━━━━━━━━━━━━━━━━━━━━━━━━ 28.6/79.4 MB • 00:03 • 20.4 MB/s |
| 13-Sep-2026 22:50:35 | 39% ━━━━━━━━━━━━━━━╸━━━━━━━━━━━━━━━━━━━━━━━━ 31.3/79.4 MB • 00:03 • 19.8 MB/s |
| 13-Sep-2026 22:50:35 | 41% ━━━━━━━━━━━━━━━━╸━━━━━━━━━━━━━━━━━━━━━━━ 32.9/79.4 MB • 00:03 • 20.4 MB/s |
| 13-Sep-2026 22:50:35 | 45% ━━━━━━━━━━━━━━━━━╸━━━━━━━━━━━━━━━━━━━━━━ 35.6/79.4 MB • 00:03 • 20.0 MB/s |
| 13-Sep-2026 22:50:35 | 47% ━━━━━━━━━━━━━━━━━━╸━━━━━━━━━━━━━━━━━━━━━ 37.0/79.4 MB • 00:03 • 21.1 MB/s |
| 13-Sep-2026 22:50:35 | 51% ━━━━━━━━━━━━━━━━━━━━╺━━━━━━━━━━━━━━━━━━━ 40.5/79.4 MB • 00:02 • 20.8 MB/s |
| 13-Sep-2026 22:50:35 | 53% ━━━━━━━━━━━━━━━━━━━━━╺━━━━━━━━━━━━━━━━━━ 42.0/79.4 MB • 00:02 • 22.2 MB/s |
| 13-Sep-2026 22:50:35 | 53% ━━━━━━━━━━━━━━━━━━━━━╺━━━━━━━━━━━━━━━━━━ 42.0/79.4 MB • 00:02 • 22.2 MB/s |
| 13-Sep-2026 22:50:35 | 56% ━━━━━━━━━━━━━━━━━━━━━━╺━━━━━━━━━━━━━━━━━ 44.4/79.4 MB • 00:02 • 20.4 MB/s |
| 13-Sep-2026 22:50:36 | 59% ━━━━━━━━━━━━━━━━━━━━━━━╸━━━━━━━━━━━━━━━━ 46.9/79.4 MB • 00:02 • 19.8 MB/s |
| 13-Sep-2026 22:50:36 | 62% ━━━━━━━━━━━━━━━━━━━━━━━━╸━━━━━━━━━━━━━━━ 49.3/79.4 MB • 00:02 • 21.3 MB/s |
| 13-Sep-2026 22:50:36 | 64% ━━━━━━━━━━━━━━━━━━━━━━━━━╸━━━━━━━━━━━━━━ 51.0/79.4 MB • 00:02 • 18.8 MB/s |
| 13-Sep-2026 22:50:36 | 68% ━━━━━━━━━━━━━━━━━━━━━━━━━━━╺━━━━━━━━━━━━ 53.6/79.4 MB • 00:02 • 22.6 MB/s |
| 13-Sep-2026 22:50:36 | 68% ━━━━━━━━━━━━━━━━━━━━━━━━━━━╺━━━━━━━━━━━━ 53.6/79.4 MB • 00:02 • 22.6 MB/s |
| 13-Sep-2026 22:50:36 | 70% ━━━━━━━━━━━━━━━━━━━━━━━━━━━╸━━━━━━━━━━━━ 55.3/79.4 MB • 00:02 • 18.7 MB/s |
| 13-Sep-2026 22:50:36 | 72% ━━━━━━━━━━━━━━━━━━━━━━━━━━━━╸━━━━━━━━━━━ 56.9/79.4 MB • 00:02 • 17.7 MB/s |
| 13-Sep-2026 22:50:36 | 75% ━━━━━━━━━━━━━━━━━━━━━━━━━━━━━━╺━━━━━━━━━ 59.7/79.4 MB • 00:02 • 18.9 MB/s |
| 13-Sep-2026 22:50:36 | 75% ━━━━━━━━━━━━━━━━━━━━━━━━━━━━━━╺━━━━━━━━━ 59.7/79.4 MB • 00:02 • 18.9 MB/s |
| 13-Sep-2026 22:50:36 | 75% ━━━━━━━━━━━━━━━━━━━━━━━━━━━━━━╺━━━━━━━━━ 59.7/79.4 MB • 00:02 • 18.9 MB/s |
| 13-Sep-2026 22:50:37 | 78% ━━━━━━━━━━━━━━━━━━━━━━━━━━━━━━━╺━━━━━━━━ 61.9/79.4 MB • 00:02 • 15.8 MB/s |
| 13-Sep-2026 22:50:37 | 80% ━━━━━━━━━━━━━━━━━━━━━━━━━━━━━━━╸━━━━━━━━ 63.4/79.4 MB • 00:02 • 15.8 MB/s |
| 13-Sep-2026 22:50:37 | 80% ━━━━━━━━━━━━━━━━━━━━━━━━━━━━━━━╸━━━━━━━━ 63.4/79.4 MB • 00:02 • 15.8 MB/s |
| 13-Sep-2026 22:50:37 | 80% ━━━━━━━━━━━━━━━━━━━━━━━━━━━━━━━╸━━━━━━━━ 63.4/79.4 MB • 00:02 • 15.8 MB/s |
| 13-Sep-2026 22:50:37 | 83% ━━━━━━━━━━━━━━━━━━━━━━━━━━━━━━━━━╺━━━━━━ 65.8/79.4 MB • 00:02 • 13.3 MB/s |
| 13-Sep-2026 22:50:37 | 83% ━━━━━━━━━━━━━━━━━━━━━━━━━━━━━━━━━╺━━━━━━ 65.8/79.4 MB • 00:02 • 13.3 MB/s |
| 13-Sep-2026 22:50:37 | 85% ━━━━━━━━━━━━━━━━━━━━━━━━━━━━━━━━━╸━━━━━━ 67.3/79.4 MB • 00:02 • 11.6 MB/s |
| 13-Sep-2026 22:50:37 | 88% ━━━━━━━━━━━━━━━━━━━━━━━━━━━━━━━━━━━╺━━━━ 69.9/79.4 MB • 00:01 • 11.6 MB/s |
| 13-Sep-2026 22:50:37 | 88% ━━━━━━━━━━━━━━━━━━━━━━━━━━━━━━━━━━━╺━━━━ 69.9/79.4 MB • 00:01 • 11.6 MB/s |
| 13-Sep-2026 22:50:37 | 88% ━━━━━━━━━━━━━━━━━━━━━━━━━━━━━━━━━━━╺━━━━ 69.9/79.4 MB • 00:01 • 11.6 MB/s |
| 13-Sep-2026 22:50:38 | 91% ━━━━━━━━━━━━━━━━━━━━━━━━━━━━━━━━━━━━╺━━━ 72.3/79.4 MB • 00:01 • 11.7 MB/s |
| 13-Sep-2026 22:50:38 | 92% ━━━━━━━━━━━━━━━━━━━━━━━━━━━━━━━━━━━━╸━━━ 73.4/79.4 MB • 00:01 • 11.4 MB/s |
| 13-Sep-2026 22:50:38 | 94% ━━━━━━━━━━━━━━━━━━━━━━━━━━━━━━━━━━━━━╺━━ 74.3/79.4 MB • 00:01 • 11.4 MB/s |
| 13-Sep-2026 22:50:38 | 96% ━━━━━━━━━━━━━━━━━━━━━━━━━━━━━━━━━━━━━━╺━ 75.8/79.4 MB • 00:01 • 10.7 MB/s |
| 13-Sep-2026 22:50:38 | 99% ━━━━━━━━━━━━━━━━━━━━━━━━━━━━━━━━━━━━━━━╺ 78.3/79.4 MB • 00:01 • 12.5 MB/s |
| 13-Sep-2026 22:50:38 | 100% ━━━━━━━━━━━━━━━━━━━━━━━━━━━━━━━━━━━━━━━━ 79.4/79.4 MB • 00:04 • 11.6 MB/s |
| 13-Sep-2026 22:50:38 | 100% ━━━━━━━━━━━━━━━━━━━━━━━━━━━━━━━━━━━━━━━━ 79.4/79.4 MB • 00:04 • 11.6 MB/s |
| 13-Sep-2026 22:50:38 | 100% ━━━━━━━━━━━━━━━━━━━━━━━━━━━━━━━━━━━━━━━━ 79.4/79.4 MB • 00:04 • 11.6 MB/s |
| 13-Sep-2026 22:50:38 | 100% ━━━━━━━━━━━━━━━━━━━━━━━━━━━━━━━━━━━━━━━━ 79.4/79.4 MB • 00:04 • 11.6 MB/s |
| 13-Sep-2026 22:50:38 | 100% ━━━━━━━━━━━━━━━━━━━━━━━━━━━━━━━━━━━━━━━━ 79.4/79.4 MB • 00:04 • 11.6 MB/s |
| 13-Sep-2026 22:50:39 | 100% ━━━━━━━━━━━━━━━━━━━━━━━━━━━━━━━━━━━━━━━━ 79.4/79.4 MB • 00:04 • 11.6 MB/s |
| 13-Sep-2026 22:50:39 | 100% ━━━━━━━━━━━━━━━━━━━━━━━━━━━━━━━━━━━━━━━━ 79.4/79.4 MB • 00:04 • 11.6 MB/s |
| 13-Sep-2026 22:50:39 | 100% ━━━━━━━━━━━━━━━━━━━━━━━━━━━━━━━━━━━━━━━━ 79.4/79.4 MB • 00:04 • 11.6 MB/s |
| 13-Sep-2026 22:50:39 | Uploading distributions to |
| 13-Sep-2026 22:50:39 | https://casa-pip.nrao.edu:443/repository/casa-dev-wheel/ |
| 13-Sep-2026 22:50:39 | Uploading casatestutils-6.7.7.7a14882.dev1-py3-none-any.whl |
| 13-Sep-2026 22:50:39 | |
| 13-Sep-2026 22:50:39 | 0% ━━━━━━━━━━━━━━━━━━━━━━━━━━━━━━━━━━━━━━━━ 0.0/174.5 kB • --:-- • ? |
| 13-Sep-2026 22:50:39 | 100% ━━━━━━━━━━━━━━━━━━━━━━━━━━━━━━━━━━━━━━━ 174.5/174.5 kB • 00:00 • 207.6 MB/s |
| 13-Sep-2026 22:50:39 | |
| 13-Sep-2026 22:50:39 | Finished task 'Upload wheel' with result: Success |
| 13-Sep-2026 22:50:39 | Substituting variable: ${bamboo.agentId} with 153550852 |
| 13-Sep-2026 22:50:39 | Substituting variable: ${bamboo.agentId} with 153550852 |
| 13-Sep-2026 22:50:39 | Starting task 'Cleanup' of type 'com.atlassian.bamboo.plugins.scripttask:task.builder.script' |
| 13-Sep-2026 22:50:39 | Beginning to execute external process for build 'CASASPECS - Dev Test 3.12 - CAS-14882 - Test Tools Many Linux 2.28 Py3.12 #1 (CASASPECS-DEVTESTPY312149-TTOMLPY312-1)' ... running command line: /opt/ci_workspace/casa/bamboo/agent4/temp/CASASPECS-DEVTESTPY312149-TTOMLPY312-1-ScriptBuildTask-9816893980888439927.sh ... in: /opt/ci_workspace/casa/bamboo/agent4/xml-data/build-dir/CASASPECS-DEVTESTPY312149-TTOMLPY312 |
| 13-Sep-2026 22:50:39 | Starting cleanup |
| 13-Sep-2026 22:50:50 | wheel-container-test_153550852 |
| 13-Sep-2026 22:50:51 | wheel-container-test_153550852 |
| 13-Sep-2026 22:50:51 | Cleanup complete |
| 13-Sep-2026 22:50:51 | Finished task 'Cleanup' with result: Success |
| 13-Sep-2026 22:50:51 | Running post build plugin 'Docker Container Cleanup' |
| 13-Sep-2026 22:50:51 | Beginning to execute external process for build 'CASASPECS - Dev Test 3.12 - CAS-14882 - Test Tools Many Linux 2.28 Py3.12 #1 (CASASPECS-DEVTESTPY312149-TTOMLPY312-1)' ... running command line: /usr/bin/docker rm -f wheel-container-test_153550852 ... in: /opt/ci_workspace/casa/bamboo/agent4/xml-data/build-dir/CASASPECS-DEVTESTPY312149-TTOMLPY312 |
| 13-Sep-2026 22:50:51 | Running post build plugin 'NCover Results Collector' |
| 13-Sep-2026 22:50:51 | Running post build plugin 'Build Results Label Collector' |
| 13-Sep-2026 22:50:51 | Running post build plugin 'Clover Results Collector' |
| 13-Sep-2026 22:50:51 | Running post build plugin 'npm Cache Cleanup' |
| 13-Sep-2026 22:50:51 | Running post build plugin 'Artifact Copier' |
| 13-Sep-2026 22:50:51 | Publishing an artifact: Workdir |
| 13-Sep-2026 22:50:51 | Finished publishing of artifact Non required job artifact Http Compression On : [Workdir], patterns: [work*.tar.gz] anchored at: [wheeldirectory/] in 39.73 ms |
| 13-Sep-2026 22:50:51 | Publishing an artifact: XML Directories |
| 13-Sep-2026 22:50:51 | Finished publishing of artifact Non required job artifact Http Compression On : [XML Directories], patterns: [**/*.xml] anchored at: [wheeldirectory/] in 115.8 ms |
| 13-Sep-2026 22:50:51 | Finalising the build... |
| 13-Sep-2026 22:50:51 | Stopping timer. |
| 13-Sep-2026 22:50:51 | Build CASASPECS-DEVTESTPY312149-TTOMLPY312-1 completed. |
| 13-Sep-2026 22:50:51 | Running on server: post build plugin 'Build Hanging Detection Configuration' |
| 13-Sep-2026 22:50:51 | Running on server: post build plugin 'NCover Results Collector' |
| 13-Sep-2026 22:50:51 | Running on server: post build plugin 'Build Labeller' |
| 13-Sep-2026 22:50:51 | Running on server: post build plugin 'Clover Delta Calculator' |
| 13-Sep-2026 22:50:51 | Running on server: post build plugin 'Maven Dependencies Postprocessor' |
| 13-Sep-2026 22:50:51 | All post build plugins have finished |
| 13-Sep-2026 22:50:51 | Generating build results summary... |
| 13-Sep-2026 22:50:52 | Saving build results to disk... |
| 13-Sep-2026 22:50:52 | Store variable context... |
| 13-Sep-2026 22:50:52 | Finished building CASASPECS-DEVTESTPY312149-TTOMLPY312-1. |