Build: #1 failed

Job: Test Tasks Many Linux 2.28 Py3.12 was successful

Build log

The build generated 40,970 lines of output.   The output is too long and has been truncated to the last 1,000 lines. Download or view full build log.

13-Sep-2026 23:07:43 2026-09-14 03:07:43        WARN        SkyCompRep::convertToJy        Cannot convert units of brightness to Jy - will assume Jy
13-Sep-2026 23:07:43 2026-09-14 03:07:43        WARN        SkyCompRep::peakToIntegralFlux()        There are no image brightness units, assuming Jy/pixel
13-Sep-2026 23:07:43 2026-09-14 03:07:44        WARN        SkyCompRep::integralToPeakFlux()        There are no image brightness units, assuming Jy/pixel
13-Sep-2026 23:07:43 2026-09-14 03:07:44        WARN        ImageFitter::_finishConstruction        Unrecognized intensity unit . Will assume Jy/pixel
13-Sep-2026 23:07:43 2026-09-14 03:07:44        WARN        ImageFitter::clearNoiseFWHM        noiseFWHM not specified and image has no beam, using uncorrelated noise expressions to calculate uncertainties
13-Sep-2026 23:07:43 2026-09-14 03:07:44        WARN        SkyCompRep::convertToJy        Cannot convert units of brightness to Jy - will assume Jy
13-Sep-2026 23:07:43 2026-09-14 03:07:44        WARN        SkyCompRep::peakToIntegralFlux()        There are no image brightness units, assuming Jy/pixel
13-Sep-2026 23:07:43 2026-09-14 03:07:44        WARN        SkyCompRep::integralToPeakFlux()        There are no image brightness units, assuming Jy/pixel
13-Sep-2026 23:07:43 2026-09-14 03:07:44        WARN        ImageFitter::_finishConstruction        Unrecognized intensity unit . Will assume Jy/pixel
13-Sep-2026 23:07:43 2026-09-14 03:07:44        WARN        ImageFitter::clearNoiseFWHM        noiseFWHM not specified and image has no beam, using uncorrelated noise expressions to calculate uncertainties
13-Sep-2026 23:07:44 2026-09-14 03:07:44        WARN        SkyCompRep::convertToJy        Cannot convert units of brightness to Jy - will assume Jy
13-Sep-2026 23:07:44 2026-09-14 03:07:44        WARN        SkyCompRep::peakToIntegralFlux()        There are no image brightness units, assuming Jy/pixel
13-Sep-2026 23:07:44 2026-09-14 03:07:44        WARN        SkyCompRep::integralToPeakFlux()        There are no image brightness units, assuming Jy/pixel
13-Sep-2026 23:07:44 2026-09-14 03:07:44        WARN        ImageFitter::_finishConstruction        Unrecognized intensity unit . Will assume Jy/pixel
13-Sep-2026 23:07:44 2026-09-14 03:07:44        WARN        ImageFitter::clearNoiseFWHM        noiseFWHM not specified and image has no beam, using uncorrelated noise expressions to calculate uncertainties
13-Sep-2026 23:07:44 2026-09-14 03:07:44        WARN        SkyCompRep::convertToJy        Cannot convert units of brightness to Jy - will assume Jy
13-Sep-2026 23:07:44 2026-09-14 03:07:44        WARN        SkyCompRep::peakToIntegralFlux()        There are no image brightness units, assuming Jy/pixel
13-Sep-2026 23:07:44 2026-09-14 03:07:44        WARN        SkyCompRep::integralToPeakFlux()        There are no image brightness units, assuming Jy/pixel
13-Sep-2026 23:07:44 2026-09-14 03:07:44        WARN        ImageFitter::_finishConstruction        Unrecognized intensity unit . Will assume Jy/pixel
13-Sep-2026 23:07:44 2026-09-14 03:07:44        WARN        ImageFitter::clearNoiseFWHM        noiseFWHM not specified and image has no beam, using uncorrelated noise expressions to calculate uncertainties
13-Sep-2026 23:07:44 2026-09-14 03:07:45        WARN        SkyCompRep::convertToJy        Cannot convert units of brightness to Jy - will assume Jy
13-Sep-2026 23:07:44 2026-09-14 03:07:45        WARN        SkyCompRep::peakToIntegralFlux()        There are no image brightness units, assuming Jy/pixel
13-Sep-2026 23:07:44 2026-09-14 03:07:45        WARN        SkyCompRep::integralToPeakFlux()        There are no image brightness units, assuming Jy/pixel
13-Sep-2026 23:07:44 2026-09-14 03:07:45        WARN        ImageFitter::_finishConstruction        Unrecognized intensity unit . Will assume Jy/pixel
13-Sep-2026 23:07:44 2026-09-14 03:07:45        WARN        ImageFitter::clearNoiseFWHM        noiseFWHM not specified and image has no beam, using uncorrelated noise expressions to calculate uncertainties
13-Sep-2026 23:07:44 2026-09-14 03:07:45        WARN        SkyCompRep::convertToJy        Cannot convert units of brightness to Jy - will assume Jy
13-Sep-2026 23:07:44 2026-09-14 03:07:45        WARN        SkyCompRep::peakToIntegralFlux()        There are no image brightness units, assuming Jy/pixel
13-Sep-2026 23:07:44 2026-09-14 03:07:45        WARN        SkyCompRep::integralToPeakFlux()        There are no image brightness units, assuming Jy/pixel
13-Sep-2026 23:07:44 2026-09-14 03:07:45        WARN        ImageFitter::_finishConstruction        Unrecognized intensity unit . Will assume Jy/pixel
13-Sep-2026 23:07:44 2026-09-14 03:07:45        WARN        ImageFitter::clearNoiseFWHM        noiseFWHM not specified and image has no beam, using uncorrelated noise expressions to calculate uncertainties
13-Sep-2026 23:07:44 2026-09-14 03:07:45        WARN        SkyCompRep::convertToJy        Cannot convert units of brightness to Jy - will assume Jy
13-Sep-2026 23:07:44 2026-09-14 03:07:45        WARN        SkyCompRep::peakToIntegralFlux()        There are no image brightness units, assuming Jy/pixel
13-Sep-2026 23:07:44 2026-09-14 03:07:45        WARN        SkyCompRep::integralToPeakFlux()        There are no image brightness units, assuming Jy/pixel
13-Sep-2026 23:07:45 2026-09-14 03:07:45        WARN        ImageFitter::_finishConstruction        Unrecognized intensity unit . Will assume Jy/pixel
13-Sep-2026 23:07:45 2026-09-14 03:07:45        WARN        ImageFitter::clearNoiseFWHM        noiseFWHM not specified and image has no beam, using uncorrelated noise expressions to calculate uncertainties
13-Sep-2026 23:07:45 2026-09-14 03:07:45        WARN        SkyCompRep::convertToJy        Cannot convert units of brightness to Jy - will assume Jy
13-Sep-2026 23:07:45 2026-09-14 03:07:45        WARN        SkyCompRep::peakToIntegralFlux()        There are no image brightness units, assuming Jy/pixel
13-Sep-2026 23:07:45 2026-09-14 03:07:45        WARN        SkyCompRep::integralToPeakFlux()        There are no image brightness units, assuming Jy/pixel
13-Sep-2026 23:07:45 2026-09-14 03:07:45        WARN        ImageFitter::_finishConstruction        Unrecognized intensity unit . Will assume Jy/pixel
13-Sep-2026 23:07:45 2026-09-14 03:07:45        WARN        ImageFitter::clearNoiseFWHM        noiseFWHM not specified and image has no beam, using uncorrelated noise expressions to calculate uncertainties
13-Sep-2026 23:07:45 2026-09-14 03:07:45        WARN        SkyCompRep::convertToJy        Cannot convert units of brightness to Jy - will assume Jy
13-Sep-2026 23:07:45 2026-09-14 03:07:45        WARN        SkyCompRep::peakToIntegralFlux()        There are no image brightness units, assuming Jy/pixel
13-Sep-2026 23:07:45 2026-09-14 03:07:45        WARN        SkyCompRep::integralToPeakFlux()        There are no image brightness units, assuming Jy/pixel
13-Sep-2026 23:07:45 2026-09-14 03:07:45        WARN        ImageFitter::_finishConstruction        Unrecognized intensity unit . Will assume Jy/pixel
13-Sep-2026 23:07:45 2026-09-14 03:07:45        WARN        ImageFitter::clearNoiseFWHM        noiseFWHM not specified and image has no beam, using uncorrelated noise expressions to calculate uncertainties
13-Sep-2026 23:07:45 2026-09-14 03:07:45        WARN        SkyCompRep::convertToJy        Cannot convert units of brightness to Jy - will assume Jy
13-Sep-2026 23:07:45 2026-09-14 03:07:45        WARN        SkyCompRep::peakToIntegralFlux()        There are no image brightness units, assuming Jy/pixel
13-Sep-2026 23:07:45 2026-09-14 03:07:46        WARN        SkyCompRep::integralToPeakFlux()        There are no image brightness units, assuming Jy/pixel
13-Sep-2026 23:07:45 2026-09-14 03:07:46        WARN        ImageFitter::_finishConstruction        Unrecognized intensity unit . Will assume Jy/pixel
13-Sep-2026 23:07:45 2026-09-14 03:07:46        WARN        ImageFitter::clearNoiseFWHM        noiseFWHM not specified and image has no beam, using uncorrelated noise expressions to calculate uncertainties
13-Sep-2026 23:07:45 2026-09-14 03:07:46        WARN        SkyCompRep::convertToJy        Cannot convert units of brightness to Jy - will assume Jy
13-Sep-2026 23:07:45 2026-09-14 03:07:46        WARN        SkyCompRep::peakToIntegralFlux()        There are no image brightness units, assuming Jy/pixel
13-Sep-2026 23:07:45 2026-09-14 03:07:46        WARN        SkyCompRep::integralToPeakFlux()        There are no image brightness units, assuming Jy/pixel
13-Sep-2026 23:07:46 2026-09-14 03:07:46        WARN        ImageFitter::_finishConstruction        Unrecognized intensity unit . Will assume Jy/pixel
13-Sep-2026 23:07:46 2026-09-14 03:07:46        WARN        ImageFitter::clearNoiseFWHM        noiseFWHM not specified and image has no beam, using uncorrelated noise expressions to calculate uncertainties
13-Sep-2026 23:07:46 2026-09-14 03:07:46        WARN        SkyCompRep::convertToJy        Cannot convert units of brightness to Jy - will assume Jy
13-Sep-2026 23:07:46 2026-09-14 03:07:46        WARN        SkyCompRep::peakToIntegralFlux()        There are no image brightness units, assuming Jy/pixel
13-Sep-2026 23:07:46 2026-09-14 03:07:46        WARN        SkyCompRep::integralToPeakFlux()        There are no image brightness units, assuming Jy/pixel
13-Sep-2026 23:07:46 2026-09-14 03:07:46        WARN        ImageFitter::_finishConstruction        Unrecognized intensity unit . Will assume Jy/pixel
13-Sep-2026 23:07:46 2026-09-14 03:07:46        WARN        ImageFitter::clearNoiseFWHM        noiseFWHM not specified and image has no beam, using uncorrelated noise expressions to calculate uncertainties
13-Sep-2026 23:07:46 2026-09-14 03:07:46        WARN        SkyCompRep::convertToJy        Cannot convert units of brightness to Jy - will assume Jy
13-Sep-2026 23:07:46 2026-09-14 03:07:46        WARN        SkyCompRep::peakToIntegralFlux()        There are no image brightness units, assuming Jy/pixel
13-Sep-2026 23:07:46 2026-09-14 03:07:47        WARN        SkyCompRep::integralToPeakFlux()        There are no image brightness units, assuming Jy/pixel
13-Sep-2026 23:07:46 2026-09-14 03:07:47        WARN        ImageFitter::_finishConstruction        Unrecognized intensity unit . Will assume Jy/pixel
13-Sep-2026 23:07:46 2026-09-14 03:07:47        WARN        ImageFitter::clearNoiseFWHM        noiseFWHM not specified and image has no beam, using uncorrelated noise expressions to calculate uncertainties
13-Sep-2026 23:07:46 2026-09-14 03:07:47        WARN        SkyCompRep::convertToJy        Cannot convert units of brightness to Jy - will assume Jy
13-Sep-2026 23:07:46 2026-09-14 03:07:47        WARN        SkyCompRep::peakToIntegralFlux()        There are no image brightness units, assuming Jy/pixel
13-Sep-2026 23:07:46 2026-09-14 03:07:47        WARN        SkyCompRep::integralToPeakFlux()        There are no image brightness units, assuming Jy/pixel
13-Sep-2026 23:07:46 2026-09-14 03:07:47        WARN        ImageFitter::_finishConstruction        Unrecognized intensity unit . Will assume Jy/pixel
13-Sep-2026 23:07:46 2026-09-14 03:07:47        WARN        ImageFitter::clearNoiseFWHM        noiseFWHM not specified and image has no beam, using uncorrelated noise expressions to calculate uncertainties
13-Sep-2026 23:07:46 2026-09-14 03:07:47        WARN        SkyCompRep::convertToJy        Cannot convert units of brightness to Jy - will assume Jy
13-Sep-2026 23:07:46 2026-09-14 03:07:47        WARN        SkyCompRep::peakToIntegralFlux()        There are no image brightness units, assuming Jy/pixel
13-Sep-2026 23:07:46 2026-09-14 03:07:47        WARN        SkyCompRep::integralToPeakFlux()        There are no image brightness units, assuming Jy/pixel
13-Sep-2026 23:07:46 2026-09-14 03:07:47        WARN        ImageFitter::_finishConstruction        Unrecognized intensity unit . Will assume Jy/pixel
13-Sep-2026 23:07:46 2026-09-14 03:07:47        WARN        ImageFitter::clearNoiseFWHM        noiseFWHM not specified and image has no beam, using uncorrelated noise expressions to calculate uncertainties
13-Sep-2026 23:07:47 2026-09-14 03:07:47        WARN        SkyCompRep::convertToJy        Cannot convert units of brightness to Jy - will assume Jy
13-Sep-2026 23:07:47 2026-09-14 03:07:47        WARN        SkyCompRep::peakToIntegralFlux()        There are no image brightness units, assuming Jy/pixel
13-Sep-2026 23:07:47 2026-09-14 03:07:47        WARN        SkyCompRep::integralToPeakFlux()        There are no image brightness units, assuming Jy/pixel
13-Sep-2026 23:07:47 2026-09-14 03:07:48        WARN        ImageFitter::_finishConstruction        Unrecognized intensity unit . Will assume Jy/pixel
13-Sep-2026 23:07:47 2026-09-14 03:07:48        WARN        ImageFitter::clearNoiseFWHM        noiseFWHM not specified and image has no beam, using uncorrelated noise expressions to calculate uncertainties
13-Sep-2026 23:07:47 2026-09-14 03:07:48        WARN        SkyCompRep::convertToJy        Cannot convert units of brightness to Jy - will assume Jy
13-Sep-2026 23:07:47 2026-09-14 03:07:48        WARN        SkyCompRep::peakToIntegralFlux()        There are no image brightness units, assuming Jy/pixel
13-Sep-2026 23:07:47 2026-09-14 03:07:48        WARN        SkyCompRep::integralToPeakFlux()        There are no image brightness units, assuming Jy/pixel
13-Sep-2026 23:07:47 2026-09-14 03:07:48        WARN        ImageFitter::_finishConstruction        Unrecognized intensity unit . Will assume Jy/pixel
13-Sep-2026 23:07:47 2026-09-14 03:07:48        WARN        ImageFitter::clearNoiseFWHM        noiseFWHM not specified and image has no beam, using uncorrelated noise expressions to calculate uncertainties
13-Sep-2026 23:07:47 2026-09-14 03:07:48        WARN        SkyCompRep::convertToJy        Cannot convert units of brightness to Jy - will assume Jy
13-Sep-2026 23:07:47 2026-09-14 03:07:48        WARN        SkyCompRep::peakToIntegralFlux()        There are no image brightness units, assuming Jy/pixel
13-Sep-2026 23:07:47 2026-09-14 03:07:48        WARN        SkyCompRep::integralToPeakFlux()        There are no image brightness units, assuming Jy/pixel
13-Sep-2026 23:07:47 2026-09-14 03:07:48        WARN        ImageFitter::_finishConstruction        Unrecognized intensity unit . Will assume Jy/pixel
13-Sep-2026 23:07:47 2026-09-14 03:07:48        WARN        ImageFitter::clearNoiseFWHM        noiseFWHM not specified and image has no beam, using uncorrelated noise expressions to calculate uncertainties
13-Sep-2026 23:07:47 2026-09-14 03:07:48        WARN        SkyCompRep::convertToJy        Cannot convert units of brightness to Jy - will assume Jy
13-Sep-2026 23:07:47 2026-09-14 03:07:48        WARN        SkyCompRep::peakToIntegralFlux()        There are no image brightness units, assuming Jy/pixel
13-Sep-2026 23:07:48 2026-09-14 03:07:48        WARN        SkyCompRep::integralToPeakFlux()        There are no image brightness units, assuming Jy/pixel
13-Sep-2026 23:07:48 2026-09-14 03:07:48        WARN        ImageFitter::_finishConstruction        Unrecognized intensity unit . Will assume Jy/pixel
13-Sep-2026 23:07:48 2026-09-14 03:07:48        WARN        ImageFitter::clearNoiseFWHM        noiseFWHM not specified and image has no beam, using uncorrelated noise expressions to calculate uncertainties
13-Sep-2026 23:07:48 2026-09-14 03:07:48        WARN        SkyCompRep::convertToJy        Cannot convert units of brightness to Jy - will assume Jy
13-Sep-2026 23:07:48 2026-09-14 03:07:48        WARN        SkyCompRep::peakToIntegralFlux()        There are no image brightness units, assuming Jy/pixel
13-Sep-2026 23:07:48 2026-09-14 03:07:48        WARN        SkyCompRep::integralToPeakFlux()        There are no image brightness units, assuming Jy/pixel
13-Sep-2026 23:07:48 2026-09-14 03:07:49        WARN        ImageFitter::_finishConstruction        Unrecognized intensity unit . Will assume Jy/pixel
13-Sep-2026 23:07:48 2026-09-14 03:07:49        WARN        ImageFitter::clearNoiseFWHM        noiseFWHM not specified and image has no beam, using uncorrelated noise expressions to calculate uncertainties
13-Sep-2026 23:07:48 2026-09-14 03:07:49        WARN        SkyCompRep::convertToJy        Cannot convert units of brightness to Jy - will assume Jy
13-Sep-2026 23:07:48 2026-09-14 03:07:49        WARN        SkyCompRep::peakToIntegralFlux()        There are no image brightness units, assuming Jy/pixel
13-Sep-2026 23:07:48 2026-09-14 03:07:49        WARN        SkyCompRep::integralToPeakFlux()        There are no image brightness units, assuming Jy/pixel
13-Sep-2026 23:07:48 2026-09-14 03:07:49        WARN        ImageFitter::_finishConstruction        Unrecognized intensity unit . Will assume Jy/pixel
13-Sep-2026 23:07:48 2026-09-14 03:07:49        WARN        ImageFitter::clearNoiseFWHM        noiseFWHM not specified and image has no beam, using uncorrelated noise expressions to calculate uncertainties
13-Sep-2026 23:07:48 2026-09-14 03:07:49        WARN        SkyCompRep::convertToJy        Cannot convert units of brightness to Jy - will assume Jy
13-Sep-2026 23:07:48 2026-09-14 03:07:49        WARN        SkyCompRep::peakToIntegralFlux()        There are no image brightness units, assuming Jy/pixel
13-Sep-2026 23:07:49 2026-09-14 03:07:49        WARN        SkyCompRep::integralToPeakFlux()        There are no image brightness units, assuming Jy/pixel
13-Sep-2026 23:07:49 2026-09-14 03:07:49        WARN        ImageFitter::_finishConstruction        Unrecognized intensity unit . Will assume Jy/pixel
13-Sep-2026 23:07:49 2026-09-14 03:07:49        WARN        ImageFitter::clearNoiseFWHM        noiseFWHM not specified and image has no beam, using uncorrelated noise expressions to calculate uncertainties
13-Sep-2026 23:07:49 2026-09-14 03:07:49        WARN        SkyCompRep::convertToJy        Cannot convert units of brightness to Jy - will assume Jy
13-Sep-2026 23:07:49 2026-09-14 03:07:49        WARN        SkyCompRep::peakToIntegralFlux()        There are no image brightness units, assuming Jy/pixel
13-Sep-2026 23:07:49 2026-09-14 03:07:49        WARN        SkyCompRep::integralToPeakFlux()        There are no image brightness units, assuming Jy/pixel
13-Sep-2026 23:07:49 2026-09-14 03:07:49        WARN        ImageFitter::_finishConstruction        Unrecognized intensity unit . Will assume Jy/pixel
13-Sep-2026 23:07:49 2026-09-14 03:07:49        WARN        ImageFitter::clearNoiseFWHM        noiseFWHM not specified and image has no beam, using uncorrelated noise expressions to calculate uncertainties
13-Sep-2026 23:07:49 2026-09-14 03:07:49        WARN        SkyCompRep::convertToJy        Cannot convert units of brightness to Jy - will assume Jy
13-Sep-2026 23:07:49 2026-09-14 03:07:49        WARN        SkyCompRep::peakToIntegralFlux()        There are no image brightness units, assuming Jy/pixel
13-Sep-2026 23:07:49 2026-09-14 03:07:49        WARN        SkyCompRep::integralToPeakFlux()        There are no image brightness units, assuming Jy/pixel
13-Sep-2026 23:07:49 2026-09-14 03:07:49        WARN        ImageFitter::_finishConstruction        Unrecognized intensity unit . Will assume Jy/pixel
13-Sep-2026 23:07:49 2026-09-14 03:07:49        WARN        ImageFitter::clearNoiseFWHM        noiseFWHM not specified and image has no beam, using uncorrelated noise expressions to calculate uncertainties
13-Sep-2026 23:07:49 2026-09-14 03:07:50        WARN        SkyCompRep::convertToJy        Cannot convert units of brightness to Jy - will assume Jy
13-Sep-2026 23:07:49 2026-09-14 03:07:50        WARN        SkyCompRep::peakToIntegralFlux()        There are no image brightness units, assuming Jy/pixel
13-Sep-2026 23:07:49 2026-09-14 03:07:50        WARN        SkyCompRep::integralToPeakFlux()        There are no image brightness units, assuming Jy/pixel
13-Sep-2026 23:07:49 2026-09-14 03:07:50        WARN        ImageFitter::_finishConstruction        Unrecognized intensity unit . Will assume Jy/pixel
13-Sep-2026 23:07:49 2026-09-14 03:07:50        WARN        ImageFitter::clearNoiseFWHM        noiseFWHM not specified and image has no beam, using uncorrelated noise expressions to calculate uncertainties
13-Sep-2026 23:07:49 2026-09-14 03:07:50        WARN        SkyCompRep::convertToJy        Cannot convert units of brightness to Jy - will assume Jy
13-Sep-2026 23:07:49 2026-09-14 03:07:50        WARN        SkyCompRep::peakToIntegralFlux()        There are no image brightness units, assuming Jy/pixel
13-Sep-2026 23:07:49 2026-09-14 03:07:50        WARN        SkyCompRep::integralToPeakFlux()        There are no image brightness units, assuming Jy/pixel
13-Sep-2026 23:07:50 2026-09-14 03:07:50        WARN        ImageFitter::_finishConstruction        Unrecognized intensity unit . Will assume Jy/pixel
13-Sep-2026 23:07:50 2026-09-14 03:07:50        WARN        ImageFitter::clearNoiseFWHM        noiseFWHM not specified and image has no beam, using uncorrelated noise expressions to calculate uncertainties
13-Sep-2026 23:07:50 2026-09-14 03:07:50        WARN        SkyCompRep::convertToJy        Cannot convert units of brightness to Jy - will assume Jy
13-Sep-2026 23:07:50 2026-09-14 03:07:50        WARN        SkyCompRep::peakToIntegralFlux()        There are no image brightness units, assuming Jy/pixel
13-Sep-2026 23:07:50 2026-09-14 03:07:50        WARN        SkyCompRep::integralToPeakFlux()        There are no image brightness units, assuming Jy/pixel
13-Sep-2026 23:07:50 2026-09-14 03:07:50        WARN        ImageFitter::_finishConstruction        Unrecognized intensity unit . Will assume Jy/pixel
13-Sep-2026 23:07:50 2026-09-14 03:07:50        WARN        ImageFitter::clearNoiseFWHM        noiseFWHM not specified and image has no beam, using uncorrelated noise expressions to calculate uncertainties
13-Sep-2026 23:07:50 2026-09-14 03:07:50        WARN        SkyCompRep::convertToJy        Cannot convert units of brightness to Jy - will assume Jy
13-Sep-2026 23:07:50 2026-09-14 03:07:50        WARN        SkyCompRep::peakToIntegralFlux()        There are no image brightness units, assuming Jy/pixel
13-Sep-2026 23:07:50 2026-09-14 03:07:50        WARN        SkyCompRep::integralToPeakFlux()        There are no image brightness units, assuming Jy/pixel
13-Sep-2026 23:07:50 2026-09-14 03:07:50        WARN        ImageFitter::_finishConstruction        Unrecognized intensity unit . Will assume Jy/pixel
13-Sep-2026 23:07:50 2026-09-14 03:07:50        WARN        ImageFitter::clearNoiseFWHM        noiseFWHM not specified and image has no beam, using uncorrelated noise expressions to calculate uncertainties
13-Sep-2026 23:07:50 2026-09-14 03:07:50        WARN        SkyCompRep::convertToJy        Cannot convert units of brightness to Jy - will assume Jy
13-Sep-2026 23:07:50 2026-09-14 03:07:50        WARN        SkyCompRep::peakToIntegralFlux()        There are no image brightness units, assuming Jy/pixel
13-Sep-2026 23:07:50 2026-09-14 03:07:50        WARN        SkyCompRep::integralToPeakFlux()        There are no image brightness units, assuming Jy/pixel
13-Sep-2026 23:07:50 2026-09-14 03:07:51        WARN        ImageFitter::_finishConstruction        Unrecognized intensity unit . Will assume Jy/pixel
13-Sep-2026 23:07:50 2026-09-14 03:07:51        WARN        ImageFitter::clearNoiseFWHM        noiseFWHM not specified and image has no beam, using uncorrelated noise expressions to calculate uncertainties
13-Sep-2026 23:07:50 2026-09-14 03:07:51        WARN        SkyCompRep::convertToJy        Cannot convert units of brightness to Jy - will assume Jy
13-Sep-2026 23:07:50 2026-09-14 03:07:51        WARN        SkyCompRep::peakToIntegralFlux()        There are no image brightness units, assuming Jy/pixel
13-Sep-2026 23:07:50 2026-09-14 03:07:51        WARN        SkyCompRep::integralToPeakFlux()        There are no image brightness units, assuming Jy/pixel
13-Sep-2026 23:07:50 2026-09-14 03:07:51        WARN        ImageFitter::_finishConstruction        Unrecognized intensity unit . Will assume Jy/pixel
13-Sep-2026 23:07:50 2026-09-14 03:07:51        WARN        ImageFitter::clearNoiseFWHM        noiseFWHM not specified and image has no beam, using uncorrelated noise expressions to calculate uncertainties
13-Sep-2026 23:07:50 2026-09-14 03:07:51        WARN        SkyCompRep::convertToJy        Cannot convert units of brightness to Jy - will assume Jy
13-Sep-2026 23:07:50 2026-09-14 03:07:51        WARN        SkyCompRep::peakToIntegralFlux()        There are no image brightness units, assuming Jy/pixel
13-Sep-2026 23:07:51 2026-09-14 03:07:51        WARN        SkyCompRep::integralToPeakFlux()        There are no image brightness units, assuming Jy/pixel
13-Sep-2026 23:07:51 2026-09-14 03:07:51        WARN        ImageFitter::_finishConstruction        Unrecognized intensity unit . Will assume Jy/pixel
13-Sep-2026 23:07:51 2026-09-14 03:07:51        WARN        ImageFitter::clearNoiseFWHM        noiseFWHM not specified and image has no beam, using uncorrelated noise expressions to calculate uncertainties
13-Sep-2026 23:07:51 2026-09-14 03:07:51        WARN        SkyCompRep::convertToJy        Cannot convert units of brightness to Jy - will assume Jy
13-Sep-2026 23:07:51 2026-09-14 03:07:51        WARN        SkyCompRep::peakToIntegralFlux()        There are no image brightness units, assuming Jy/pixel
13-Sep-2026 23:07:51 2026-09-14 03:07:51        WARN        SkyCompRep::integralToPeakFlux()        There are no image brightness units, assuming Jy/pixel
13-Sep-2026 23:07:51 2026-09-14 03:07:51        WARN        ImageFitter::_finishConstruction        Unrecognized intensity unit . Will assume Jy/pixel
13-Sep-2026 23:07:51 2026-09-14 03:07:51        WARN        ImageFitter::clearNoiseFWHM        noiseFWHM not specified and image has no beam, using uncorrelated noise expressions to calculate uncertainties
13-Sep-2026 23:07:51 2026-09-14 03:07:51        WARN        SkyCompRep::convertToJy        Cannot convert units of brightness to Jy - will assume Jy
13-Sep-2026 23:07:51 2026-09-14 03:07:51        WARN        SkyCompRep::peakToIntegralFlux()        There are no image brightness units, assuming Jy/pixel
13-Sep-2026 23:07:51 2026-09-14 03:07:51        WARN        SkyCompRep::integralToPeakFlux()        There are no image brightness units, assuming Jy/pixel
13-Sep-2026 23:07:51 2026-09-14 03:07:51        WARN        ImageFitter::_finishConstruction        Unrecognized intensity unit . Will assume Jy/pixel
13-Sep-2026 23:07:51 2026-09-14 03:07:51        WARN        ImageFitter::clearNoiseFWHM        noiseFWHM not specified and image has no beam, using uncorrelated noise expressions to calculate uncertainties
13-Sep-2026 23:07:51 2026-09-14 03:07:52        WARN        SkyCompRep::convertToJy        Cannot convert units of brightness to Jy - will assume Jy
13-Sep-2026 23:07:51 2026-09-14 03:07:52        WARN        SkyCompRep::peakToIntegralFlux()        There are no image brightness units, assuming Jy/pixel
13-Sep-2026 23:07:51 2026-09-14 03:07:52        WARN        SkyCompRep::integralToPeakFlux()        There are no image brightness units, assuming Jy/pixel
13-Sep-2026 23:07:52 2026-09-14 03:07:52        WARN        ImageFitter::_finishConstruction        Unrecognized intensity unit . Will assume Jy/pixel
13-Sep-2026 23:07:52 2026-09-14 03:07:52        WARN        ImageFitter::clearNoiseFWHM        noiseFWHM not specified and image has no beam, using uncorrelated noise expressions to calculate uncertainties
13-Sep-2026 23:07:52 2026-09-14 03:07:52        WARN        SkyCompRep::convertToJy        Cannot convert units of brightness to Jy - will assume Jy
13-Sep-2026 23:07:52 2026-09-14 03:07:52        WARN        SkyCompRep::peakToIntegralFlux()        There are no image brightness units, assuming Jy/pixel
13-Sep-2026 23:07:52 2026-09-14 03:07:52        WARN        SkyCompRep::integralToPeakFlux()        There are no image brightness units, assuming Jy/pixel
13-Sep-2026 23:07:52 2026-09-14 03:07:52        WARN        ImageFitter::_finishConstruction        Unrecognized intensity unit . Will assume Jy/pixel
13-Sep-2026 23:07:52 2026-09-14 03:07:52        WARN        ImageFitter::clearNoiseFWHM        noiseFWHM not specified and image has no beam, using uncorrelated noise expressions to calculate uncertainties
13-Sep-2026 23:07:52 2026-09-14 03:07:52        WARN        SkyCompRep::convertToJy        Cannot convert units of brightness to Jy - will assume Jy
13-Sep-2026 23:07:52 2026-09-14 03:07:52        WARN        SkyCompRep::peakToIntegralFlux()        There are no image brightness units, assuming Jy/pixel
13-Sep-2026 23:07:52 2026-09-14 03:07:52        WARN        SkyCompRep::integralToPeakFlux()        There are no image brightness units, assuming Jy/pixel
13-Sep-2026 23:07:52 2026-09-14 03:07:52        WARN        ImageFitter::_finishConstruction        Unrecognized intensity unit . Will assume Jy/pixel
13-Sep-2026 23:07:52 2026-09-14 03:07:52        WARN        ImageFitter::clearNoiseFWHM        noiseFWHM not specified and image has no beam, using uncorrelated noise expressions to calculate uncertainties
13-Sep-2026 23:07:52 2026-09-14 03:07:52        WARN        SkyCompRep::convertToJy        Cannot convert units of brightness to Jy - will assume Jy
13-Sep-2026 23:07:52 2026-09-14 03:07:52        WARN        SkyCompRep::peakToIntegralFlux()        There are no image brightness units, assuming Jy/pixel
13-Sep-2026 23:07:52 2026-09-14 03:07:53        WARN        SkyCompRep::integralToPeakFlux()        There are no image brightness units, assuming Jy/pixel
13-Sep-2026 23:07:52 2026-09-14 03:07:53        WARN        ImageFitter::_finishConstruction        Unrecognized intensity unit . Will assume Jy/pixel
13-Sep-2026 23:07:52 2026-09-14 03:07:53        WARN        ImageFitter::clearNoiseFWHM        noiseFWHM not specified and image has no beam, using uncorrelated noise expressions to calculate uncertainties
13-Sep-2026 23:07:52 2026-09-14 03:07:53        WARN        SkyCompRep::convertToJy        Cannot convert units of brightness to Jy - will assume Jy
13-Sep-2026 23:07:52 2026-09-14 03:07:53        WARN        SkyCompRep::peakToIntegralFlux()        There are no image brightness units, assuming Jy/pixel
13-Sep-2026 23:07:52 2026-09-14 03:07:53        WARN        SkyCompRep::integralToPeakFlux()        There are no image brightness units, assuming Jy/pixel
13-Sep-2026 23:07:52 2026-09-14 03:07:53        WARN        ImageFitter::_finishConstruction        Unrecognized intensity unit . Will assume Jy/pixel
13-Sep-2026 23:07:52 2026-09-14 03:07:53        WARN        ImageFitter::clearNoiseFWHM        noiseFWHM not specified and image has no beam, using uncorrelated noise expressions to calculate uncertainties
13-Sep-2026 23:07:52 2026-09-14 03:07:53        WARN        SkyCompRep::convertToJy        Cannot convert units of brightness to Jy - will assume Jy
13-Sep-2026 23:07:52 2026-09-14 03:07:53        WARN        SkyCompRep::peakToIntegralFlux()        There are no image brightness units, assuming Jy/pixel
13-Sep-2026 23:07:52 2026-09-14 03:07:53        WARN        SkyCompRep::integralToPeakFlux()        There are no image brightness units, assuming Jy/pixel
13-Sep-2026 23:07:52 2026-09-14 03:07:53        WARN        ImageFitter::_finishConstruction        Unrecognized intensity unit . Will assume Jy/pixel
13-Sep-2026 23:07:52 2026-09-14 03:07:53        WARN        ImageFitter::clearNoiseFWHM        noiseFWHM not specified and image has no beam, using uncorrelated noise expressions to calculate uncertainties
13-Sep-2026 23:07:52 2026-09-14 03:07:53        WARN        SkyCompRep::convertToJy        Cannot convert units of brightness to Jy - will assume Jy
13-Sep-2026 23:07:52 2026-09-14 03:07:53        WARN        SkyCompRep::peakToIntegralFlux()        There are no image brightness units, assuming Jy/pixel
13-Sep-2026 23:07:53 2026-09-14 03:07:53        WARN        SkyCompRep::integralToPeakFlux()        There are no image brightness units, assuming Jy/pixel
13-Sep-2026 23:07:53 2026-09-14 03:07:53        WARN        ImageFitter::_finishConstruction        Unrecognized intensity unit . Will assume Jy/pixel
13-Sep-2026 23:07:53 2026-09-14 03:07:53        WARN        ImageFitter::clearNoiseFWHM        noiseFWHM not specified and image has no beam, using uncorrelated noise expressions to calculate uncertainties
13-Sep-2026 23:07:53 2026-09-14 03:07:53        WARN        SkyCompRep::convertToJy        Cannot convert units of brightness to Jy - will assume Jy
13-Sep-2026 23:07:53 2026-09-14 03:07:53        WARN        SkyCompRep::peakToIntegralFlux()        There are no image brightness units, assuming Jy/pixel
13-Sep-2026 23:07:53 2026-09-14 03:07:53        WARN        SkyCompRep::integralToPeakFlux()        There are no image brightness units, assuming Jy/pixel
13-Sep-2026 23:07:53 2026-09-14 03:07:53        WARN        ImageFitter::_finishConstruction        Unrecognized intensity unit . Will assume Jy/pixel
13-Sep-2026 23:07:53 2026-09-14 03:07:53        WARN        ImageFitter::clearNoiseFWHM        noiseFWHM not specified and image has no beam, using uncorrelated noise expressions to calculate uncertainties
13-Sep-2026 23:07:53 2026-09-14 03:07:53        WARN        SkyCompRep::convertToJy        Cannot convert units of brightness to Jy - will assume Jy
13-Sep-2026 23:07:53 2026-09-14 03:07:53        WARN        SkyCompRep::peakToIntegralFlux()        There are no image brightness units, assuming Jy/pixel
13-Sep-2026 23:07:53 2026-09-14 03:07:53        WARN        SkyCompRep::integralToPeakFlux()        There are no image brightness units, assuming Jy/pixel
13-Sep-2026 23:07:53 2026-09-14 03:07:53        WARN        ImageFitter::_finishConstruction        Unrecognized intensity unit . Will assume Jy/pixel
13-Sep-2026 23:07:53 2026-09-14 03:07:53        WARN        ImageFitter::clearNoiseFWHM        noiseFWHM not specified and image has no beam, using uncorrelated noise expressions to calculate uncertainties
13-Sep-2026 23:07:53 2026-09-14 03:07:53        WARN        SkyCompRep::convertToJy        Cannot convert units of brightness to Jy - will assume Jy
13-Sep-2026 23:07:53 2026-09-14 03:07:53        WARN        SkyCompRep::peakToIntegralFlux()        There are no image brightness units, assuming Jy/pixel
13-Sep-2026 23:07:53 2026-09-14 03:07:54        WARN        SkyCompRep::integralToPeakFlux()        There are no image brightness units, assuming Jy/pixel
13-Sep-2026 23:07:53 2026-09-14 03:07:54        WARN        ImageFitter::_finishConstruction        Unrecognized intensity unit . Will assume Jy/pixel
13-Sep-2026 23:07:53 2026-09-14 03:07:54        WARN        ImageFitter::clearNoiseFWHM        noiseFWHM not specified and image has no beam, using uncorrelated noise expressions to calculate uncertainties
13-Sep-2026 23:07:53 2026-09-14 03:07:54        WARN        SkyCompRep::convertToJy        Cannot convert units of brightness to Jy - will assume Jy
13-Sep-2026 23:07:53 2026-09-14 03:07:54        WARN        SkyCompRep::peakToIntegralFlux()        There are no image brightness units, assuming Jy/pixel
13-Sep-2026 23:07:53 2026-09-14 03:07:54        WARN        SkyCompRep::integralToPeakFlux()        There are no image brightness units, assuming Jy/pixel
13-Sep-2026 23:07:53 2026-09-14 03:07:54        WARN        ImageFitter::_finishConstruction        Unrecognized intensity unit . Will assume Jy/pixel
13-Sep-2026 23:07:53 2026-09-14 03:07:54        WARN        ImageFitter::clearNoiseFWHM        noiseFWHM not specified and image has no beam, using uncorrelated noise expressions to calculate uncertainties
13-Sep-2026 23:07:53 2026-09-14 03:07:54        WARN        SkyCompRep::convertToJy        Cannot convert units of brightness to Jy - will assume Jy
13-Sep-2026 23:07:53 2026-09-14 03:07:54        WARN        SkyCompRep::peakToIntegralFlux()        There are no image brightness units, assuming Jy/pixel
13-Sep-2026 23:07:53 2026-09-14 03:07:54        WARN        SkyCompRep::integralToPeakFlux()        There are no image brightness units, assuming Jy/pixel
13-Sep-2026 23:07:53 2026-09-14 03:07:54        WARN        ImageFitter::_finishConstruction        Unrecognized intensity unit . Will assume Jy/pixel
13-Sep-2026 23:07:53 2026-09-14 03:07:54        WARN        ImageFitter::clearNoiseFWHM        noiseFWHM not specified and image has no beam, using uncorrelated noise expressions to calculate uncertainties
13-Sep-2026 23:07:53 2026-09-14 03:07:54        WARN        SkyCompRep::convertToJy        Cannot convert units of brightness to Jy - will assume Jy
13-Sep-2026 23:07:53 2026-09-14 03:07:54        WARN        SkyCompRep::peakToIntegralFlux()        There are no image brightness units, assuming Jy/pixel
13-Sep-2026 23:07:54 2026-09-14 03:07:54        WARN        SkyCompRep::integralToPeakFlux()        There are no image brightness units, assuming Jy/pixel
13-Sep-2026 23:07:54 2026-09-14 03:07:54        WARN        ImageFitter::_finishConstruction        Unrecognized intensity unit . Will assume Jy/pixel
13-Sep-2026 23:07:54 2026-09-14 03:07:54        WARN        ImageFitter::clearNoiseFWHM        noiseFWHM not specified and image has no beam, using uncorrelated noise expressions to calculate uncertainties
13-Sep-2026 23:07:54 2026-09-14 03:07:54        WARN        SkyCompRep::convertToJy        Cannot convert units of brightness to Jy - will assume Jy
13-Sep-2026 23:07:54 2026-09-14 03:07:54        WARN        SkyCompRep::peakToIntegralFlux()        There are no image brightness units, assuming Jy/pixel
13-Sep-2026 23:07:54 2026-09-14 03:07:54        WARN        SkyCompRep::integralToPeakFlux()        There are no image brightness units, assuming Jy/pixel
13-Sep-2026 23:07:54 2026-09-14 03:07:55        WARN        ImageFitter::_finishConstruction        Unrecognized intensity unit . Will assume Jy/pixel
13-Sep-2026 23:07:54 2026-09-14 03:07:55        WARN        ImageFitter::clearNoiseFWHM        noiseFWHM not specified and image has no beam, using uncorrelated noise expressions to calculate uncertainties
13-Sep-2026 23:07:54 2026-09-14 03:07:55        WARN        SkyCompRep::convertToJy        Cannot convert units of brightness to Jy - will assume Jy
13-Sep-2026 23:07:54 2026-09-14 03:07:55        WARN        SkyCompRep::peakToIntegralFlux()        There are no image brightness units, assuming Jy/pixel
13-Sep-2026 23:07:54 2026-09-14 03:07:55        WARN        SkyCompRep::integralToPeakFlux()        There are no image brightness units, assuming Jy/pixel
13-Sep-2026 23:07:54 2026-09-14 03:07:55        WARN        ImageFitter::_finishConstruction        Unrecognized intensity unit . Will assume Jy/pixel
13-Sep-2026 23:07:54 2026-09-14 03:07:55        WARN        ImageFitter::clearNoiseFWHM        noiseFWHM not specified and image has no beam, using uncorrelated noise expressions to calculate uncertainties
13-Sep-2026 23:07:54 2026-09-14 03:07:55        WARN        SkyCompRep::convertToJy        Cannot convert units of brightness to Jy - will assume Jy
13-Sep-2026 23:07:54 2026-09-14 03:07:55        WARN        SkyCompRep::peakToIntegralFlux()        There are no image brightness units, assuming Jy/pixel
13-Sep-2026 23:07:55 2026-09-14 03:07:55        WARN        SkyCompRep::integralToPeakFlux()        There are no image brightness units, assuming Jy/pixel
13-Sep-2026 23:07:55 2026-09-14 03:07:55        WARN        ImageFitter::_finishConstruction        Unrecognized intensity unit . Will assume Jy/pixel
13-Sep-2026 23:07:55 2026-09-14 03:07:55        WARN        ImageFitter::clearNoiseFWHM        noiseFWHM not specified and image has no beam, using uncorrelated noise expressions to calculate uncertainties
13-Sep-2026 23:07:55 2026-09-14 03:07:55        WARN        SkyCompRep::convertToJy        Cannot convert units of brightness to Jy - will assume Jy
13-Sep-2026 23:07:55 2026-09-14 03:07:55        WARN        SkyCompRep::peakToIntegralFlux()        There are no image brightness units, assuming Jy/pixel
13-Sep-2026 23:07:55 2026-09-14 03:07:55        WARN        SkyCompRep::integralToPeakFlux()        There are no image brightness units, assuming Jy/pixel
13-Sep-2026 23:07:55 2026-09-14 03:07:55        WARN        ImageFitter::_finishConstruction        Unrecognized intensity unit . Will assume Jy/pixel
13-Sep-2026 23:07:55 2026-09-14 03:07:55        WARN        ImageFitter::clearNoiseFWHM        noiseFWHM not specified and image has no beam, using uncorrelated noise expressions to calculate uncertainties
13-Sep-2026 23:07:55 2026-09-14 03:07:55        WARN        SkyCompRep::convertToJy        Cannot convert units of brightness to Jy - will assume Jy
13-Sep-2026 23:07:55 2026-09-14 03:07:55        WARN        SkyCompRep::peakToIntegralFlux()        There are no image brightness units, assuming Jy/pixel
13-Sep-2026 23:07:55 2026-09-14 03:07:55        WARN        SkyCompRep::integralToPeakFlux()        There are no image brightness units, assuming Jy/pixel
13-Sep-2026 23:07:55 2026-09-14 03:07:55        WARN        ImageFitter::_finishConstruction        Unrecognized intensity unit . Will assume Jy/pixel
13-Sep-2026 23:07:55 2026-09-14 03:07:55        WARN        ImageFitter::clearNoiseFWHM        noiseFWHM not specified and image has no beam, using uncorrelated noise expressions to calculate uncertainties
13-Sep-2026 23:07:55 2026-09-14 03:07:55        WARN        SkyCompRep::convertToJy        Cannot convert units of brightness to Jy - will assume Jy
13-Sep-2026 23:07:55 2026-09-14 03:07:55        WARN        SkyCompRep::peakToIntegralFlux()        There are no image brightness units, assuming Jy/pixel
13-Sep-2026 23:07:55 2026-09-14 03:07:56        WARN        SkyCompRep::integralToPeakFlux()        There are no image brightness units, assuming Jy/pixel
13-Sep-2026 23:07:55 2026-09-14 03:07:56        WARN        ImageFitter::_finishConstruction        Unrecognized intensity unit . Will assume Jy/pixel
13-Sep-2026 23:07:55 2026-09-14 03:07:56        WARN        ImageFitter::clearNoiseFWHM        noiseFWHM not specified and image has no beam, using uncorrelated noise expressions to calculate uncertainties
13-Sep-2026 23:07:56 2026-09-14 03:07:56        WARN        SkyCompRep::convertToJy        Cannot convert units of brightness to Jy - will assume Jy
13-Sep-2026 23:07:56 2026-09-14 03:07:56        WARN        SkyCompRep::peakToIntegralFlux()        There are no image brightness units, assuming Jy/pixel
13-Sep-2026 23:07:56 2026-09-14 03:07:56        WARN        SkyCompRep::integralToPeakFlux()        There are no image brightness units, assuming Jy/pixel
13-Sep-2026 23:07:56 2026-09-14 03:07:56        WARN        ImageFitter::_finishConstruction        Unrecognized intensity unit . Will assume Jy/pixel
13-Sep-2026 23:07:56 2026-09-14 03:07:56        WARN        ImageFitter::clearNoiseFWHM        noiseFWHM not specified and image has no beam, using uncorrelated noise expressions to calculate uncertainties
13-Sep-2026 23:07:56 2026-09-14 03:07:56        WARN        SkyCompRep::convertToJy        Cannot convert units of brightness to Jy - will assume Jy
13-Sep-2026 23:07:56 2026-09-14 03:07:56        WARN        SkyCompRep::peakToIntegralFlux()        There are no image brightness units, assuming Jy/pixel
13-Sep-2026 23:07:56 2026-09-14 03:07:56        WARN        SkyCompRep::integralToPeakFlux()        There are no image brightness units, assuming Jy/pixel
13-Sep-2026 23:07:56 2026-09-14 03:07:56        WARN        ImageFitter::_finishConstruction        Unrecognized intensity unit . Will assume Jy/pixel
13-Sep-2026 23:07:56 2026-09-14 03:07:56        WARN        ImageFitter::clearNoiseFWHM        noiseFWHM not specified and image has no beam, using uncorrelated noise expressions to calculate uncertainties
13-Sep-2026 23:07:56 2026-09-14 03:07:56        WARN        SkyCompRep::convertToJy        Cannot convert units of brightness to Jy - will assume Jy
13-Sep-2026 23:07:56 2026-09-14 03:07:56        WARN        SkyCompRep::peakToIntegralFlux()        There are no image brightness units, assuming Jy/pixel
13-Sep-2026 23:07:56 2026-09-14 03:07:57        WARN        SkyCompRep::integralToPeakFlux()        There are no image brightness units, assuming Jy/pixel
13-Sep-2026 23:07:56 2026-09-14 03:07:57        WARN        ImageFitter::_finishConstruction        Unrecognized intensity unit . Will assume Jy/pixel
13-Sep-2026 23:07:56 2026-09-14 03:07:57        WARN        ImageFitter::clearNoiseFWHM        noiseFWHM not specified and image has no beam, using uncorrelated noise expressions to calculate uncertainties
13-Sep-2026 23:07:56 2026-09-14 03:07:57        WARN        SkyCompRep::convertToJy        Cannot convert units of brightness to Jy - will assume Jy
13-Sep-2026 23:07:56 2026-09-14 03:07:57        WARN        SkyCompRep::peakToIntegralFlux()        There are no image brightness units, assuming Jy/pixel
13-Sep-2026 23:07:56 2026-09-14 03:07:57        WARN        SkyCompRep::integralToPeakFlux()        There are no image brightness units, assuming Jy/pixel
13-Sep-2026 23:07:56 2026-09-14 03:07:57        WARN        ImageFitter::_finishConstruction        Unrecognized intensity unit . Will assume Jy/pixel
13-Sep-2026 23:07:56 2026-09-14 03:07:57        WARN        ImageFitter::clearNoiseFWHM        noiseFWHM not specified and image has no beam, using uncorrelated noise expressions to calculate uncertainties
13-Sep-2026 23:07:56 2026-09-14 03:07:57        WARN        SkyCompRep::convertToJy        Cannot convert units of brightness to Jy - will assume Jy
13-Sep-2026 23:07:56 2026-09-14 03:07:57        WARN        SkyCompRep::peakToIntegralFlux()        There are no image brightness units, assuming Jy/pixel
13-Sep-2026 23:07:56 2026-09-14 03:07:57        WARN        SkyCompRep::integralToPeakFlux()        There are no image brightness units, assuming Jy/pixel
13-Sep-2026 23:07:56 2026-09-14 03:07:57        WARN        ImageFitter::_finishConstruction        Unrecognized intensity unit . Will assume Jy/pixel
13-Sep-2026 23:07:56 2026-09-14 03:07:57        WARN        ImageFitter::clearNoiseFWHM        noiseFWHM not specified and image has no beam, using uncorrelated noise expressions to calculate uncertainties
13-Sep-2026 23:07:57 2026-09-14 03:07:57        WARN        SkyCompRep::convertToJy        Cannot convert units of brightness to Jy - will assume Jy
13-Sep-2026 23:07:57 2026-09-14 03:07:57        WARN        SkyCompRep::peakToIntegralFlux()        There are no image brightness units, assuming Jy/pixel
13-Sep-2026 23:07:57 2026-09-14 03:07:57        WARN        SkyCompRep::integralToPeakFlux()        There are no image brightness units, assuming Jy/pixel
13-Sep-2026 23:07:57 2026-09-14 03:07:58        WARN        ImageFitter::_finishConstruction        Unrecognized intensity unit . Will assume Jy/pixel
13-Sep-2026 23:07:57 2026-09-14 03:07:58        WARN        ImageFitter::clearNoiseFWHM        noiseFWHM not specified and image has no beam, using uncorrelated noise expressions to calculate uncertainties
13-Sep-2026 23:07:57 2026-09-14 03:07:58        WARN        SkyCompRep::convertToJy        Cannot convert units of brightness to Jy - will assume Jy
13-Sep-2026 23:07:57 2026-09-14 03:07:58        WARN        SkyCompRep::peakToIntegralFlux()        There are no image brightness units, assuming Jy/pixel
13-Sep-2026 23:07:57 2026-09-14 03:07:58        WARN        SkyCompRep::integralToPeakFlux()        There are no image brightness units, assuming Jy/pixel
13-Sep-2026 23:07:57 2026-09-14 03:07:58        WARN        ImageFitter::_finishConstruction        Unrecognized intensity unit . Will assume Jy/pixel
13-Sep-2026 23:07:57 2026-09-14 03:07:58        WARN        ImageFitter::clearNoiseFWHM        noiseFWHM not specified and image has no beam, using uncorrelated noise expressions to calculate uncertainties
13-Sep-2026 23:07:57 2026-09-14 03:07:58        WARN        SkyCompRep::convertToJy        Cannot convert units of brightness to Jy - will assume Jy
13-Sep-2026 23:07:57 2026-09-14 03:07:58        WARN        SkyCompRep::peakToIntegralFlux()        There are no image brightness units, assuming Jy/pixel
13-Sep-2026 23:07:57 2026-09-14 03:07:58        WARN        SkyCompRep::integralToPeakFlux()        There are no image brightness units, assuming Jy/pixel
13-Sep-2026 23:07:57 2026-09-14 03:07:58        WARN        ImageFitter::_finishConstruction        Unrecognized intensity unit . Will assume Jy/pixel
13-Sep-2026 23:07:57 2026-09-14 03:07:58        WARN        ImageFitter::clearNoiseFWHM        noiseFWHM not specified and image has no beam, using uncorrelated noise expressions to calculate uncertainties
13-Sep-2026 23:07:57 2026-09-14 03:07:58        WARN        SkyCompRep::convertToJy        Cannot convert units of brightness to Jy - will assume Jy
13-Sep-2026 23:07:57 2026-09-14 03:07:58        WARN        SkyCompRep::peakToIntegralFlux()        There are no image brightness units, assuming Jy/pixel
13-Sep-2026 23:07:58 2026-09-14 03:07:58        WARN        SkyCompRep::integralToPeakFlux()        There are no image brightness units, assuming Jy/pixel
13-Sep-2026 23:07:58 2026-09-14 03:07:58        WARN        ImageFitter::_finishConstruction        Unrecognized intensity unit . Will assume Jy/pixel
13-Sep-2026 23:07:58 2026-09-14 03:07:58        WARN        ImageFitter::clearNoiseFWHM        noiseFWHM not specified and image has no beam, using uncorrelated noise expressions to calculate uncertainties
13-Sep-2026 23:07:58 2026-09-14 03:07:58        WARN        SkyCompRep::convertToJy        Cannot convert units of brightness to Jy - will assume Jy
13-Sep-2026 23:07:58 2026-09-14 03:07:58        WARN        SkyCompRep::peakToIntegralFlux()        There are no image brightness units, assuming Jy/pixel
13-Sep-2026 23:07:58 2026-09-14 03:07:58        WARN        SkyCompRep::integralToPeakFlux()        There are no image brightness units, assuming Jy/pixel
13-Sep-2026 23:07:58
13-Sep-2026 23:07:58 Test that regridding to new refcode preserves source positions
13-Sep-2026 23:07:58 diff [0.]
13-Sep-2026 23:07:58 diff [0.]
13-Sep-2026 23:07:58 diff [0.]
13-Sep-2026 23:07:58 diff [0.]
13-Sep-2026 23:07:58 diff [0.]
13-Sep-2026 23:07:58 diff [0.]
13-Sep-2026 23:07:58 diff [0.]
13-Sep-2026 23:07:58 diff [0.]
13-Sep-2026 23:07:58 diff [0.]
13-Sep-2026 23:07:58 diff [0.]
13-Sep-2026 23:07:58 diff [0.]
13-Sep-2026 23:07:58 diff [0.]
13-Sep-2026 23:07:58 diff [0.]
13-Sep-2026 23:07:58 diff [0.]
13-Sep-2026 23:07:58 diff [0.]
13-Sep-2026 23:07:58 diff [0.]
13-Sep-2026 23:07:58 diff [0.]
13-Sep-2026 23:07:58 diff [0.]
13-Sep-2026 23:07:58 diff [0.]
13-Sep-2026 23:07:58 diff [0.]
13-Sep-2026 23:07:58 diff [0.]
13-Sep-2026 23:07:58 diff [0.]
13-Sep-2026 23:07:58 diff [0.]
13-Sep-2026 23:07:58 diff [0.]
13-Sep-2026 23:07:58 diff [0.]
13-Sep-2026 23:07:58 diff [0.]
13-Sep-2026 23:07:58 diff [0.]
13-Sep-2026 23:07:58 diff [0.]
13-Sep-2026 23:07:58 diff [0.]
13-Sep-2026 23:07:58 diff [0.]
13-Sep-2026 23:07:58 diff [0.]
13-Sep-2026 23:07:58 diff [0.]
13-Sep-2026 23:07:58 diff [0.]
13-Sep-2026 23:07:58 diff [0.]
13-Sep-2026 23:07:58 diff [0.]
13-Sep-2026 23:07:58 diff [0.]
13-Sep-2026 23:07:58 diff [0.]
13-Sep-2026 23:07:58 diff [0.]
13-Sep-2026 23:07:58 diff [0.]
13-Sep-2026 23:07:58 diff [0.]
13-Sep-2026 23:07:58 diff [0.]
13-Sep-2026 23:07:58 diff [0.]
13-Sep-2026 23:07:58 diff [0.]
13-Sep-2026 23:07:58 diff [0.]
13-Sep-2026 23:07:58 diff [0.]
13-Sep-2026 23:07:58 diff [0.]
13-Sep-2026 23:07:58 diff [0.]
13-Sep-2026 23:07:58 diff [0.]
13-Sep-2026 23:07:58 diff [0.]
13-Sep-2026 23:07:58 diff [0.]
13-Sep-2026 23:07:58 diff [0.]
13-Sep-2026 23:07:58 diff [0.]
13-Sep-2026 23:07:58 diff [0.]
13-Sep-2026 23:07:58 diff [0.]
13-Sep-2026 23:07:58 diff [0.]
13-Sep-2026 23:07:58 PASSED
13-Sep-2026 23:07:58
13-Sep-2026 23:07:58 test_task_imregrid.py::imregrid_test::test_template_stokes_length_and_input_stokes_length_gt_1 2026-09-14 03:07:59        WARN        imregrid::ImageRegridder::_doImagesOverlap        At least one of the images exceeds one degree on at one side, not checking for direction plane overlap.
13-Sep-2026 23:07:58
13-Sep-2026 23:07:58 PASSED
13-Sep-2026 23:07:58
13-Sep-2026 23:07:58 test_task_imregrid.py::imregrid_test::test_template_stokes_length_gt_1_and_input_stokes_length_gt_0 2026-09-14 03:07:59        SEVERE        imregrid::image::regrid        Exception Reported: Exception: Input image and template coordinate system have no common stokes..
13-Sep-2026 23:07:58 2026-09-14 03:07:59        SEVERE        imregrid::image::regrid+        ... thrown by void casa::ImageRegridderBase<T>::_finishConstruction() [with T = float] at File: /source/casainstall/include/casacpp/imageanalysis/ImageAnalysis/ImageRegridderBase.tcc, line: 138
13-Sep-2026 23:07:58 2026-09-14 03:07:59        SEVERE        imregrid::::casa        Task imregrid raised an exception of class RuntimeError with the following message: Exception: Input image and template coordinate system have no common stokes..
13-Sep-2026 23:07:58 2026-09-14 03:07:59        SEVERE        imregrid::::casa+        ... thrown by void casa::ImageRegridderBase<T>::_finishConstruction() [with T = float] at File: /source/casainstall/include/casacpp/imageanalysis/ImageAnalysis/ImageRegridderBase.tcc, line: 138
13-Sep-2026 23:07:58 2026-09-14 03:07:59        SEVERE        imregrid::image::regrid        Exception Reported: Exception: Specified output stokes axis length (3) does not match the number of common stokes (1) in the input image and template coordinate system..
13-Sep-2026 23:07:58 2026-09-14 03:07:59        SEVERE        imregrid::image::regrid+        ... thrown by void casa::ImageRegridderBase<T>::_finishConstruction() [with T = float] at File: /source/casainstall/include/casacpp/imageanalysis/ImageAnalysis/ImageRegridderBase.tcc, line: 143
13-Sep-2026 23:07:58 2026-09-14 03:07:59        SEVERE        imregrid::::casa        Task imregrid raised an exception of class RuntimeError with the following message: Exception: Specified output stokes axis length (3) does not match the number of common stokes (1) in the input image and template coordinate system..
13-Sep-2026 23:07:58 2026-09-14 03:07:59        SEVERE        imregrid::::casa+        ... thrown by void casa::ImageRegridderBase<T>::_finishConstruction() [with T = float] at File: /source/casainstall/include/casacpp/imageanalysis/ImageAnalysis/ImageRegridderBase.tcc, line: 143
13-Sep-2026 23:07:58
13-Sep-2026 23:07:58 Verify correct behavior for the template image having a stokes axis of length > 1
13-Sep-2026 23:07:58 PASSED
13-Sep-2026 23:07:58
13-Sep-2026 23:07:58 - generated xml file: /home/casatest/casa6/casatestutils/nosedir/xml/test_task_imregrid/nose.xml -
13-Sep-2026 23:07:58 ======================== 20 passed, 1 warning in 45.45s ========================
13-Sep-2026 23:07:58
13-Sep-2026 23:07:58
13-Sep-2026 23:07:58 Setting Working Directory: /home/casatest/casa6/casatestutils/nosedir/test_task_visstat/
13-Sep-2026 23:07:58 Test Directory: /home/casatest/casa6/casatestutils/nosedir/test_task_visstat
13-Sep-2026 23:07:58
13-Sep-2026 23:07:58 Running Command: pytest --junitxml=/home/casatest/casa6/casatestutils/nosedir/xml/test_task_visstat/nose.xml -s --disable-pytest-warnings --verbose -ra --tb=short /home/casatest/casa6/casatestutils/nosedir/test_task_visstat/
13-Sep-2026 23:07:58
13-Sep-2026 23:07:58 Setting Working Directory: /home/casatest/casa6/casatestutils/nosedir/test_task_fluxscale/
13-Sep-2026 23:07:58 Test Directory: /home/casatest/casa6/casatestutils/nosedir/test_task_fluxscale
13-Sep-2026 23:07:58
13-Sep-2026 23:07:58 Running Command: pytest --junitxml=/home/casatest/casa6/casatestutils/nosedir/xml/test_task_fluxscale/nose.xml -s --disable-pytest-warnings --verbose -ra --tb=short /home/casatest/casa6/casatestutils/nosedir/test_task_fluxscale/
13-Sep-2026 23:07:58
13-Sep-2026 23:07:58 Setting Working Directory: /home/casatest/casa6/casatestutils/nosedir/test_task_sdgaincal/
13-Sep-2026 23:07:58 Test Directory: /home/casatest/casa6/casatestutils/nosedir/test_task_sdgaincal
13-Sep-2026 23:07:58
13-Sep-2026 23:07:58 Running Command: pytest --junitxml=/home/casatest/casa6/casatestutils/nosedir/xml/test_task_sdgaincal/nose.xml -s --disable-pytest-warnings --verbose -ra --tb=short /home/casatest/casa6/casatestutils/nosedir/test_task_sdgaincal/
13-Sep-2026 23:07:58
13-Sep-2026 23:07:58 Setting Working Directory: /home/casatest/casa6/casatestutils/nosedir/test_task_listobs/
13-Sep-2026 23:07:58 Test Directory: /home/casatest/casa6/casatestutils/nosedir/test_task_listobs
13-Sep-2026 23:07:58
13-Sep-2026 23:07:58 Running Command: pytest --junitxml=/home/casatest/casa6/casatestutils/nosedir/xml/test_task_listobs/nose.xml -s --disable-pytest-warnings --verbose -ra --tb=short /home/casatest/casa6/casatestutils/nosedir/test_task_listobs/
13-Sep-2026 23:07:58
13-Sep-2026 23:07:58 Setting Working Directory: /home/casatest/casa6/casatestutils/nosedir/test_task_imhead/
13-Sep-2026 23:07:58 Test Directory: /home/casatest/casa6/casatestutils/nosedir/test_task_imhead
13-Sep-2026 23:07:58
13-Sep-2026 23:07:58 Running Command: pytest --junitxml=/home/casatest/casa6/casatestutils/nosedir/xml/test_task_imhead/nose.xml -s --disable-pytest-warnings --verbose -ra --tb=short /home/casatest/casa6/casatestutils/nosedir/test_task_imhead/
13-Sep-2026 23:07:58
13-Sep-2026 23:07:58 Setting Working Directory: /home/casatest/casa6/casatestutils/nosedir/test_task_immath/
13-Sep-2026 23:07:58 Test Directory: /home/casatest/casa6/casatestutils/nosedir/test_task_immath
13-Sep-2026 23:07:58
13-Sep-2026 23:07:58 Running Command: pytest --junitxml=/home/casatest/casa6/casatestutils/nosedir/xml/test_task_immath/nose.xml -s --disable-pytest-warnings --verbose -ra --tb=short /home/casatest/casa6/casatestutils/nosedir/test_task_immath/
13-Sep-2026 23:07:58
13-Sep-2026 23:07:58 Setting Working Directory: /home/casatest/casa6/casatestutils/nosedir/test_task_setjy/
13-Sep-2026 23:07:58 Test Directory: /home/casatest/casa6/casatestutils/nosedir/test_task_setjy
13-Sep-2026 23:07:58
13-Sep-2026 23:07:58 Running Command: pytest --junitxml=/home/casatest/casa6/casatestutils/nosedir/xml/test_task_setjy/nose.xml -s --disable-pytest-warnings --verbose -ra --tb=short /home/casatest/casa6/casatestutils/nosedir/test_task_setjy/
13-Sep-2026 23:07:58
13-Sep-2026 23:07:58 Setting Working Directory: /home/casatest/casa6/casatestutils/nosedir/test_task_plotants/
13-Sep-2026 23:07:58 Test Directory: /home/casatest/casa6/casatestutils/nosedir/test_task_plotants
13-Sep-2026 23:07:58
13-Sep-2026 23:07:58 Running Command: pytest --junitxml=/home/casatest/casa6/casatestutils/nosedir/xml/test_task_plotants/nose.xml -s --disable-pytest-warnings --verbose -ra --tb=short /home/casatest/casa6/casatestutils/nosedir/test_task_plotants/
13-Sep-2026 23:07:58
13-Sep-2026 23:07:58 Setting Working Directory: /home/casatest/casa6/casatestutils/nosedir/test_task_imcontsub/
13-Sep-2026 23:07:58 Test Directory: /home/casatest/casa6/casatestutils/nosedir/test_task_imcontsub
13-Sep-2026 23:07:58
13-Sep-2026 23:07:58 Running Command: pytest --junitxml=/home/casatest/casa6/casatestutils/nosedir/xml/test_task_imcontsub/nose.xml -s --disable-pytest-warnings --verbose -ra --tb=short /home/casatest/casa6/casatestutils/nosedir/test_task_imcontsub/
13-Sep-2026 23:07:58
13-Sep-2026 23:07:58 Setting Working Directory: /home/casatest/casa6/casatestutils/nosedir/test_task_sdbaseline/
13-Sep-2026 23:07:58 Test Directory: /home/casatest/casa6/casatestutils/nosedir/test_task_sdbaseline
13-Sep-2026 23:07:58
13-Sep-2026 23:07:58 Running Command: pytest --junitxml=/home/casatest/casa6/casatestutils/nosedir/xml/test_task_sdbaseline/nose.xml -s --disable-pytest-warnings --verbose -ra --tb=short /home/casatest/casa6/casatestutils/nosedir/test_task_sdbaseline/
13-Sep-2026 23:07:58
13-Sep-2026 23:07:58 Setting Working Directory: /home/casatest/casa6/casatestutils/nosedir/test_task_split/
13-Sep-2026 23:07:58 Test Directory: /home/casatest/casa6/casatestutils/nosedir/test_task_split
13-Sep-2026 23:07:58
13-Sep-2026 23:07:58 Running Command: pytest --junitxml=/home/casatest/casa6/casatestutils/nosedir/xml/test_task_split/nose.xml -s --disable-pytest-warnings --verbose -ra --tb=short /home/casatest/casa6/casatestutils/nosedir/test_task_split/
13-Sep-2026 23:07:58
13-Sep-2026 23:07:58 Setting Working Directory: /home/casatest/casa6/casatestutils/nosedir/test_task_flagdata/
13-Sep-2026 23:07:58 Test Directory: /home/casatest/casa6/casatestutils/nosedir/test_task_flagdata
13-Sep-2026 23:07:58
13-Sep-2026 23:07:58 Running Command: pytest --junitxml=/home/casatest/casa6/casatestutils/nosedir/xml/test_task_flagdata/nose.xml -s --disable-pytest-warnings --verbose -ra --tb=short /home/casatest/casa6/casatestutils/nosedir/test_task_flagdata/
13-Sep-2026 23:07:58
13-Sep-2026 23:07:58 Setting Working Directory: /home/casatest/casa6/casatestutils/nosedir/test_task_exportfits/
13-Sep-2026 23:07:58 Test Directory: /home/casatest/casa6/casatestutils/nosedir/test_task_exportfits
13-Sep-2026 23:07:58
13-Sep-2026 23:07:58 Running Command: pytest --junitxml=/home/casatest/casa6/casatestutils/nosedir/xml/test_task_exportfits/nose.xml -s --disable-pytest-warnings --verbose -ra --tb=short /home/casatest/casa6/casatestutils/nosedir/test_task_exportfits/
13-Sep-2026 23:07:58
13-Sep-2026 23:07:58 Setting Working Directory: /home/casatest/casa6/casatestutils/nosedir/test_task_imstat/
13-Sep-2026 23:07:58 Test Directory: /home/casatest/casa6/casatestutils/nosedir/test_task_imstat
13-Sep-2026 23:07:58
13-Sep-2026 23:07:58 Running Command: pytest --junitxml=/home/casatest/casa6/casatestutils/nosedir/xml/test_task_imstat/nose.xml -s --disable-pytest-warnings --verbose -ra --tb=short /home/casatest/casa6/casatestutils/nosedir/test_task_imstat/
13-Sep-2026 23:07:58
13-Sep-2026 23:07:58 Setting Working Directory: /home/casatest/casa6/casatestutils/nosedir/test_task_phaseshift/
13-Sep-2026 23:07:58 Test Directory: /home/casatest/casa6/casatestutils/nosedir/test_task_phaseshift
13-Sep-2026 23:07:58
13-Sep-2026 23:07:58 Running Command: pytest --junitxml=/home/casatest/casa6/casatestutils/nosedir/xml/test_task_phaseshift/nose.xml -s --disable-pytest-warnings --verbose -ra --tb=short /home/casatest/casa6/casatestutils/nosedir/test_task_phaseshift/
13-Sep-2026 23:07:58
13-Sep-2026 23:07:58 Setting Working Directory: /home/casatest/casa6/casatestutils/nosedir/test_task_importuvfits/
13-Sep-2026 23:07:58 Test Directory: /home/casatest/casa6/casatestutils/nosedir/test_task_importuvfits
13-Sep-2026 23:07:58
13-Sep-2026 23:07:58 Running Command: pytest --junitxml=/home/casatest/casa6/casatestutils/nosedir/xml/test_task_importuvfits/nose.xml -s --disable-pytest-warnings --verbose -ra --tb=short /home/casatest/casa6/casatestutils/nosedir/test_task_importuvfits/
13-Sep-2026 23:07:58
13-Sep-2026 23:07:58 Setting Working Directory: /home/casatest/casa6/casatestutils/nosedir/test_task_imval/
13-Sep-2026 23:07:58 Test Directory: /home/casatest/casa6/casatestutils/nosedir/test_task_imval
13-Sep-2026 23:07:58
13-Sep-2026 23:07:58 Running Command: pytest --junitxml=/home/casatest/casa6/casatestutils/nosedir/xml/test_task_imval/nose.xml -s --disable-pytest-warnings --verbose -ra --tb=short /home/casatest/casa6/casatestutils/nosedir/test_task_imval/
13-Sep-2026 23:07:58
13-Sep-2026 23:07:58 Setting Working Directory: /home/casatest/casa6/casatestutils/nosedir/test_task_immoments/
13-Sep-2026 23:07:58 Test Directory: /home/casatest/casa6/casatestutils/nosedir/test_task_immoments
13-Sep-2026 23:07:58
13-Sep-2026 23:07:58 Running Command: pytest --junitxml=/home/casatest/casa6/casatestutils/nosedir/xml/test_task_immoments/nose.xml -s --disable-pytest-warnings --verbose -ra --tb=short /home/casatest/casa6/casatestutils/nosedir/test_task_immoments/
13-Sep-2026 23:07:58
13-Sep-2026 23:07:58 Setting Working Directory: /home/casatest/casa6/casatestutils/nosedir/test_task_importasdm/
13-Sep-2026 23:07:58 Test Directory: /home/casatest/casa6/casatestutils/nosedir/test_task_importasdm
13-Sep-2026 23:07:58
13-Sep-2026 23:07:58 Running Command: pytest --junitxml=/home/casatest/casa6/casatestutils/nosedir/xml/test_task_importasdm/nose.xml -s --disable-pytest-warnings --verbose -ra --tb=short /home/casatest/casa6/casatestutils/nosedir/test_task_importasdm/
13-Sep-2026 23:07:58
13-Sep-2026 23:07:58 Setting Working Directory: /home/casatest/casa6/casatestutils/nosedir/test_task_imregrid/
13-Sep-2026 23:07:58 Test Directory: /home/casatest/casa6/casatestutils/nosedir/test_task_imregrid
13-Sep-2026 23:07:58
13-Sep-2026 23:07:58 Running Command: pytest --junitxml=/home/casatest/casa6/casatestutils/nosedir/xml/test_task_imregrid/nose.xml -s --disable-pytest-warnings --verbose -ra --tb=short /home/casatest/casa6/casatestutils/nosedir/test_task_imregrid/
13-Sep-2026 23:07:59 total 82492
13-Sep-2026 23:07:59 -rw-r--r-- 1 casaci 15001  1934135 Sep 14 02:37 casatasks-6.7.7.7a14882.dev1-py3-none-any.whl
13-Sep-2026 23:07:59 -rw-r--r-- 1 casaci root   2772538 Sep 14 03:07 casatasks_test.log
13-Sep-2026 23:07:59 -rw-r--r-- 1 casaci 15001   161131 Sep 14 02:37 casatestutils-6.7.7.7a14882.dev1-py3-none-any.whl
13-Sep-2026 23:07:59 -rw-r--r-- 1 casaci 15001 79346756 Sep 14 02:37 casatools-6.7.7.7a14882.dev1-cp312-cp312-manylinux_2_28_x86_64.whl
13-Sep-2026 23:07:59 -rw-r--r-- 1 casaci root       907 Sep 14 03:07 requirements.txt
13-Sep-2026 23:07:59 -rw-r--r-- 1 casaci root      3269 Sep 14 03:07 test_task_applycal.xml
13-Sep-2026 23:07:59 -rw-r--r-- 1 casaci root      2016 Sep 14 03:07 test_task_concat.xml
13-Sep-2026 23:07:59 -rw-r--r-- 1 casaci root      1798 Sep 14 03:07 test_task_exportasdm.xml
13-Sep-2026 23:07:59 -rw-r--r-- 1 casaci root       359 Sep 14 03:07 test_task_exportfits.xml
13-Sep-2026 23:07:59 -rw-r--r-- 1 casaci root     28029 Sep 14 03:07 test_task_flagdata.xml
13-Sep-2026 23:07:59 -rw-r--r-- 1 casaci root       966 Sep 14 03:07 test_task_flagmanager.xml
13-Sep-2026 23:07:59 -rw-r--r-- 1 casaci root      2357 Sep 14 03:07 test_task_fluxscale.xml
13-Sep-2026 23:07:59 -rw-r--r-- 1 casaci root      4054 Sep 14 03:07 test_task_gaincal.xml
13-Sep-2026 23:07:59 -rw-r--r-- 1 casaci root      1223 Sep 14 03:07 test_task_imcontsub.xml
13-Sep-2026 23:07:59 -rw-r--r-- 1 casaci root      1767 Sep 14 03:07 test_task_imdev.xml
13-Sep-2026 23:07:59 -rw-r--r-- 1 casaci root      2134 Sep 14 03:07 test_task_imhead.xml
13-Sep-2026 23:07:59 -rw-r--r-- 1 casaci root      3054 Sep 14 03:07 test_task_immath.xml
13-Sep-2026 23:07:59 -rw-r--r-- 1 casaci root      1667 Sep 14 03:07 test_task_immoments.xml
13-Sep-2026 23:07:59 -rw-r--r-- 1 casaci root      4126 Sep 14 03:07 test_task_importasdm.xml
13-Sep-2026 23:07:59 -rw-r--r-- 1 casaci root      1818 Sep 14 03:07 test_task_importuvfits.xml
13-Sep-2026 23:07:59 -rw-r--r-- 1 casaci root       830 Sep 14 03:07 test_task_imreframe.xml
13-Sep-2026 23:07:59 -rw-r--r-- 1 casaci root      2342 Sep 14 03:07 test_task_imregrid.xml
13-Sep-2026 23:07:59 -rw-r--r-- 1 casaci root      1440 Sep 14 03:07 test_task_imstat.xml
13-Sep-2026 23:07:59 -rw-r--r-- 1 casaci root      3129 Sep 14 03:07 test_task_imval.xml
13-Sep-2026 23:07:59 -rw-r--r-- 1 casaci root      8580 Sep 14 03:07 test_task_listobs.xml
13-Sep-2026 23:07:59 -rw-r--r-- 1 casaci root      2663 Sep 14 03:07 test_task_makemask.xml
13-Sep-2026 23:07:59 -rw-r--r-- 1 casaci root     34484 Sep 14 03:07 test_task_mstransform.xml
13-Sep-2026 23:07:59 -rw-r--r-- 1 casaci root      3400 Sep 14 03:07 test_task_phaseshift.xml
13-Sep-2026 23:07:59 -rw-r--r-- 1 casaci root      1095 Sep 14 03:07 test_task_plotants.xml
13-Sep-2026 23:07:59 -rw-r--r-- 1 casaci root     18287 Sep 14 03:07 test_task_sdbaseline.xml
13-Sep-2026 23:07:59 -rw-r--r-- 1 casaci root      6646 Sep 14 03:07 test_task_sdcal.xml
13-Sep-2026 23:07:59 -rw-r--r-- 1 casaci root      1589 Sep 14 03:07 test_task_sdgaincal.xml
13-Sep-2026 23:07:59 -rw-r--r-- 1 casaci root      4399 Sep 14 03:07 test_task_sdtimeaverage.xml
13-Sep-2026 23:07:59 -rw-r--r-- 1 casaci root      3446 Sep 14 03:07 test_task_setjy.xml
13-Sep-2026 23:07:59 -rw-r--r-- 1 casaci root     17902 Sep 14 03:07 test_task_split.xml
13-Sep-2026 23:07:59 -rw-r--r-- 1 casaci root       705 Sep 14 03:07 test_task_spxfit.xml
13-Sep-2026 23:07:59 -rw-r--r-- 1 casaci root      1096 Sep 14 03:07 test_task_vishead.xml
13-Sep-2026 23:07:59 -rw-r--r-- 1 casaci root      3288 Sep 14 03:07 test_task_visstat.xml
13-Sep-2026 23:07:59 Finished task 'Test wheel' with result: Success
13-Sep-2026 23:07:59 Starting task 'Inject is_641' of type 'com.atlassian.bamboo.plugins.bamboo-variable-inject-plugin:inject'
13-Sep-2026 23:07:59 Injected variable bamboo.inject.is_641=False in LOCAL scope
13-Sep-2026 23:07:59 Finished task 'Inject is_641' with result: Success
13-Sep-2026 23:07:59
Substituting variable: ${bamboo.agentId} with 153550851
13-Sep-2026 23:07:59
Substituting variable: ${bamboo.agentId} with 153550851
13-Sep-2026 23:07:59
Substituting variable: ${bamboo.agentId} with 153550851
13-Sep-2026 23:07:59
Substituting variable: ${bamboo.agentId} with 153550851
13-Sep-2026 23:07:59 Starting task 'Tar work directory' of type 'com.atlassian.bamboo.plugins.scripttask:task.builder.script'
13-Sep-2026 23:07:59
Beginning to execute external process for build 'CASASPECS - Dev Test 3.12 - CAS-14882 - Test Tasks Many Linux 2.28 Py3.12 #1 (CASASPECS-DEVTESTPY312149-TTM228PY312-1)'
... running command line:
/opt/ci_workspace/casa/bamboo/agent3/temp/CASASPECS-DEVTESTPY312149-TTM228PY312-1-ScriptBuildTask-10434238677473352065.sh
... in: /opt/ci_workspace/casa/bamboo/agent3/xml-data/build-dir/CASASPECS-DEVTESTPY312149-TTM228PY312
13-Sep-2026 23:07:59 Package working directory
13-Sep-2026 23:08:11 nosedir/
13-Sep-2026 23:08:11 nosedir/test_task_imdev/
13-Sep-2026 23:08:11 nosedir/test_task_imdev/test_task_imdev.py
13-Sep-2026 23:08:11 nosedir/test_task_imdev/conftest.py
13-Sep-2026 23:08:11 nosedir/test_task_imdev/casa-20260914-023935.log
13-Sep-2026 23:08:11 nosedir/test_task_imdev/short_summary.log
13-Sep-2026 23:08:11 nosedir/xml/
13-Sep-2026 23:08:11 nosedir/xml/test_task_imdev/
13-Sep-2026 23:08:11 nosedir/xml/test_task_imdev/nose.xml
13-Sep-2026 23:08:11 nosedir/xml/test_task_imreframe/
13-Sep-2026 23:08:11 nosedir/xml/test_task_imreframe/nose.xml
13-Sep-2026 23:08:11 nosedir/xml/test_task_gaincal/
13-Sep-2026 23:08:11 nosedir/xml/test_task_gaincal/nose.xml
13-Sep-2026 23:08:11 nosedir/xml/test_task_vishead/
13-Sep-2026 23:08:11 nosedir/xml/test_task_vishead/nose.xml
13-Sep-2026 23:08:11 nosedir/xml/test_task_applycal/
13-Sep-2026 23:08:11 nosedir/xml/test_task_applycal/nose.xml
13-Sep-2026 23:08:11 nosedir/xml/test_task_mstransform/
13-Sep-2026 23:08:11 nosedir/xml/test_task_mstransform/nose.xml
13-Sep-2026 23:08:11 nosedir/xml/test_task_sdcal/
13-Sep-2026 23:08:11 nosedir/xml/test_task_sdcal/nose.xml
13-Sep-2026 23:08:11 nosedir/xml/test_task_concat/
13-Sep-2026 23:08:11 nosedir/xml/test_task_concat/nose.xml
13-Sep-2026 23:08:11 nosedir/xml/test_task_exportasdm/
13-Sep-2026 23:08:11 nosedir/xml/test_task_exportasdm/nose.xml
13-Sep-2026 23:08:11 nosedir/xml/test_task_makemask/
13-Sep-2026 23:08:11 nosedir/xml/test_task_makemask/nose.xml
13-Sep-2026 23:08:11 nosedir/xml/test_task_spxfit/
13-Sep-2026 23:08:11 nosedir/xml/test_task_spxfit/nose.xml
13-Sep-2026 23:08:11 nosedir/xml/test_task_flagmanager/
13-Sep-2026 23:08:11 nosedir/xml/test_task_flagmanager/nose.xml
13-Sep-2026 23:08:11 nosedir/xml/test_task_sdtimeaverage/
13-Sep-2026 23:08:11 nosedir/xml/test_task_sdtimeaverage/nose.xml
13-Sep-2026 23:08:11 nosedir/xml/test_task_visstat/
13-Sep-2026 23:08:11 nosedir/xml/test_task_visstat/nose.xml
13-Sep-2026 23:08:11 nosedir/xml/test_task_fluxscale/
13-Sep-2026 23:08:11 nosedir/xml/test_task_fluxscale/nose.xml
13-Sep-2026 23:08:11 nosedir/xml/test_task_sdgaincal/
13-Sep-2026 23:08:11 nosedir/xml/test_task_sdgaincal/nose.xml
13-Sep-2026 23:08:11 nosedir/xml/test_task_listobs/
13-Sep-2026 23:08:11 nosedir/xml/test_task_listobs/nose.xml
13-Sep-2026 23:08:11 nosedir/xml/test_task_imhead/
13-Sep-2026 23:08:11 nosedir/xml/test_task_imhead/nose.xml
13-Sep-2026 23:08:11 nosedir/xml/test_task_immath/
13-Sep-2026 23:08:11 nosedir/xml/test_task_immath/nose.xml
13-Sep-2026 23:08:11 nosedir/xml/test_task_setjy/
13-Sep-2026 23:08:11 nosedir/xml/test_task_setjy/nose.xml
13-Sep-2026 23:08:11 nosedir/xml/test_task_plotants/
13-Sep-2026 23:08:11 nosedir/xml/test_task_plotants/nose.xml
13-Sep-2026 23:08:11 nosedir/xml/test_task_imcontsub/
13-Sep-2026 23:08:11 nosedir/xml/test_task_imcontsub/nose.xml
13-Sep-2026 23:08:11 nosedir/xml/test_task_sdbaseline/
13-Sep-2026 23:08:11 nosedir/xml/test_task_sdbaseline/nose.xml
13-Sep-2026 23:08:11 nosedir/xml/test_task_split/
13-Sep-2026 23:08:11 nosedir/xml/test_task_split/nose.xml
13-Sep-2026 23:08:11 nosedir/xml/test_task_flagdata/
13-Sep-2026 23:08:11 nosedir/xml/test_task_flagdata/nose.xml
13-Sep-2026 23:08:11 nosedir/xml/test_task_exportfits/
13-Sep-2026 23:08:11 nosedir/xml/test_task_exportfits/nose.xml
13-Sep-2026 23:08:11 nosedir/xml/test_task_imstat/
13-Sep-2026 23:08:11 nosedir/xml/test_task_imstat/nose.xml
13-Sep-2026 23:08:11 nosedir/xml/test_task_phaseshift/
13-Sep-2026 23:08:11 nosedir/xml/test_task_phaseshift/nose.xml
13-Sep-2026 23:08:11 nosedir/xml/test_task_importuvfits/
13-Sep-2026 23:08:11 nosedir/xml/test_task_importuvfits/nose.xml
13-Sep-2026 23:08:11 nosedir/xml/test_task_imval/
13-Sep-2026 23:08:11 nosedir/xml/test_task_imval/nose.xml
13-Sep-2026 23:08:11 nosedir/xml/test_task_immoments/
13-Sep-2026 23:08:11 nosedir/xml/test_task_immoments/nose.xml
13-Sep-2026 23:08:11 nosedir/xml/test_task_importasdm/
13-Sep-2026 23:08:11 nosedir/xml/test_task_importasdm/nose.xml
13-Sep-2026 23:08:11 nosedir/xml/test_task_imregrid/
13-Sep-2026 23:08:11 nosedir/xml/test_task_imregrid/nose.xml
13-Sep-2026 23:08:11 nosedir/test_task_imreframe/
13-Sep-2026 23:08:11 nosedir/test_task_imreframe/test_task_imreframe.py
13-Sep-2026 23:08:11 nosedir/test_task_imreframe/conftest.py
13-Sep-2026 23:08:11 nosedir/test_task_imreframe/casa-20260914-024017.log
13-Sep-2026 23:08:11 nosedir/test_task_imreframe/short_summary.log
13-Sep-2026 23:08:11 nosedir/test_task_gaincal/
13-Sep-2026 23:08:11 nosedir/test_task_gaincal/test_task_gaincal.py
13-Sep-2026 23:08:11 nosedir/test_task_gaincal/conftest.py
13-Sep-2026 23:08:11 nosedir/test_task_gaincal/casa-20260914-024020.log
13-Sep-2026 23:08:11 nosedir/test_task_gaincal/short_summary.log
13-Sep-2026 23:08:11 nosedir/test_task_gaincal/flagged.ms.flagversions/
13-Sep-2026 23:08:11 nosedir/test_task_gaincal/flagged.ms.flagversions/FLAG_VERSION_LIST
13-Sep-2026 23:08:11 nosedir/test_task_gaincal/flagged.ms.flagversions/flags.flagdata_1/
13-Sep-2026 23:08:11 nosedir/test_task_gaincal/flagged.ms.flagversions/flags.flagdata_2/
13-Sep-2026 23:08:11 nosedir/test_task_gaincal/flagged.ms.flagversions/flags.flagdata_3/
13-Sep-2026 23:08:11 nosedir/test_task_gaincal/temp.cal.AMP.pol0.log
13-Sep-2026 23:08:11 nosedir/test_task_gaincal/temp.cal.AMP.pol1.log
13-Sep-2026 23:08:11 nosedir/test_task_gaincal/temp.cal.PHASE.pol0.log
13-Sep-2026 23:08:11 nosedir/test_task_gaincal/temp.cal.PHASE.pol1.log
13-Sep-2026 23:08:11 nosedir/test_task_vishead/
13-Sep-2026 23:08:11 nosedir/test_task_vishead/test_task_vishead.py
13-Sep-2026 23:08:11 nosedir/test_task_vishead/conftest.py
13-Sep-2026 23:08:11 nosedir/test_task_vishead/casa-20260914-024221.log
13-Sep-2026 23:08:11 nosedir/test_task_vishead/short_summary.log
13-Sep-2026 23:08:11 nosedir/test_task_applycal/
13-Sep-2026 23:08:11 nosedir/test_task_applycal/test_task_applycal.py
13-Sep-2026 23:08:11 nosedir/test_task_applycal/conftest.py
13-Sep-2026 23:08:11 nosedir/test_task_applycal/casa-20260914-024224.log
13-Sep-2026 23:08:11 nosedir/test_task_applycal/short_summary.log
13-Sep-2026 23:08:11 nosedir/test_task_mstransform/
13-Sep-2026 23:08:11 nosedir/test_task_mstransform/test_task_mstransform.py
13-Sep-2026 23:08:11 nosedir/test_task_mstransform/conftest.py
13-Sep-2026 23:08:11 nosedir/test_task_mstransform/casa-20260914-024340.log
13-Sep-2026 23:08:11 nosedir/test_task_mstransform/short_summary.log
13-Sep-2026 23:08:11 nosedir/test_task_mstransform/mstspwnames.txt
13-Sep-2026 23:08:11 nosedir/test_task_mstransform/test_uid___A002_X997a62_X8c-short
13-Sep-2026 23:08:11 nosedir/test_task_mstransform/test_uid___A002_X997a62_X8c-short_cmd.txt
13-Sep-2026 23:08:11 nosedir/summary_of_failed.log
13-Sep-2026 23:08:11 nosedir/test_task_sdcal/
13-Sep-2026 23:08:11 nosedir/test_task_sdcal/test_task_sdcal.py
13-Sep-2026 23:08:11 nosedir/test_task_sdcal/conftest.py
13-Sep-2026 23:08:11 nosedir/test_task_sdcal/casa-20260914-024631.log
13-Sep-2026 23:08:11 nosedir/test_task_sdcal/short_summary.log
13-Sep-2026 23:08:11 nosedir/test_task_concat/
13-Sep-2026 23:08:11 nosedir/test_task_concat/test_task_concat.py
13-Sep-2026 23:08:11 nosedir/test_task_concat/conftest.py
13-Sep-2026 23:08:11 nosedir/test_task_concat/casa-20260914-024700.log
13-Sep-2026 23:08:11 nosedir/test_task_concat/short_summary.log
13-Sep-2026 23:08:11 nosedir/test_task_exportasdm/
13-Sep-2026 23:08:11 nosedir/test_task_exportasdm/test_task_exportasdm.py
13-Sep-2026 23:08:11 nosedir/test_task_exportasdm/conftest.py
13-Sep-2026 23:08:11 nosedir/test_task_exportasdm/casa-20260914-024806.log
13-Sep-2026 23:08:11 nosedir/test_task_exportasdm/X_osro_013.55979.93803716435
13-Sep-2026 23:08:11 nosedir/test_task_exportasdm/xosro2ref.ms.flagversions/
13-Sep-2026 23:08:11 nosedir/test_task_exportasdm/xosro2ref.ms.flagversions/FLAG_VERSION_LIST
13-Sep-2026 23:08:11 nosedir/test_task_exportasdm/xosro2ref.ms.flagversions/flags.Original/
13-Sep-2026 23:08:11 nosedir/test_task_exportasdm/uid___A002_X72bc38_X000
13-Sep-2026 23:08:11 nosedir/test_task_exportasdm/asdm.ms.flagversions/
13-Sep-2026 23:08:11 nosedir/test_task_exportasdm/asdm.ms.flagversions/FLAG_VERSION_LIST
13-Sep-2026 23:08:11 nosedir/test_task_exportasdm/asdm.ms.flagversions/flags.Original/
13-Sep-2026 23:08:11 nosedir/test_task_exportasdm/short_summary.log
13-Sep-2026 23:08:11 nosedir/test_task_exportasdm/xosro2ref-reimp.ms.flagversions/
13-Sep-2026 23:08:11 nosedir/test_task_exportasdm/xosro2ref-reimp.ms.flagversions/FLAG_VERSION_LIST
13-Sep-2026 23:08:11 nosedir/test_task_exportasdm/xosro2ref-reimp.ms.flagversions/flags.Original/
13-Sep-2026 23:08:11 nosedir/test_task_makemask/
13-Sep-2026 23:08:11 nosedir/test_task_makemask/test_task_makemask.py
13-Sep-2026 23:08:11 nosedir/test_task_makemask/conftest.py
13-Sep-2026 23:08:11 nosedir/test_task_makemask/casa-20260914-024827.log
13-Sep-2026 23:08:11 nosedir/test_task_makemask/short_summary.log
13-Sep-2026 23:08:11 nosedir/test_task_makemask/elliptical_annulus_crtf.txt
13-Sep-2026 23:08:11 nosedir/test_task_spxfit/
13-Sep-2026 23:08:11 nosedir/test_task_spxfit/test_task_spxfit.py
13-Sep-2026 23:08:11 nosedir/test_task_spxfit/conftest.py
13-Sep-2026 23:08:11 nosedir/test_task_spxfit/casa-20260914-024847.log
13-Sep-2026 23:08:11 nosedir/test_task_spxfit/short_summary.log
13-Sep-2026 23:08:11 nosedir/test_task_flagmanager/
13-Sep-2026 23:08:11 nosedir/test_task_flagmanager/test_task_flagmanager.py
13-Sep-2026 23:08:11 nosedir/test_task_flagmanager/conftest.py
13-Sep-2026 23:08:11 nosedir/test_task_flagmanager/casa-20260914-024855.log
13-Sep-2026 23:08:11 nosedir/test_task_flagmanager/short_summary.log
13-Sep-2026 23:08:11 nosedir/test_task_sdtimeaverage/
13-Sep-2026 23:08:11 nosedir/test_task_sdtimeaverage/test_task_sdtimeaverage.py
13-Sep-2026 23:08:11 nosedir/test_task_sdtimeaverage/conftest.py
13-Sep-2026 23:08:11 nosedir/test_task_sdtimeaverage/casa-20260914-024859.log
13-Sep-2026 23:08:11 nosedir/test_task_sdtimeaverage/short_summary.log
13-Sep-2026 23:08:11 nosedir/test_task_visstat/
13-Sep-2026 23:08:11 nosedir/test_task_visstat/test_task_visstat.py
13-Sep-2026 23:08:11 nosedir/test_task_visstat/conftest.py
13-Sep-2026 23:08:11 nosedir/test_task_visstat/casa-20260914-024920.log
13-Sep-2026 23:08:11 nosedir/test_task_visstat/short_summary.log
13-Sep-2026 23:08:11 nosedir/test_task_fluxscale/
13-Sep-2026 23:08:11 nosedir/test_task_fluxscale/test_task_fluxscale.py
13-Sep-2026 23:08:11 nosedir/test_task_fluxscale/conftest.py
13-Sep-2026 23:08:11 nosedir/test_task_fluxscale/casa-20260914-025003.log
13-Sep-2026 23:08:11 nosedir/test_task_fluxscale/short_summary.log
13-Sep-2026 23:08:11 nosedir/test_task_fluxscale/twhya.fittest1.out.txt
13-Sep-2026 23:08:11 nosedir/test_task_fluxscale/twhya.fittest2.out.txt
13-Sep-2026 23:08:11 nosedir/test_task_sdgaincal/
13-Sep-2026 23:08:11 nosedir/test_task_sdgaincal/test_task_sdgaincal.py
13-Sep-2026 23:08:11 nosedir/test_task_sdgaincal/conftest.py
13-Sep-2026 23:08:11 nosedir/test_task_sdgaincal/casa-20260914-025011.log
13-Sep-2026 23:08:11 nosedir/test_task_sdgaincal/short_summary.log
13-Sep-2026 23:08:11 nosedir/test_task_listobs/
13-Sep-2026 23:08:11 nosedir/test_task_listobs/test_task_listobs.py
13-Sep-2026 23:08:11 nosedir/test_task_listobs/conftest.py
13-Sep-2026 23:08:11 nosedir/test_task_listobs/casa-20260914-025154.log
13-Sep-2026 23:08:11 nosedir/test_task_listobs/short_summary.log
13-Sep-2026 23:08:11 nosedir/test_task_imhead/
13-Sep-2026 23:08:11 nosedir/test_task_imhead/test_task_imhead.py
13-Sep-2026 23:08:11 nosedir/test_task_imhead/conftest.py
13-Sep-2026 23:08:11 nosedir/test_task_imhead/casa-20260914-025204.log
13-Sep-2026 23:08:11 nosedir/test_task_imhead/short_summary.log
13-Sep-2026 23:08:11 nosedir/test_task_immath/
13-Sep-2026 23:08:11 nosedir/test_task_immath/test_task_immath.py
13-Sep-2026 23:08:11 nosedir/test_task_immath/conftest.py
13-Sep-2026 23:08:11 nosedir/test_task_immath/casa-20260914-025210.log
13-Sep-2026 23:08:11 nosedir/test_task_immath/short_summary.log
13-Sep-2026 23:08:11 nosedir/test_task_setjy/
13-Sep-2026 23:08:11 nosedir/test_task_setjy/test_task_setjy.py
13-Sep-2026 23:08:11 nosedir/test_task_setjy/conftest.py
13-Sep-2026 23:08:11 nosedir/test_task_setjy/casa-20260914-025218.log
13-Sep-2026 23:08:11 nosedir/test_task_setjy/short_summary.log
13-Sep-2026 23:08:11 nosedir/test_task_plotants/
13-Sep-2026 23:08:11 nosedir/test_task_plotants/test_task_plotants.py
13-Sep-2026 23:08:11 nosedir/test_task_plotants/conftest.py
13-Sep-2026 23:08:11 nosedir/test_task_plotants/casa-20260914-025313.log
13-Sep-2026 23:08:11 nosedir/test_task_plotants/short_summary.log
13-Sep-2026 23:08:11 nosedir/test_task_imcontsub/
13-Sep-2026 23:08:11 nosedir/test_task_imcontsub/test_task_imcontsub.py
13-Sep-2026 23:08:11 nosedir/test_task_imcontsub/conftest.py
13-Sep-2026 23:08:11 nosedir/test_task_imcontsub/casa-20260914-025317.log
13-Sep-2026 23:08:11 nosedir/test_task_imcontsub/short_summary.log
13-Sep-2026 23:08:11 nosedir/test_task_imcontsub/test_boxychans_cont.im/
13-Sep-2026 23:08:11 nosedir/test_task_imcontsub/test_boxychans_line.im/
13-Sep-2026 23:08:11 nosedir/test_task_imcontsub/test_boxychans_line.im.diff/
13-Sep-2026 23:08:11 nosedir/test_task_imcontsub/test_boxychans_cont.im.diff/
13-Sep-2026 23:08:11 nosedir/test_task_sdbaseline/
13-Sep-2026 23:08:11 nosedir/test_task_sdbaseline/test_task_sdbaseline.py
13-Sep-2026 23:08:11 nosedir/test_task_sdbaseline/conftest.py
13-Sep-2026 23:08:11 nosedir/test_task_sdbaseline/casa-20260914-025401.log
13-Sep-2026 23:08:11 nosedir/test_task_sdbaseline/short_summary.log
13-Sep-2026 23:08:11 nosedir/test_task_split/
13-Sep-2026 23:08:11 nosedir/test_task_split/test_task_split.py
13-Sep-2026 23:08:11 nosedir/test_task_split/conftest.py
13-Sep-2026 23:08:11 nosedir/test_task_split/casa-20260914-025451.log
13-Sep-2026 23:08:11 nosedir/test_task_split/short_summary.log
13-Sep-2026 23:08:11 nosedir/test_task_flagdata/
13-Sep-2026 23:08:11 nosedir/test_task_flagdata/test_task_flagdata.py
13-Sep-2026 23:08:11 nosedir/test_task_flagdata/conftest.py
13-Sep-2026 23:08:11 nosedir/test_task_flagdata/casa-20260914-025506.log
13-Sep-2026 23:08:11 nosedir/test_task_flagdata/short_summary.log
13-Sep-2026 23:08:11 nosedir/test_task_flagdata/listfakefield.txt
13-Sep-2026 23:08:11 nosedir/test_task_flagdata/rflag_output_thresholds_timedev0.txt
13-Sep-2026 23:08:11 nosedir/test_task_flagdata/rflag_output_thresholds_freqdev0.txt
13-Sep-2026 23:08:11 nosedir/test_task_exportfits/
13-Sep-2026 23:08:11 nosedir/test_task_exportfits/test_task_exportfits.py
13-Sep-2026 23:08:11 nosedir/test_task_exportfits/conftest.py
13-Sep-2026 23:08:11 nosedir/test_task_exportfits/casa-20260914-025644.log
13-Sep-2026 23:08:11 nosedir/test_task_exportfits/my.im/
13-Sep-2026 23:08:11 nosedir/test_task_exportfits/short_summary.log
13-Sep-2026 23:08:11 nosedir/test_task_imstat/
13-Sep-2026 23:08:11 nosedir/test_task_imstat/test_task_imstat.py
13-Sep-2026 23:08:11 nosedir/test_task_imstat/conftest.py
13-Sep-2026 23:08:11 nosedir/test_task_imstat/casa-20260914-025645.log
13-Sep-2026 23:08:11 nosedir/test_task_imstat/short_summary.log
13-Sep-2026 23:08:11 nosedir/test_task_imstat/imstat.log
13-Sep-2026 23:08:11 nosedir/test_task_phaseshift/
13-Sep-2026 23:08:11 nosedir/test_task_phaseshift/test_task_phaseshift.py
13-Sep-2026 23:08:11 nosedir/test_task_phaseshift/conftest.py
13-Sep-2026 23:08:11 nosedir/test_task_phaseshift/casa-20260914-025704.log
13-Sep-2026 23:08:11 nosedir/test_task_phaseshift/short_summary.log
13-Sep-2026 23:08:11 nosedir/test_task_importuvfits/
13-Sep-2026 23:08:11 nosedir/test_task_importuvfits/test_task_importuvfits.py
13-Sep-2026 23:08:11 nosedir/test_task_importuvfits/conftest.py
13-Sep-2026 23:08:11 nosedir/test_task_importuvfits/casa-20260914-025929.log
13-Sep-2026 23:08:11 nosedir/test_task_importuvfits/short_summary.log
13-Sep-2026 23:08:11 nosedir/test_task_imval/
13-Sep-2026 23:08:11 nosedir/test_task_imval/test_task_imval.py
13-Sep-2026 23:08:11 nosedir/test_task_imval/conftest.py
13-Sep-2026 23:08:11 nosedir/test_task_imval/casa-20260914-025942.log
13-Sep-2026 23:08:11 nosedir/test_task_imval/short_summary.log
13-Sep-2026 23:08:11 nosedir/test_task_immoments/
13-Sep-2026 23:08:11 nosedir/test_task_immoments/test_task_immoments.py
13-Sep-2026 23:08:11 nosedir/test_task_immoments/conftest.py
13-Sep-2026 23:08:11 nosedir/test_task_immoments/casa-20260914-025944.log
13-Sep-2026 23:08:11 nosedir/test_task_immoments/short_summary.log
13-Sep-2026 23:08:11 nosedir/test_task_importasdm/
13-Sep-2026 23:08:11 nosedir/test_task_importasdm/test_task_importasdm.py
13-Sep-2026 23:08:11 nosedir/test_task_importasdm/conftest.py
13-Sep-2026 23:08:11 nosedir/test_task_importasdm/casa-20260914-025955.log
13-Sep-2026 23:08:11 nosedir/test_task_importasdm/short_summary.log
13-Sep-2026 23:08:11 nosedir/test_task_importasdm/useDir.on.ms.flagversions/
13-Sep-2026 23:08:11 nosedir/test_task_importasdm/useDir.on.ms.flagversions/FLAG_VERSION_LIST
13-Sep-2026 23:08:11 nosedir/test_task_importasdm/useDir.on.ms.flagversions/flags.Original/
13-Sep-2026 23:08:11 nosedir/test_task_imregrid/
13-Sep-2026 23:08:11 nosedir/test_task_imregrid/test_task_imregrid.py
13-Sep-2026 23:08:11 nosedir/test_task_imregrid/conftest.py
13-Sep-2026 23:08:11 nosedir/test_task_imregrid/casa-20260914-030713.log
13-Sep-2026 23:08:11 nosedir/test_task_imregrid/short_summary.log
13-Sep-2026 23:08:11 nosedir/requirements.txt
13-Sep-2026 23:08:11 total 84400
13-Sep-2026 23:08:11 -rw-r--r-- 1 casaci 15001  1934135 Sep 14 02:37 casatasks-6.7.7.7a14882.dev1-py3-none-any.whl
13-Sep-2026 23:08:11 -rw-r--r-- 1 casaci root   2772538 Sep 14 03:07 casatasks_test.log
13-Sep-2026 23:08:11 -rw-r--r-- 1 casaci 15001   161131 Sep 14 02:37 casatestutils-6.7.7.7a14882.dev1-py3-none-any.whl
13-Sep-2026 23:08:11 -rw-r--r-- 1 casaci 15001 79346756 Sep 14 02:37 casatools-6.7.7.7a14882.dev1-cp312-cp312-manylinux_2_28_x86_64.whl
13-Sep-2026 23:08:11 -rw-r--r-- 1 casaci root       907 Sep 14 03:07 requirements.txt
13-Sep-2026 23:08:11 -rw-r--r-- 1 casaci root      3269 Sep 14 03:07 test_task_applycal.xml
13-Sep-2026 23:08:11 -rw-r--r-- 1 casaci root      2016 Sep 14 03:07 test_task_concat.xml
13-Sep-2026 23:08:11 -rw-r--r-- 1 casaci root      1798 Sep 14 03:07 test_task_exportasdm.xml
13-Sep-2026 23:08:11 -rw-r--r-- 1 casaci root       359 Sep 14 03:07 test_task_exportfits.xml
13-Sep-2026 23:08:11 -rw-r--r-- 1 casaci root     28029 Sep 14 03:07 test_task_flagdata.xml
13-Sep-2026 23:08:11 -rw-r--r-- 1 casaci root       966 Sep 14 03:07 test_task_flagmanager.xml
13-Sep-2026 23:08:11 -rw-r--r-- 1 casaci root      2357 Sep 14 03:07 test_task_fluxscale.xml
13-Sep-2026 23:08:11 -rw-r--r-- 1 casaci root      4054 Sep 14 03:07 test_task_gaincal.xml
13-Sep-2026 23:08:11 -rw-r--r-- 1 casaci root      1223 Sep 14 03:07 test_task_imcontsub.xml
13-Sep-2026 23:08:11 -rw-r--r-- 1 casaci root      1767 Sep 14 03:07 test_task_imdev.xml
13-Sep-2026 23:08:11 -rw-r--r-- 1 casaci root      2134 Sep 14 03:07 test_task_imhead.xml
13-Sep-2026 23:08:11 -rw-r--r-- 1 casaci root      3054 Sep 14 03:07 test_task_immath.xml
13-Sep-2026 23:08:11 -rw-r--r-- 1 casaci root      1667 Sep 14 03:07 test_task_immoments.xml
13-Sep-2026 23:08:11 -rw-r--r-- 1 casaci root      4126 Sep 14 03:07 test_task_importasdm.xml
13-Sep-2026 23:08:11 -rw-r--r-- 1 casaci root      1818 Sep 14 03:07 test_task_importuvfits.xml
13-Sep-2026 23:08:11 -rw-r--r-- 1 casaci root       830 Sep 14 03:07 test_task_imreframe.xml
13-Sep-2026 23:08:11 -rw-r--r-- 1 casaci root      2342 Sep 14 03:07 test_task_imregrid.xml
13-Sep-2026 23:08:11 -rw-r--r-- 1 casaci root      1440 Sep 14 03:07 test_task_imstat.xml
13-Sep-2026 23:08:11 -rw-r--r-- 1 casaci root      3129 Sep 14 03:07 test_task_imval.xml
13-Sep-2026 23:08:11 -rw-r--r-- 1 casaci root      8580 Sep 14 03:07 test_task_listobs.xml
13-Sep-2026 23:08:11 -rw-r--r-- 1 casaci root      2663 Sep 14 03:07 test_task_makemask.xml
13-Sep-2026 23:08:11 -rw-r--r-- 1 casaci root     34484 Sep 14 03:07 test_task_mstransform.xml
13-Sep-2026 23:08:11 -rw-r--r-- 1 casaci root      3400 Sep 14 03:07 test_task_phaseshift.xml
13-Sep-2026 23:08:11 -rw-r--r-- 1 casaci root      1095 Sep 14 03:07 test_task_plotants.xml
13-Sep-2026 23:08:11 -rw-r--r-- 1 casaci root     18287 Sep 14 03:07 test_task_sdbaseline.xml
13-Sep-2026 23:08:11 -rw-r--r-- 1 casaci root      6646 Sep 14 03:07 test_task_sdcal.xml
13-Sep-2026 23:08:11 -rw-r--r-- 1 casaci root      1589 Sep 14 03:07 test_task_sdgaincal.xml
13-Sep-2026 23:08:11 -rw-r--r-- 1 casaci root      4399 Sep 14 03:07 test_task_sdtimeaverage.xml
13-Sep-2026 23:08:11 -rw-r--r-- 1 casaci root      3446 Sep 14 03:07 test_task_setjy.xml
13-Sep-2026 23:08:11 -rw-r--r-- 1 casaci root     17902 Sep 14 03:07 test_task_split.xml
13-Sep-2026 23:08:11 -rw-r--r-- 1 casaci root       705 Sep 14 03:07 test_task_spxfit.xml
13-Sep-2026 23:08:11 -rw-r--r-- 1 casaci root      1096 Sep 14 03:07 test_task_vishead.xml
13-Sep-2026 23:08:11 -rw-r--r-- 1 casaci root      3288 Sep 14 03:07 test_task_visstat.xml
13-Sep-2026 23:08:11 -rw-r--r-- 1 casaci root   1951802 Sep 14 03:08 work-manylinux_228_casatasks-3.12.tar.gz
13-Sep-2026 23:08:11 Done packaging working directory
13-Sep-2026 23:08:11 Finished task 'Tar work directory' with result: Success
13-Sep-2026 23:08:11 Starting task 'Parse tests' of type 'com.atlassian.bamboo.plugins.testresultparser:task.testresultparser.junit'
13-Sep-2026 23:08:11 Parsing test results under /opt/ci_workspace/casa/bamboo/agent3/xml-data/build-dir/CASASPECS-DEVTESTPY312149-TTM228PY312...
13-Sep-2026 23:08:11 Finished task 'Parse tests' with result: Success
13-Sep-2026 23:08:11
Substituting variable: ${bamboo.agentId} with 153550851
13-Sep-2026 23:08:11
Substituting variable: ${bamboo.repository.branch.name} with CAS-14882
13-Sep-2026 23:08:11
Substituting variable: ${bamboo.planRepository.branchName} with CAS-14882
13-Sep-2026 23:08:11
Substituting variable: ${bamboo.agentId} with 153550851
13-Sep-2026 23:08:11
Substituting variable: ${bamboo.agentId} with 153550851
13-Sep-2026 23:08:11
Substituting variable: ${bamboo.agentId} with 153550851
13-Sep-2026 23:08:11
Substituting variable: ${bamboo.agentId} with 153550851
13-Sep-2026 23:08:11
Substituting variable: ${bamboo.agentId} with 153550851
13-Sep-2026 23:08:11 Starting task 'Upload wheel' of type 'com.atlassian.bamboo.plugins.scripttask:task.builder.script'
13-Sep-2026 23:08:11
Beginning to execute external process for build 'CASASPECS - Dev Test 3.12 - CAS-14882 - Test Tasks Many Linux 2.28 Py3.12 #1 (CASASPECS-DEVTESTPY312149-TTM228PY312-1)'
... running command line:
/opt/ci_workspace/casa/bamboo/agent3/temp/CASASPECS-DEVTESTPY312149-TTM228PY312-1-ScriptBuildTask-8773731179545188321.sh
... in: /opt/ci_workspace/casa/bamboo/agent3/xml-data/build-dir/CASASPECS-DEVTESTPY312149-TTM228PY312
13-Sep-2026 23:08:11 Ticket fix version: CASA 6.ACTIVE
13-Sep-2026 23:08:11 No matching version found
13-Sep-2026 23:08:12 Collecting twine
13-Sep-2026 23:08:12   Downloading twine-7.0.0-py3-none-any.whl (43 kB)
13-Sep-2026 23:08:12      ━━━━━━━━━━━━━━━━━━━━━━━━━━━━━━━━━━━━━━━━ 43.2/43.2 kB 9.4 MB/s eta 0:00:00
13-Sep-2026 23:08:12 Collecting requests>=2.20
13-Sep-2026 23:08:12   Downloading requests-2.34.2-py3-none-any.whl (73 kB)
13-Sep-2026 23:08:12      ━━━━━━━━━━━━━━━━━━━━━━━━━━━━━━━━━━━━━━━━ 73.1/73.1 kB 16.9 MB/s eta 0:00:00
13-Sep-2026 23:08:12 Collecting keyring>=21.2.0
13-Sep-2026 23:08:12   Downloading keyring-25.7.0-py3-none-any.whl (39 kB)
13-Sep-2026 23:08:12 Collecting packaging>=26.1
13-Sep-2026 23:08:12   Downloading packaging-26.3-py3-none-any.whl (129 kB)
13-Sep-2026 23:08:12      ━━━━━━━━━━━━━━━━━━━━━━━━━━━━━━━━━━━━━━ 130.0/130.0 kB 55.3 MB/s eta 0:00:00
13-Sep-2026 23:08:12 Collecting rfc3986>=1.4.0
13-Sep-2026 23:08:12   Downloading rfc3986-2.0.0-py2.py3-none-any.whl (31 kB)
13-Sep-2026 23:08:12 Collecting rich>=14.3.3
13-Sep-2026 23:08:12   Downloading rich-15.0.0-py3-none-any.whl (310 kB)
13-Sep-2026 23:08:12      ━━━━━━━━━━━━━━━━━━━━━━━━━━━━━━━━━━━━━━ 310.7/310.7 kB 69.2 MB/s eta 0:00:00
13-Sep-2026 23:08:12 Collecting readme-renderer>=35.0
13-Sep-2026 23:08:12   Downloading readme_renderer-46.0-py3-none-any.whl (14 kB)
13-Sep-2026 23:08:12 Collecting urllib3>=1.26.0
13-Sep-2026 23:08:12   Downloading urllib3-2.7.0-py3-none-any.whl (131 kB)
13-Sep-2026 23:08:12      ━━━━━━━━━━━━━━━━━━━━━━━━━━━━━━━━━━━━━━ 131.1/131.1 kB 69.0 MB/s eta 0:00:00
13-Sep-2026 23:08:12 Collecting requests-toolbelt!=0.9.0,>=0.8.0
13-Sep-2026 23:08:12   Downloading requests_toolbelt-1.0.0-py2.py3-none-any.whl (54 kB)
13-Sep-2026 23:08:12      ━━━━━━━━━━━━━━━━━━━━━━━━━━━━━━━━━━━━━━━━ 54.5/54.5 kB 37.6 MB/s eta 0:00:00
13-Sep-2026 23:08:12 Collecting id
13-Sep-2026 23:08:12   Downloading id-1.6.1-py3-none-any.whl (14 kB)
13-Sep-2026 23:08:12 Collecting jaraco.functools
13-Sep-2026 23:08:12   Downloading jaraco_functools-4.6.0-py3-none-any.whl (11 kB)
13-Sep-2026 23:08:12 Collecting jaraco.context
13-Sep-2026 23:08:12   Downloading jaraco_context-6.1.2-py3-none-any.whl (7.9 kB)
13-Sep-2026 23:08:12 Collecting jeepney>=0.4.2
13-Sep-2026 23:08:12   Downloading jeepney-0.9.0-py3-none-any.whl (49 kB)
13-Sep-2026 23:08:12      ━━━━━━━━━━━━━━━━━━━━━━━━━━━━━━━━━━━━━━━━ 49.0/49.0 kB 29.0 MB/s eta 0:00:00
13-Sep-2026 23:08:12 Collecting importlib_metadata>=4.11.4
13-Sep-2026 23:08:12   Downloading importlib_metadata-9.0.1-py3-none-any.whl (27 kB)
13-Sep-2026 23:08:12 Collecting SecretStorage>=3.2
13-Sep-2026 23:08:12   Downloading secretstorage-3.5.0-py3-none-any.whl (15 kB)
13-Sep-2026 23:08:12 Collecting jaraco.classes
13-Sep-2026 23:08:12   Downloading jaraco.classes-3.4.0-py3-none-any.whl (6.8 kB)
13-Sep-2026 23:08:12 Collecting docutils>=0.21.2
13-Sep-2026 23:08:12   Downloading docutils-0.23-py3-none-any.whl (634 kB)
13-Sep-2026 23:08:12      ━━━━━━━━━━━━━━━━━━━━━━━━━━━━━━━━━━━━━ 634.7/634.7 kB 106.0 MB/s eta 0:00:00
13-Sep-2026 23:08:12 Collecting nh3>=0.2.14
13-Sep-2026 23:08:12   Downloading nh3-0.3.7-cp38-abi3-manylinux_2_17_x86_64.manylinux2014_x86_64.whl (832 kB)
13-Sep-2026 23:08:12      ━━━━━━━━━━━━━━━━━━━━━━━━━━━━━━━━━━━━━ 832.2/832.2 kB 142.2 MB/s eta 0:00:00
13-Sep-2026 23:08:12 Collecting Pygments>=2.5.1
13-Sep-2026 23:08:12   Downloading pygments-2.21.0-py3-none-any.whl (1.3 MB)
13-Sep-2026 23:08:12      ━━━━━━━━━━━━━━━━━━━━━━━━━━━━━━━━━━━━━━━━ 1.3/1.3 MB 149.5 MB/s eta 0:00:00
13-Sep-2026 23:08:13 Collecting charset_normalizer<4,>=2
13-Sep-2026 23:08:13   Downloading charset_normalizer-3.5.1-cp310-cp310-manylinux2014_x86_64.manylinux_2_17_x86_64.manylinux_2_28_x86_64.whl (261 kB)
13-Sep-2026 23:08:13      ━━━━━━━━━━━━━━━━━━━━━━━━━━━━━━━━━━━━━━ 261.6/261.6 kB 78.2 MB/s eta 0:00:00
13-Sep-2026 23:08:13 Collecting idna<4,>=2.5
13-Sep-2026 23:08:13   Downloading idna-3.19-py3-none-any.whl (68 kB)
13-Sep-2026 23:08:13      ━━━━━━━━━━━━━━━━━━━━━━━━━━━━━━━━━━━━━━━━ 68.5/68.5 kB 38.7 MB/s eta 0:00:00
13-Sep-2026 23:08:13 Collecting certifi>=2023.5.7
13-Sep-2026 23:08:13   Downloading certifi-2026.7.22-py3-none-any.whl (136 kB)
13-Sep-2026 23:08:13      ━━━━━━━━━━━━━━━━━━━━━━━━━━━━━━━━━━━━━━ 137.0/137.0 kB 47.5 MB/s eta 0:00:00
13-Sep-2026 23:08:13 Collecting markdown-it-py>=2.2.0
13-Sep-2026 23:08:13   Downloading markdown_it_py-4.2.0-py3-none-any.whl (91 kB)
13-Sep-2026 23:08:13      ━━━━━━━━━━━━━━━━━━━━━━━━━━━━━━━━━━━━━━━━ 91.7/91.7 kB 44.2 MB/s eta 0:00:00
13-Sep-2026 23:08:13 Collecting zipp>=3.20
13-Sep-2026 23:08:13   Downloading zipp-4.1.0-py3-none-any.whl (10 kB)
13-Sep-2026 23:08:13 Collecting mdurl~=0.1
13-Sep-2026 23:08:13   Downloading mdurl-0.1.2-py3-none-any.whl (10.0 kB)
13-Sep-2026 23:08:13 Collecting cryptography>=2.0
13-Sep-2026 23:08:13   Downloading cryptography-50.0.1-cp39-abi3-manylinux_2_28_x86_64.whl (4.8 MB)
13-Sep-2026 23:08:13      ━━━━━━━━━━━━━━━━━━━━━━━━━━━━━━━━━━━━━━━━ 4.8/4.8 MB 104.1 MB/s eta 0:00:00
13-Sep-2026 23:08:13 Collecting more-itertools
13-Sep-2026 23:08:13   Downloading more_itertools-11.1.0-py3-none-any.whl (72 kB)
13-Sep-2026 23:08:13      ━━━━━━━━━━━━━━━━━━━━━━━━━━━━━━━━━━━━━━━━ 72.2/72.2 kB 39.0 MB/s eta 0:00:00
13-Sep-2026 23:08:13 Collecting backports.tarfile
13-Sep-2026 23:08:13   Downloading backports.tarfile-1.2.0-py3-none-any.whl (30 kB)
13-Sep-2026 23:08:13 Collecting typing-extensions>=4.13.2
13-Sep-2026 23:08:13   Downloading typing_extensions-4.16.0-py3-none-any.whl (45 kB)
13-Sep-2026 23:08:13      ━━━━━━━━━━━━━━━━━━━━━━━━━━━━━━━━━━━━━━━━ 45.6/45.6 kB 29.5 MB/s eta 0:00:00
13-Sep-2026 23:08:13 Collecting cffi>=2.0.0
13-Sep-2026 23:08:13   Downloading cffi-2.1.1-cp310-cp310-manylinux2014_x86_64.manylinux_2_17_x86_64.whl (218 kB)
13-Sep-2026 23:08:13      ━━━━━━━━━━━━━━━━━━━━━━━━━━━━━━━━━━━━━━ 218.7/218.7 kB 81.0 MB/s eta 0:00:00
13-Sep-2026 23:08:14 Collecting pycparser
13-Sep-2026 23:08:14   Downloading pycparser-3.0-py3-none-any.whl (48 kB)
13-Sep-2026 23:08:14      ━━━━━━━━━━━━━━━━━━━━━━━━━━━━━━━━━━━━━━━━ 48.2/48.2 kB 21.2 MB/s eta 0:00:00
13-Sep-2026 23:08:14 Installing collected packages: zipp, urllib3, typing-extensions, rfc3986, Pygments, pycparser, packaging, nh3, more-itertools, mdurl, jeepney, idna, docutils, charset_normalizer, certifi, backports.tarfile, requests, readme-renderer, markdown-it-py, jaraco.functools, jaraco.context, jaraco.classes, importlib_metadata, id, cffi, rich, requests-toolbelt, cryptography, SecretStorage, keyring, twine
13-Sep-2026 23:08:15 Successfully installed Pygments-2.21.0 SecretStorage-3.5.0 backports.tarfile-1.2.0 certifi-2026.7.22 cffi-2.1.1 charset_normalizer-3.5.1 cryptography-50.0.1 docutils-0.23 id-1.6.1 idna-3.19 importlib_metadata-9.0.1 jaraco.classes-3.4.0 jaraco.context-6.1.2 jaraco.functools-4.6.0 jeepney-0.9.0 keyring-25.7.0 markdown-it-py-4.2.0 mdurl-0.1.2 more-itertools-11.1.0 nh3-0.3.7 packaging-26.3 pycparser-3.0 readme-renderer-46.0 requests-2.34.2 requests-toolbelt-1.0.0 rfc3986-2.0.0 rich-15.0.0 twine-7.0.0 typing-extensions-4.16.0 urllib3-2.7.0 zipp-4.1.0
13-Sep-2026 23:08:15 WARNING: Running pip as the 'root' user can result in broken permissions and conflicting behaviour with the system package manager. It is recommended to use a virtual environment instead: https://pip.pypa.io/warnings/venv
13-Sep-2026 23:08:15
13-Sep-2026 23:08:15 [notice] A new release of pip is available: 23.0.1 -> 26.2.1
13-Sep-2026 23:08:15 [notice] To update, run: pip3 install --upgrade pip
13-Sep-2026 23:08:15 Cloning into 'casa-build-utils'...
13-Sep-2026 23:08:16 Uploading distributions to
13-Sep-2026 23:08:16 https://casa-pip.nrao.edu:443/repository/casa-dev-wheel/
13-Sep-2026 23:08:16 Uploading casatasks-6.7.7.7a14882.dev1-py3-none-any.whl
13-Sep-2026 23:08:16
13-Sep-2026 23:08:16   0% ━━━━━━━━━━━━━━━━━━━━━━━━━━━━━━━━━━━━━━━━ 0.0/1.9 MB • --:-- • ?
13-Sep-2026 23:08:16 100% ━━━━━━━━━━━━━━━━━━━━━━━━━━━━━━━━━━━━━━━━ 1.9/1.9 MB • 00:00 • 361.7 MB/s
13-Sep-2026 23:08:16 100% ━━━━━━━━━━━━━━━━━━━━━━━━━━━━━━━━━━━━━━━━ 1.9/1.9 MB • 00:00 • 361.7 MB/s
13-Sep-2026 23:08:16
13-Sep-2026 23:08:16 Finished task 'Upload wheel' with result: Success
13-Sep-2026 23:08:16
Substituting variable: ${bamboo.agentId} with 153550851
13-Sep-2026 23:08:16
Substituting variable: ${bamboo.agentId} with 153550851
13-Sep-2026 23:08:16 Starting task 'Cleanup' of type 'com.atlassian.bamboo.plugins.scripttask:task.builder.script'
13-Sep-2026 23:08:16
Beginning to execute external process for build 'CASASPECS - Dev Test 3.12 - CAS-14882 - Test Tasks Many Linux 2.28 Py3.12 #1 (CASASPECS-DEVTESTPY312149-TTM228PY312-1)'
... running command line:
/opt/ci_workspace/casa/bamboo/agent3/temp/CASASPECS-DEVTESTPY312149-TTM228PY312-1-ScriptBuildTask-730928514735394718.sh
... in: /opt/ci_workspace/casa/bamboo/agent3/xml-data/build-dir/CASASPECS-DEVTESTPY312149-TTM228PY312
13-Sep-2026 23:08:16 Starting cleanup
13-Sep-2026 23:08:26 wheel-container-test_153550851
13-Sep-2026 23:08:28 wheel-container-test_153550851
13-Sep-2026 23:08:28 Cleanup complete
13-Sep-2026 23:08:28 Finished task 'Cleanup' with result: Success
13-Sep-2026 23:08:28 Running post build plugin 'Docker Container Cleanup'
13-Sep-2026 23:08:28
Beginning to execute external process for build 'CASASPECS - Dev Test 3.12 - CAS-14882 - Test Tasks Many Linux 2.28 Py3.12 #1 (CASASPECS-DEVTESTPY312149-TTM228PY312-1)'
... running command line:
/usr/bin/docker rm -f wheel-container-test_153550851
... in: /opt/ci_workspace/casa/bamboo/agent3/xml-data/build-dir/CASASPECS-DEVTESTPY312149-TTM228PY312
13-Sep-2026 23:08:28 Running post build plugin 'NCover Results Collector'
13-Sep-2026 23:08:28 Running post build plugin 'Build Results Label Collector'
13-Sep-2026 23:08:28 Running post build plugin 'Clover Results Collector'
13-Sep-2026 23:08:28 Running post build plugin 'npm Cache Cleanup'
13-Sep-2026 23:08:28 Running post build plugin 'Artifact Copier'
13-Sep-2026 23:08:28 Publishing an artifact: Workdir
13-Sep-2026 23:08:28 Finished publishing of artifact Non required job artifact Http Compression On : [Workdir], patterns: [work*.tar.gz] anchored at: [wheeldirectory/] in 113.8 ms
13-Sep-2026 23:08:28 Publishing an artifact: XML Directories
13-Sep-2026 23:08:28 Finished publishing of artifact Non required job artifact Http Compression On : [XML Directories], patterns: [**/*.xml] anchored at: [wheeldirectory/] in 118.5 ms
13-Sep-2026 23:08:28 Publishing an artifact: casatasks_test.log
13-Sep-2026 23:08:28 Finished publishing of artifact Non required job artifact Http Compression On : [casatasks_test.log], patterns: [casatasks_test.log] anchored at: [wheeldirectory/] in 44.63 ms
13-Sep-2026 23:08:28 Publishing an artifact: requirements.txt
13-Sep-2026 23:08:28 Finished publishing of artifact Non required job artifact Http Compression On : [requirements.txt], patterns: [requirements.txt] anchored at: [wheeldirectory/] in 22.48 ms
13-Sep-2026 23:08:28 Finalising the build...
13-Sep-2026 23:08:28 Stopping timer.
13-Sep-2026 23:08:28 Build CASASPECS-DEVTESTPY312149-TTM228PY312-1 completed.
13-Sep-2026 23:08:29 Running on server: post build plugin 'Build Hanging Detection Configuration'
13-Sep-2026 23:08:29 Running on server: post build plugin 'NCover Results Collector'
13-Sep-2026 23:08:29 Running on server: post build plugin 'Build Labeller'
13-Sep-2026 23:08:29 Running on server: post build plugin 'Clover Delta Calculator'
13-Sep-2026 23:08:29 Running on server: post build plugin 'Maven Dependencies Postprocessor'
13-Sep-2026 23:08:29 All post build plugins have finished
13-Sep-2026 23:08:29 Generating build results summary...
13-Sep-2026 23:08:29 Saving build results to disk...
13-Sep-2026 23:08:29 Store variable context...
13-Sep-2026 23:08:29 Finished building CASASPECS-DEVTESTPY312149-TTM228PY312-1.