Build: #5 failed

Job: Test Tasks macOS 15 Py3.12 failed

Build log

The build generated 528 lines of output. Download or view full build log.

01-Oct-2026 07:33:42 Build CASASPECS - Dev Test 3.12 - CAS-14849 - Test Tasks macOS 15 Py3.12 #5 (CASASPECS-DEVTESTPY312147-TTARM15PY312-5) is being prepared for building on agent cbt-macos15-test-4, bamboo version: 9.6.26
01-Oct-2026 07:33:42 Remote agent on host cbt-macos15-test-4
01-Oct-2026 07:33:42 Build working directory is /Users/casaci/bamboohome/xml-data/build-dir/CASASPECS-DEVTESTPY312147-TTARM15PY312
01-Oct-2026 07:33:42 Executing build CASASPECS - Dev Test 3.12 - CAS-14849 - Test Tasks macOS 15 Py3.12 #5 (CASASPECS-DEVTESTPY312147-TTARM15PY312-5)
01-Oct-2026 07:33:42 Starting task 'Source Code Checkout' of type 'com.atlassian.bamboo.plugins.vcs:task.vcs.checkout'
01-Oct-2026 07:33:42 Build always requires a clean checkout
01-Oct-2026 07:33:42 Cleaning build directory '/Users/casaci/bamboohome/xml-data/build-dir/CASASPECS-DEVTESTPY312147-TTARM15PY312'
01-Oct-2026 07:33:48 Checking out into /Users/casaci/bamboohome/xml-data/build-dir/CASASPECS-DEVTESTPY312147-TTARM15PY312
01-Oct-2026 07:33:48 Updating source code to revision: 0162b0f21d9253a10cd8a3ebc52b074f3465cdd1
01-Oct-2026 07:33:49 Fetching 'refs/heads/CAS-14849' from 'ssh://git@open-bitbucket.nrao.edu:7999/casa/casa6.git'.
01-Oct-2026 07:33:49 Warning: Permanently added '[127.0.0.1]:49161' (RSA) to the list of known hosts.
01-Oct-2026 07:33:51 Checking out revision 0162b0f21d9253a10cd8a3ebc52b074f3465cdd1.
01-Oct-2026 07:33:51 Creating local git repository in '/Users/casaci/bamboohome/xml-data/build-dir/CASASPECS-DEVTESTPY312147-TTARM15PY312/.git'.
01-Oct-2026 07:33:51 Cloning into '/Users/casaci/bamboohome/xml-data/build-dir/CASASPECS-DEVTESTPY312147-TTARM15PY312'...
01-Oct-2026 07:33:51 done.
01-Oct-2026 07:33:53 Switched to a new branch 'CAS-14849'
01-Oct-2026 07:33:53 branch 'CAS-14849' set up to track 'origin/CAS-14849'.
01-Oct-2026 07:33:53 Submodule 'casatools/casacore' (https://github.com/casacore/casacore.git) registered for path 'casatools/casacore'
01-Oct-2026 07:33:53 Submodule 'casatools/grpc-source' (https://github.com/grpc/grpc) registered for path 'casatools/grpc-source'
01-Oct-2026 07:33:53 Cloning into '/Users/casaci/bamboohome/xml-data/build-dir/CASASPECS-DEVTESTPY312147-TTARM15PY312/casatools/casacore'...
01-Oct-2026 07:34:00 Cloning into '/Users/casaci/bamboohome/xml-data/build-dir/CASASPECS-DEVTESTPY312147-TTARM15PY312/casatools/grpc-source'...
01-Oct-2026 07:34:36 Submodule path 'casatools/casacore': checked out 'aaf72eb7edd5a5fecefa78ca04713233b7b6ffd6'
01-Oct-2026 07:34:37 Submodule path 'casatools/grpc-source': checked out 'cca868ac8f3641df4003a82b7fc54c921e14f765'
01-Oct-2026 07:34:37 Submodule 'third_party/abseil-cpp' (https://github.com/abseil/abseil-cpp) registered for path 'casatools/grpc-source/third_party/abseil-cpp'
01-Oct-2026 07:34:37 Submodule 'third_party/benchmark' (https://github.com/google/benchmark) registered for path 'casatools/grpc-source/third_party/benchmark'
01-Oct-2026 07:34:37 Submodule 'third_party/bloaty' (https://github.com/google/bloaty.git) registered for path 'casatools/grpc-source/third_party/bloaty'
01-Oct-2026 07:34:37 Submodule 'third_party/boringssl' (https://github.com/google/boringssl.git) registered for path 'casatools/grpc-source/third_party/boringssl'
01-Oct-2026 07:34:37 Submodule 'third_party/boringssl-with-bazel' (https://github.com/google/boringssl.git) registered for path 'casatools/grpc-source/third_party/boringssl-with-bazel'
01-Oct-2026 07:34:37 Submodule 'third_party/cares/cares' (https://github.com/c-ares/c-ares.git) registered for path 'casatools/grpc-source/third_party/cares/cares'
01-Oct-2026 07:34:37 Submodule 'third_party/gflags' (https://github.com/gflags/gflags.git) registered for path 'casatools/grpc-source/third_party/gflags'
01-Oct-2026 07:34:37 Submodule 'third_party/googletest' (https://github.com/google/googletest.git) registered for path 'casatools/grpc-source/third_party/googletest'
01-Oct-2026 07:34:37 Submodule 'third_party/protobuf' (https://github.com/google/protobuf.git) registered for path 'casatools/grpc-source/third_party/protobuf'
01-Oct-2026 07:34:37 Submodule 'third_party/zlib' (https://github.com/madler/zlib) registered for path 'casatools/grpc-source/third_party/zlib'
01-Oct-2026 07:34:37 Cloning into '/Users/casaci/bamboohome/xml-data/build-dir/CASASPECS-DEVTESTPY312147-TTARM15PY312/casatools/grpc-source/third_party/abseil-cpp'...
01-Oct-2026 07:34:39 Cloning into '/Users/casaci/bamboohome/xml-data/build-dir/CASASPECS-DEVTESTPY312147-TTARM15PY312/casatools/grpc-source/third_party/benchmark'...
01-Oct-2026 07:34:39 Cloning into '/Users/casaci/bamboohome/xml-data/build-dir/CASASPECS-DEVTESTPY312147-TTARM15PY312/casatools/grpc-source/third_party/bloaty'...
01-Oct-2026 07:34:40 Cloning into '/Users/casaci/bamboohome/xml-data/build-dir/CASASPECS-DEVTESTPY312147-TTARM15PY312/casatools/grpc-source/third_party/boringssl'...
01-Oct-2026 07:34:58 Cloning into '/Users/casaci/bamboohome/xml-data/build-dir/CASASPECS-DEVTESTPY312147-TTARM15PY312/casatools/grpc-source/third_party/boringssl-with-bazel'...
01-Oct-2026 07:35:16 Cloning into '/Users/casaci/bamboohome/xml-data/build-dir/CASASPECS-DEVTESTPY312147-TTARM15PY312/casatools/grpc-source/third_party/cares/cares'...
01-Oct-2026 07:35:17 Cloning into '/Users/casaci/bamboohome/xml-data/build-dir/CASASPECS-DEVTESTPY312147-TTARM15PY312/casatools/grpc-source/third_party/gflags'...
01-Oct-2026 07:35:18 Cloning into '/Users/casaci/bamboohome/xml-data/build-dir/CASASPECS-DEVTESTPY312147-TTARM15PY312/casatools/grpc-source/third_party/googletest'...
01-Oct-2026 07:35:19 Cloning into '/Users/casaci/bamboohome/xml-data/build-dir/CASASPECS-DEVTESTPY312147-TTARM15PY312/casatools/grpc-source/third_party/protobuf'...
01-Oct-2026 07:35:32 Cloning into '/Users/casaci/bamboohome/xml-data/build-dir/CASASPECS-DEVTESTPY312147-TTARM15PY312/casatools/grpc-source/third_party/zlib'...
01-Oct-2026 07:35:33 Submodule path 'casatools/grpc-source/third_party/abseil-cpp': checked out 'cc4bed2d74f7c8717e31f9579214ab52a9c9c610'
01-Oct-2026 07:35:33 Submodule path 'casatools/grpc-source/third_party/benchmark': checked out '5b7683f49e1e9223cf9927b24f6fd3d6bd82e3f8'
01-Oct-2026 07:35:33 Submodule path 'casatools/grpc-source/third_party/bloaty': checked out '73594cde8c9a52a102c4341c244c833aa61b9c06'
01-Oct-2026 07:35:33 Submodule 'third_party/googletest' (https://github.com/google/googletest.git) registered for path 'casatools/grpc-source/third_party/bloaty/third_party/googletest'
01-Oct-2026 07:35:33 Submodule 'third_party/libFuzzer' (https://chromium.googlesource.com/chromium/llvm-project/llvm/lib/Fuzzer) registered for path 'casatools/grpc-source/third_party/bloaty/third_party/libFuzzer'
01-Oct-2026 07:35:33 Submodule 'third_party/re2' (https://github.com/google/re2) registered for path 'casatools/grpc-source/third_party/bloaty/third_party/re2'
01-Oct-2026 07:35:33 Cloning into '/Users/casaci/bamboohome/xml-data/build-dir/CASASPECS-DEVTESTPY312147-TTARM15PY312/casatools/grpc-source/third_party/bloaty/third_party/googletest'...
01-Oct-2026 07:35:34 Cloning into '/Users/casaci/bamboohome/xml-data/build-dir/CASASPECS-DEVTESTPY312147-TTARM15PY312/casatools/grpc-source/third_party/bloaty/third_party/libFuzzer'...
01-Oct-2026 07:35:35 Cloning into '/Users/casaci/bamboohome/xml-data/build-dir/CASASPECS-DEVTESTPY312147-TTARM15PY312/casatools/grpc-source/third_party/bloaty/third_party/re2'...
01-Oct-2026 07:35:35 Submodule path 'casatools/grpc-source/third_party/bloaty/third_party/googletest': checked out 'a2b8a8e07628e5fd60644b6dd99c1b5e7d7f1f47'
01-Oct-2026 07:35:35 Submodule path 'casatools/grpc-source/third_party/bloaty/third_party/libFuzzer': checked out '1b543d6e5073b56be214394890c9193979a3d7e1'
01-Oct-2026 07:35:35 Submodule path 'casatools/grpc-source/third_party/bloaty/third_party/re2': checked out 'c964d9b07816f9b52ca692e23b8b3dba33beec54'
01-Oct-2026 07:35:35 Submodule path 'casatools/grpc-source/third_party/boringssl': checked out 'be2ee342d3781ddb954f91f8a7e660c6f59e87e5'
01-Oct-2026 07:35:36 Submodule path 'casatools/grpc-source/third_party/boringssl-with-bazel': checked out '886e7d75368e3f4fab3f4d0d3584e4abfc557755'
01-Oct-2026 07:35:36 Submodule path 'casatools/grpc-source/third_party/cares/cares': checked out '3be1924221e1326df520f8498d704a5c4c8d0cce'
01-Oct-2026 07:35:36 Submodule path 'casatools/grpc-source/third_party/gflags': checked out '30dbc81fb5ffdc98ea9b14b1918bfe4e8779b26e'
01-Oct-2026 07:35:36 Submodule 'doc' (https://github.com/gflags/gflags.git) registered for path 'casatools/grpc-source/third_party/gflags/doc'
01-Oct-2026 07:35:36 Cloning into '/Users/casaci/bamboohome/xml-data/build-dir/CASASPECS-DEVTESTPY312147-TTARM15PY312/casatools/grpc-source/third_party/gflags/doc'...
01-Oct-2026 07:35:36 Submodule path 'casatools/grpc-source/third_party/gflags/doc': checked out '971dd2a4fadac9cdab174c523c22df79efd63aa5'
01-Oct-2026 07:35:37 Submodule path 'casatools/grpc-source/third_party/googletest': checked out 'ec44c6c1675c25b9827aacd08c02433cccde7780'
01-Oct-2026 07:35:37 Submodule path 'casatools/grpc-source/third_party/protobuf': checked out '2761122b810fe8861004ae785cc3ab39f384d342'
01-Oct-2026 07:35:37 Submodule 'third_party/benchmark' (https://github.com/google/benchmark.git) registered for path 'casatools/grpc-source/third_party/protobuf/third_party/benchmark'
01-Oct-2026 07:35:37 Cloning into '/Users/casaci/bamboohome/xml-data/build-dir/CASASPECS-DEVTESTPY312147-TTARM15PY312/casatools/grpc-source/third_party/protobuf/third_party/benchmark'...
01-Oct-2026 07:35:38 Submodule path 'casatools/grpc-source/third_party/protobuf/third_party/benchmark': checked out '360e66c1c4777c99402cf8cd535aa510fee16573'
01-Oct-2026 07:35:38 Submodule path 'casatools/grpc-source/third_party/zlib': checked out 'cacf7f1d4e3d44d871b605da3b647f07d718623f'
01-Oct-2026 07:35:38 Updated source code to revision: 0162b0f21d9253a10cd8a3ebc52b074f3465cdd1
01-Oct-2026 07:35:38 Finished task 'Source Code Checkout' with result: Success
01-Oct-2026 07:35:38 Running pre-build action: Build Log Labeller Pre Build Action
01-Oct-2026 07:35:38 Running pre-build action: VCS Version Collector
01-Oct-2026 07:35:38 Build CASASPECS - Dev Test 3.12 - CAS-14849 - Test Tasks macOS 15 Py3.12 #5 (CASASPECS-DEVTESTPY312147-TTARM15PY312-5) started building on agent 'cbt-macos15-test-4' (Remote agent on host cbt-macos15-test-4)
01-Oct-2026 07:35:38 Starting task 'Update data' of type 'com.atlassian.bamboo.plugins.scripttask:task.builder.script'
01-Oct-2026 07:35:38
Beginning to execute external process for build 'CASASPECS - Dev Test 3.12 - CAS-14849 - Test Tasks macOS 15 Py3.12 #5 (CASASPECS-DEVTESTPY312147-TTARM15PY312-5)'
... running command line:
/Users/casaci/bamboohome/temp/CASASPECS-DEVTESTPY312147-TTARM15PY312-5-ScriptBuildTask-2982858528514057714.sh
... in: /Users/casaci/bamboohome/xml-data/build-dir/CASASPECS-DEVTESTPY312147-TTARM15PY312
01-Oct-2026 07:35:38 Already up to date.
01-Oct-2026 07:35:39 Updating ce38223d..486e9fb7
01-Oct-2026 07:35:39 error: Your local changes to the following files would be overwritten by merge:
01-Oct-2026 07:35:39         nrao/VLA/CalModels/3C138_K.im/table.dat
01-Oct-2026 07:35:39         nrao/VLA/CalModels/3C138_K.im/table.lock
01-Oct-2026 07:35:39 Please commit your changes or stash them before you merge.
01-Oct-2026 07:35:39 Aborting
01-Oct-2026 07:35:39 Done
01-Oct-2026 07:35:39 Finished task 'Update data' with result: Success
01-Oct-2026 07:35:39 Starting task 'Create wheel directory' of type 'com.atlassian.bamboo.plugins.scripttask:task.builder.script'
01-Oct-2026 07:35:39
Beginning to execute external process for build 'CASASPECS - Dev Test 3.12 - CAS-14849 - Test Tasks macOS 15 Py3.12 #5 (CASASPECS-DEVTESTPY312147-TTARM15PY312-5)'
... running command line:
/Users/casaci/bamboohome/temp/CASASPECS-DEVTESTPY312147-TTARM15PY312-5-ScriptBuildTask-9483477523972312100.sh
... in: /Users/casaci/bamboohome/xml-data/build-dir/CASASPECS-DEVTESTPY312147-TTARM15PY312
01-Oct-2026 07:35:39 Finished task 'Create wheel directory' with result: Success
01-Oct-2026 07:35:39 Starting task 'Get macOS 15 wheels' of type 'com.atlassian.bamboo.plugins.bamboo-artifact-downloader-plugin:artifactdownloadertask'
01-Oct-2026 07:35:39 Preparing to download plan result CASASPECS-DBC257-5 artifact: Non required shared artifact Http Compression On : [macOS 15 py3.12 tasks wheel], patterns: [casatasks*.whl] anchored at: [wheels]
01-Oct-2026 07:35:39 Retrieving artifact macOS 15 py3.12 tasks wheel for CASASPECS-DBC257-5 using Bamboo server artifact handler
01-Oct-2026 07:35:39 Artifact [macOS 15 py3.12 tasks wheel] downloaded successfully in 166.1 ms to wheeldirectory/
01-Oct-2026 07:35:39 Preparing to download plan result CASASPECS-DBC257-5 artifact: Non required shared artifact Http Compression On : [macOS 15 casatestutils 3.12], patterns: [casatestutils*.whl] anchored at: [wheels]
01-Oct-2026 07:35:39 Retrieving artifact macOS 15 casatestutils 3.12 for CASASPECS-DBC257-5 using Bamboo server artifact handler
01-Oct-2026 07:35:39 Artifact [macOS 15 casatestutils 3.12] downloaded successfully in 12.27 ms to wheeldirectory/
01-Oct-2026 07:35:39 Preparing to download plan result CASASPECS-DBC257-5 artifact: Non required shared artifact Http Compression On : [macOS 15 py3.12 tools wheel], patterns: [casatools*.whl] anchored at: [wheels]
01-Oct-2026 07:35:39 Retrieving artifact macOS 15 py3.12 tools wheel for CASASPECS-DBC257-5 using Bamboo server artifact handler
01-Oct-2026 07:35:42 Artifact [macOS 15 py3.12 tools wheel] downloaded successfully in 3.204 s to wheeldirectory/
01-Oct-2026 07:35:42 Finished task 'Get macOS 15 wheels' with result: Success
01-Oct-2026 07:35:42
Substituting variable: ${bamboo.repository.branch.name} with CAS-14849
01-Oct-2026 07:35:42
Substituting variable: ${bamboo.planRepository.branchName} with CAS-14849
01-Oct-2026 07:35:42 Starting task 'Test wheel' of type 'com.atlassian.bamboo.plugins.scripttask:task.builder.script'
01-Oct-2026 07:35:42
Beginning to execute external process for build 'CASASPECS - Dev Test 3.12 - CAS-14849 - Test Tasks macOS 15 Py3.12 #5 (CASASPECS-DEVTESTPY312147-TTARM15PY312-5)'
... running command line:
/Users/casaci/bamboohome/temp/CASASPECS-DEVTESTPY312147-TTARM15PY312-5-ScriptBuildTask-12872289747390782642.sh
... in: /Users/casaci/bamboohome/xml-data/build-dir/CASASPECS-DEVTESTPY312147-TTARM15PY312
01-Oct-2026 07:35:42 branch: CAS-14849
01-Oct-2026 07:35:42 branch: CAS-14849
01-Oct-2026 07:35:42 Testing wheel
01-Oct-2026 07:35:42   % Total    % Received % Xferd  Average Speed   Time    Time     Time  Current
01-Oct-2026 07:35:42                                  Dload  Upload   Total   Spent    Left  Speed
01-Oct-2026 07:35:42
01-Oct-2026 07:35:42   0     0    0     0    0     0      0      0 --:--:-- --:--:-- --:--:--     0
01-Oct-2026 07:35:42 100 9419k  100 9419k    0     0  54.8M      0 --:--:-- --:--:-- --:--:-- 55.0M
01-Oct-2026 07:35:47 Ticket fix version: CASA 6.ACTIVE
01-Oct-2026 07:35:47 No matching version found
01-Oct-2026 07:35:47   % Total    % Received % Xferd  Average Speed   Time    Time     Time  Current
01-Oct-2026 07:35:47                                  Dload  Upload   Total   Spent    Left  Speed
01-Oct-2026 07:35:47
01-Oct-2026 07:35:47   0     0    0     0    0     0      0      0 --:--:-- --:--:-- --:--:--     0
01-Oct-2026 07:35:47 100   201  100   201    0     0   6451      0 --:--:-- --:--:-- --:--:--  6483
01-Oct-2026 07:35:47   % Total    % Received % Xferd  Average Speed   Time    Time     Time  Current
01-Oct-2026 07:35:47                                  Dload  Upload   Total   Spent    Left  Speed
01-Oct-2026 07:35:47
01-Oct-2026 07:35:47   0     0    0     0    0     0      0      0 --:--:-- --:--:-- --:--:--     0
01-Oct-2026 07:35:47 100   511  100   511    0     0  15870      0 --:--:-- --:--:-- --:--:-- 15968
01-Oct-2026 07:35:47 bamboo_jira_components:''
01-Oct-2026 07:35:47 bamboo_testlist:''
01-Oct-2026 07:35:52 atlutil components: casaconfig
01-Oct-2026 07:35:52 Ticket components: casaconfig
01-Oct-2026 07:38:15 Switched to a new branch 'CAS-14849'
01-Oct-2026 07:38:15 branch 'CAS-14849' set up to track 'origin/CAS-14849'.
01-Oct-2026 07:38:15 Updated 0 paths from fb45b40137
01-Oct-2026 07:38:15 Updated 0 paths from eb51c69579
01-Oct-2026 07:38:15 Requirement already satisfied: pip in /Users/casaci/bamboohome/xml-data/build-dir/CASASPECS-DEVTESTPY312147-TTARM15PY312/casa6testenv/lib/python3.12/site-packages (24.3.1)
01-Oct-2026 07:38:15 Collecting pip
01-Oct-2026 07:38:15   Downloading pip-26.2.1-py3-none-any.whl.metadata (4.6 kB)
01-Oct-2026 07:38:15 Collecting setuptools
01-Oct-2026 07:38:15   Downloading setuptools-84.0.0-py3-none-any.whl.metadata (6.6 kB)
01-Oct-2026 07:38:15 Collecting wheel
01-Oct-2026 07:38:15   Downloading wheel-0.48.0-py3-none-any.whl.metadata (2.3 kB)
01-Oct-2026 07:38:15 Collecting packaging>=24.0 (from wheel)
01-Oct-2026 07:38:15   Downloading packaging-26.3-py3-none-any.whl.metadata (3.5 kB)
01-Oct-2026 07:38:15 Downloading pip-26.2.1-py3-none-any.whl (1.8 MB)
01-Oct-2026 07:38:15    ━━━━━━━━━━━━━━━━━━━━━━━━━━━━━━━━━━━━━━━━ 1.8/1.8 MB 79.5 MB/s eta 0:00:00
01-Oct-2026 07:38:15 Downloading setuptools-84.0.0-py3-none-any.whl (818 kB)
01-Oct-2026 07:38:15    ━━━━━━━━━━━━━━━━━━━━━━━━━━━━━━━━━━━━━━━━ 818.2/818.2 kB 67.4 MB/s eta 0:00:00
01-Oct-2026 07:38:15 Downloading wheel-0.48.0-py3-none-any.whl (33 kB)
01-Oct-2026 07:38:16 Downloading packaging-26.3-py3-none-any.whl (129 kB)
01-Oct-2026 07:38:16 Installing collected packages: setuptools, pip, packaging, wheel
01-Oct-2026 07:38:16   Attempting uninstall: pip
01-Oct-2026 07:38:16     Found existing installation: pip 24.3.1
01-Oct-2026 07:38:16     Uninstalling pip-24.3.1:
01-Oct-2026 07:38:16       Successfully uninstalled pip-24.3.1
01-Oct-2026 07:38:17 Successfully installed packaging-26.3 pip-26.2.1 setuptools-84.0.0 wheel-0.48.0
01-Oct-2026 07:38:17 Looking in indexes: https://pypi.org/simple, https://test.pypi.org/simple
01-Oct-2026 07:38:17 Collecting casaconfig==1.5.2.dev1
01-Oct-2026 07:38:17   Using cached casaconfig-1.5.2.dev1-py3-none-any.whl.metadata (4.0 kB)
01-Oct-2026 07:38:17 Collecting certifi>=2023.5.7 (from casaconfig==1.5.2.dev1)
01-Oct-2026 07:38:17   Using cached certifi-2026.7.22-py3-none-any.whl.metadata (2.5 kB)
01-Oct-2026 07:38:17 Using cached casaconfig-1.5.2.dev1-py3-none-any.whl (77 kB)
01-Oct-2026 07:38:17 Using cached certifi-2026.7.22-py3-none-any.whl (136 kB)
01-Oct-2026 07:38:17 Installing collected packages: certifi, casaconfig
01-Oct-2026 07:38:17
01-Oct-2026 07:38:17 Successfully installed casaconfig-1.5.2.dev1 certifi-2026.7.22
01-Oct-2026 07:38:18 Collecting scipy
01-Oct-2026 07:38:18   Downloading scipy-1.18.1-cp312-cp312-macosx_14_0_arm64.whl.metadata (62 kB)
01-Oct-2026 07:38:18 Collecting numpy
01-Oct-2026 07:38:18   Downloading numpy-2.5.3-cp312-cp312-macosx_14_0_arm64.whl.metadata (6.6 kB)
01-Oct-2026 07:38:18 Downloading scipy-1.18.1-cp312-cp312-macosx_14_0_arm64.whl (20.5 MB)
01-Oct-2026 07:38:18    ━━━━━━━━━━━━━━━━━━━━━━━━━━━━━━━━━━━━━━━━ 20.5/20.5 MB 86.0 MB/s  0:00:00
01-Oct-2026 07:38:18 Downloading numpy-2.5.3-cp312-cp312-macosx_14_0_arm64.whl (5.4 MB)
01-Oct-2026 07:38:18    ━━━━━━━━━━━━━━━━━━━━━━━━━━━━━━━━━━━━━━━━ 5.4/5.4 MB 65.9 MB/s  0:00:00
01-Oct-2026 07:38:18 Installing collected packages: numpy, scipy
01-Oct-2026 07:38:22
01-Oct-2026 07:38:22 Successfully installed numpy-2.5.3 scipy-1.18.1
01-Oct-2026 07:38:22 Processing ./casatools-6.7.7.7a14849.dev3-cp312-cp312-macosx_15_0_arm64.whl
01-Oct-2026 07:38:22 Collecting casaconfig @ git+https://github.com/casangi/casaconfig@1.5.2.dev (from casatools==6.7.7.7a14849.dev3)
01-Oct-2026 07:38:22   Cloning https://github.com/casangi/casaconfig (to revision 1.5.2.dev) to /private/var/folders/sg/pzxqyflj45l8489gtcfll1v80000gn/T/pip-install-o72543w9/casaconfig_bbc5762abbc041e5b53c364648ecb6ff
01-Oct-2026 07:38:22   Running command git clone --filter=blob:none --quiet https://github.com/casangi/casaconfig /private/var/folders/sg/pzxqyflj45l8489gtcfll1v80000gn/T/pip-install-o72543w9/casaconfig_bbc5762abbc041e5b53c364648ecb6ff
01-Oct-2026 07:38:23   Running command git checkout -b 1.5.2.dev --track origin/1.5.2.dev
01-Oct-2026 07:38:23   Switched to a new branch '1.5.2.dev'
01-Oct-2026 07:38:23   branch '1.5.2.dev' set up to track 'origin/1.5.2.dev'.
01-Oct-2026 07:38:23   Resolved https://github.com/casangi/casaconfig to commit a2e92d41cee0d57a3cc24acb5c71721ec84892cf
01-Oct-2026 07:38:23   Installing build dependencies: started
01-Oct-2026 07:38:23   Installing build dependencies: finished with status 'done'
01-Oct-2026 07:38:23   Getting requirements to build wheel: started
01-Oct-2026 07:38:24   Getting requirements to build wheel: finished with status 'done'
01-Oct-2026 07:38:24   Preparing metadata (pyproject.toml): started
01-Oct-2026 07:38:24   Preparing metadata (pyproject.toml): finished with status 'done'
01-Oct-2026 07:38:24 Requirement already satisfied: certifi>=2023.5.7 in /Users/casaci/bamboohome/xml-data/build-dir/CASASPECS-DEVTESTPY312147-TTARM15PY312/casa6testenv/lib/python3.12/site-packages (from casaconfig @ git+https://github.com/casangi/casaconfig@1.5.2.dev->casatools==6.7.7.7a14849.dev3) (2026.7.22)
01-Oct-2026 07:38:24 Installing collected packages: casatools
01-Oct-2026 07:38:25 Successfully installed casatools-6.7.7.7a14849.dev3
01-Oct-2026 07:38:25 Processing ./casatasks-6.7.7.7a14849.dev3-py3-none-any.whl
01-Oct-2026 07:38:25 Requirement already satisfied: casatools==6.7.7.7a14849.dev3 in /Users/casaci/bamboohome/xml-data/build-dir/CASASPECS-DEVTESTPY312147-TTARM15PY312/casa6testenv/lib/python3.12/site-packages (from casatasks==6.7.7.7a14849.dev3) (6.7.7.7a14849.dev3)
01-Oct-2026 07:38:25 Collecting matplotlib (from casatasks==6.7.7.7a14849.dev3)
01-Oct-2026 07:38:25   Using cached matplotlib-3.11.2-cp312-cp312-macosx_11_0_arm64.whl.metadata (80 kB)
01-Oct-2026 07:38:25 Requirement already satisfied: scipy in /Users/casaci/bamboohome/xml-data/build-dir/CASASPECS-DEVTESTPY312147-TTARM15PY312/casa6testenv/lib/python3.12/site-packages (from casatasks==6.7.7.7a14849.dev3) (1.18.1)
01-Oct-2026 07:38:25 Requirement already satisfied: certifi in /Users/casaci/bamboohome/xml-data/build-dir/CASASPECS-DEVTESTPY312147-TTARM15PY312/casa6testenv/lib/python3.12/site-packages (from casatasks==6.7.7.7a14849.dev3) (2026.7.22)
01-Oct-2026 07:38:25 Collecting pyerfa (from casatasks==6.7.7.7a14849.dev3)
01-Oct-2026 07:38:25   Using cached pyerfa-2.0.1.5-cp39-abi3-macosx_11_0_arm64.whl.metadata (5.7 kB)
01-Oct-2026 07:38:25 Collecting casaconfig @ git+https://github.com/casangi/casaconfig@1.5.2.dev (from casatools==6.7.7.7a14849.dev3->casatasks==6.7.7.7a14849.dev3)
01-Oct-2026 07:38:25   Cloning https://github.com/casangi/casaconfig (to revision 1.5.2.dev) to /private/var/folders/sg/pzxqyflj45l8489gtcfll1v80000gn/T/pip-install-7_3tgqc6/casaconfig_b73300deaf6c4530be21652bb88cab87
01-Oct-2026 07:38:25   Running command git clone --filter=blob:none --quiet https://github.com/casangi/casaconfig /private/var/folders/sg/pzxqyflj45l8489gtcfll1v80000gn/T/pip-install-7_3tgqc6/casaconfig_b73300deaf6c4530be21652bb88cab87
01-Oct-2026 07:38:25   Running command git checkout -b 1.5.2.dev --track origin/1.5.2.dev
01-Oct-2026 07:38:26   Switched to a new branch '1.5.2.dev'
01-Oct-2026 07:38:26   branch '1.5.2.dev' set up to track 'origin/1.5.2.dev'.
01-Oct-2026 07:38:26   Resolved https://github.com/casangi/casaconfig to commit a2e92d41cee0d57a3cc24acb5c71721ec84892cf
01-Oct-2026 07:38:26   Installing build dependencies: started
01-Oct-2026 07:38:26   Installing build dependencies: finished with status 'done'
01-Oct-2026 07:38:26   Getting requirements to build wheel: started
01-Oct-2026 07:38:26   Getting requirements to build wheel: finished with status 'done'
01-Oct-2026 07:38:26   Preparing metadata (pyproject.toml): started
01-Oct-2026 07:38:26   Preparing metadata (pyproject.toml): finished with status 'done'
01-Oct-2026 07:38:26 Collecting contourpy>=1.0.1 (from matplotlib->casatasks==6.7.7.7a14849.dev3)
01-Oct-2026 07:38:26   Using cached contourpy-1.4.0-cp312-cp312-macosx_11_0_arm64.whl.metadata (3.8 kB)
01-Oct-2026 07:38:26 Collecting cycler>=0.10 (from matplotlib->casatasks==6.7.7.7a14849.dev3)
01-Oct-2026 07:38:26   Using cached cycler-0.12.1-py3-none-any.whl.metadata (3.8 kB)
01-Oct-2026 07:38:27 Collecting fonttools>=4.28.2 (from matplotlib->casatasks==6.7.7.7a14849.dev3)
01-Oct-2026 07:38:27   Using cached fonttools-4.66.1-cp312-cp312-macosx_10_13_universal2.whl.metadata (130 kB)
01-Oct-2026 07:38:27 Collecting kiwisolver>=1.3.1 (from matplotlib->casatasks==6.7.7.7a14849.dev3)
01-Oct-2026 07:38:27   Using cached kiwisolver-1.5.1-cp312-cp312-macosx_11_0_arm64.whl.metadata (5.2 kB)
01-Oct-2026 07:38:27 Requirement already satisfied: numpy>=1.25 in /Users/casaci/bamboohome/xml-data/build-dir/CASASPECS-DEVTESTPY312147-TTARM15PY312/casa6testenv/lib/python3.12/site-packages (from matplotlib->casatasks==6.7.7.7a14849.dev3) (2.5.3)
01-Oct-2026 07:38:27 Requirement already satisfied: packaging>=20.0 in /Users/casaci/bamboohome/xml-data/build-dir/CASASPECS-DEVTESTPY312147-TTARM15PY312/casa6testenv/lib/python3.12/site-packages (from matplotlib->casatasks==6.7.7.7a14849.dev3) (26.3)
01-Oct-2026 07:38:27 Collecting pillow>=9 (from matplotlib->casatasks==6.7.7.7a14849.dev3)
01-Oct-2026 07:38:27   Using cached pillow-12.3.0-cp312-cp312-macosx_11_0_arm64.whl.metadata (9.1 kB)
01-Oct-2026 07:38:27 Collecting pyparsing>=3 (from matplotlib->casatasks==6.7.7.7a14849.dev3)
01-Oct-2026 07:38:27   Using cached pyparsing-3.3.3-py3-none-any.whl.metadata (5.9 kB)
01-Oct-2026 07:38:27 Collecting python-dateutil>=2.7 (from matplotlib->casatasks==6.7.7.7a14849.dev3)
01-Oct-2026 07:38:27   Using cached python_dateutil-2.9.0.post0-py2.py3-none-any.whl.metadata (8.4 kB)
01-Oct-2026 07:38:27 Collecting six>=1.5 (from python-dateutil>=2.7->matplotlib->casatasks==6.7.7.7a14849.dev3)
01-Oct-2026 07:38:27   Using cached six-1.17.0-py2.py3-none-any.whl.metadata (1.7 kB)
01-Oct-2026 07:38:27 Using cached matplotlib-3.11.2-cp312-cp312-macosx_11_0_arm64.whl (9.3 MB)
01-Oct-2026 07:38:27 Using cached contourpy-1.4.0-cp312-cp312-macosx_11_0_arm64.whl (284 kB)
01-Oct-2026 07:38:27 Using cached cycler-0.12.1-py3-none-any.whl (8.3 kB)
01-Oct-2026 07:38:27 Using cached fonttools-4.66.1-cp312-cp312-macosx_10_13_universal2.whl (3.1 MB)
01-Oct-2026 07:38:27 Using cached kiwisolver-1.5.1-cp312-cp312-macosx_11_0_arm64.whl (64 kB)
01-Oct-2026 07:38:27 Using cached pillow-12.3.0-cp312-cp312-macosx_11_0_arm64.whl (4.8 MB)
01-Oct-2026 07:38:27 Using cached pyparsing-3.3.3-py3-none-any.whl (126 kB)
01-Oct-2026 07:38:27 Using cached python_dateutil-2.9.0.post0-py2.py3-none-any.whl (229 kB)
01-Oct-2026 07:38:27 Using cached six-1.17.0-py2.py3-none-any.whl (11 kB)
01-Oct-2026 07:38:27 Using cached pyerfa-2.0.1.5-cp39-abi3-macosx_11_0_arm64.whl (329 kB)
01-Oct-2026 07:38:27 Installing collected packages: six, pyparsing, pyerfa, pillow, kiwisolver, fonttools, cycler, contourpy, python-dateutil, matplotlib, casatasks
01-Oct-2026 07:38:30
01-Oct-2026 07:38:30 Successfully installed casatasks-6.7.7.7a14849.dev3 contourpy-1.4.0 cycler-0.12.1 fonttools-4.66.1 kiwisolver-1.5.1 matplotlib-3.11.2 pillow-12.3.0 pyerfa-2.0.1.5 pyparsing-3.3.3 python-dateutil-2.9.0.post0 six-1.17.0
01-Oct-2026 07:38:30 Processing ./casatestutils-6.7.7.7a14849.dev3-py3-none-any.whl
01-Oct-2026 07:38:30 Collecting pytest>=6.0 (from casatestutils==6.7.7.7a14849.dev3)
01-Oct-2026 07:38:30   Using cached pytest-9.1.1-py3-none-any.whl.metadata (7.6 kB)
01-Oct-2026 07:38:30 Collecting astropy (from casatestutils==6.7.7.7a14849.dev3)
01-Oct-2026 07:38:30   Using cached astropy-8.0.1-cp311-abi3-macosx_11_0_arm64.whl.metadata (11 kB)
01-Oct-2026 07:38:30 Collecting iniconfig>=1.0.1 (from pytest>=6.0->casatestutils==6.7.7.7a14849.dev3)
01-Oct-2026 07:38:30   Using cached iniconfig-2.3.0-py3-none-any.whl.metadata (2.5 kB)
01-Oct-2026 07:38:30 Requirement already satisfied: packaging>=22 in /Users/casaci/bamboohome/xml-data/build-dir/CASASPECS-DEVTESTPY312147-TTARM15PY312/casa6testenv/lib/python3.12/site-packages (from pytest>=6.0->casatestutils==6.7.7.7a14849.dev3) (26.3)
01-Oct-2026 07:38:30 Collecting pluggy<2,>=1.5 (from pytest>=6.0->casatestutils==6.7.7.7a14849.dev3)
01-Oct-2026 07:38:30   Using cached pluggy-1.6.0-py3-none-any.whl.metadata (4.8 kB)
01-Oct-2026 07:38:30 Collecting pygments>=2.7.2 (from pytest>=6.0->casatestutils==6.7.7.7a14849.dev3)
01-Oct-2026 07:38:30   Using cached pygments-2.21.0-py3-none-any.whl.metadata (2.5 kB)
01-Oct-2026 07:38:30 Collecting astropy-iers-data>=0.2026.6.22.1.23.34 (from astropy->casatestutils==6.7.7.7a14849.dev3)
01-Oct-2026 07:38:30   Using cached astropy_iers_data-0.2026.9.28.0.59.37-py3-none-any.whl.metadata (3.4 kB)
01-Oct-2026 07:38:30 Requirement already satisfied: numpy>=2.0 in /Users/casaci/bamboohome/xml-data/build-dir/CASASPECS-DEVTESTPY312147-TTARM15PY312/casa6testenv/lib/python3.12/site-packages (from astropy->casatestutils==6.7.7.7a14849.dev3) (2.5.3)
01-Oct-2026 07:38:30 Requirement already satisfied: pyerfa>=2.0.1.3 in /Users/casaci/bamboohome/xml-data/build-dir/CASASPECS-DEVTESTPY312147-TTARM15PY312/casa6testenv/lib/python3.12/site-packages (from astropy->casatestutils==6.7.7.7a14849.dev3) (2.0.1.5)
01-Oct-2026 07:38:30 Collecting PyYAML>=6.0.0 (from astropy->casatestutils==6.7.7.7a14849.dev3)
01-Oct-2026 07:38:30   Using cached pyyaml-6.0.3-cp312-cp312-macosx_11_0_arm64.whl.metadata (2.4 kB)
01-Oct-2026 07:38:30 Using cached pytest-9.1.1-py3-none-any.whl (386 kB)
01-Oct-2026 07:38:30 Using cached pluggy-1.6.0-py3-none-any.whl (20 kB)
01-Oct-2026 07:38:30 Using cached iniconfig-2.3.0-py3-none-any.whl (7.5 kB)
01-Oct-2026 07:38:30 Using cached pygments-2.21.0-py3-none-any.whl (1.3 MB)
01-Oct-2026 07:38:30 Using cached astropy-8.0.1-cp311-abi3-macosx_11_0_arm64.whl (6.6 MB)
01-Oct-2026 07:38:30 Using cached astropy_iers_data-0.2026.9.28.0.59.37-py3-none-any.whl (2.0 MB)
01-Oct-2026 07:38:30 Using cached pyyaml-6.0.3-cp312-cp312-macosx_11_0_arm64.whl (173 kB)
01-Oct-2026 07:38:30 Installing collected packages: PyYAML, pygments, pluggy, iniconfig, astropy-iers-data, pytest, astropy, casatestutils
01-Oct-2026 07:38:33
01-Oct-2026 07:38:33 Successfully installed PyYAML-6.0.3 astropy-8.0.1 astropy-iers-data-0.2026.9.28.0.59.37 casatestutils-6.7.7.7a14849.dev3 iniconfig-2.3.0 pluggy-1.6.0 pygments-2.21.0 pytest-9.1.1
01-Oct-2026 07:38:33 Config:
01-Oct-2026 07:38:33 datapath=["/opt/casa/data/casa-data", "/opt/casa/data/casatestdata"]
01-Oct-2026 07:38:33 rundata="/opt/casa/data/casa-data"
01-Oct-2026 07:38:33 measurespath="/opt/casa/data/casa-data"
01-Oct-2026 07:38:33 data_auto_update=False
01-Oct-2026 07:38:33 measures_auto_update=False
01-Oct-2026 07:38:40 Switched to a new branch 'CAS-14849'
01-Oct-2026 07:38:40 branch 'CAS-14849' set up to track 'origin/CAS-14849'.
01-Oct-2026 07:38:40 python runtest.py --ignore_list 'test_casampi,test_task_msview,test_task_imview,test_task_plotms' -t ./casaconfig/tests
01-Oct-2026 07:38:41 ============================= test session starts ==============================
01-Oct-2026 07:38:41 platform darwin -- Python 3.12.8, pytest-9.1.1, pluggy-1.6.0 -- /Users/casaci/bamboohome/xml-data/build-dir/CASASPECS-DEVTESTPY312147-TTARM15PY312/casa6testenv/bin/python
01-Oct-2026 07:38:41 cachedir: .pytest_cache
01-Oct-2026 07:38:41 rootdir: /Users/casaci/bamboohome/xml-data/build-dir/CASASPECS-DEVTESTPY312147-TTARM15PY312/casa6/casatestutils/nosedir/test_casaconfig
01-Oct-2026 07:38:41 configfile: pytest.ini
01-Oct-2026 07:38:41 collecting ... collected 13 items
01-Oct-2026 07:38:41
01-Oct-2026 07:38:41
01-Oct-2026 07:39:24 test_casaconfig.py::casaconfig_test::test_auto_install_data
01-Oct-2026 07:39:24 Test auto install of all data to measurespath on casatools startup
01-Oct-2026 07:39:24 PASSED
01-Oct-2026 07:39:24
01-Oct-2026 07:39:25 test_casaconfig.py::casaconfig_test::test_auto_update_measures
01-Oct-2026 07:39:25 Test Automatic Measures Updates to measurespath
01-Oct-2026 07:39:25 pull_data using version casarundata-2026.02.19-1.tar.gz, acquiring the lock ...
01-Oct-2026 07:39:32 downloading casarundata contents to  /Users/casaci/bamboohome/xml-data/build-dir/CASASPECS-DEVTESTPY312147-TTARM15PY312/casa6/casatestutils/nosedir/test_casaconfig/testrundata (336M) ... done
01-Oct-2026 07:39:41 casarundata installed casarundata-2026.02.19-1.tar.gz at /Users/casaci/bamboohome/xml-data/build-dir/CASASPECS-DEVTESTPY312147-TTARM15PY312/casa6/casatestutils/nosedir/test_casaconfig/testrundata
01-Oct-2026 07:39:41 PASSED
01-Oct-2026 07:39:41
01-Oct-2026 07:39:41 test_casaconfig.py::casaconfig_test::test_casaconfig_measures_available
01-Oct-2026 07:39:41 Test That Today or Yesterday measures data is returned
01-Oct-2026 07:39:41 FAILED
01-Oct-2026 07:39:41
01-Oct-2026 07:39:51 test_casaconfig.py::casaconfig_test::test_casaconfig_measures_update
01-Oct-2026 07:39:51 Test downgrade to upgrade measures data to location
01-Oct-2026 07:39:51 measures_update ... acquiring the lock ...
01-Oct-2026 07:39:51 A measures update has been requested by the force argument
01-Oct-2026 07:39:51   ... finding available measures ...
01-Oct-2026 07:39:51   ... downloading ./WSRT_Measures_20260929-160001.ztar from https://iers.astron.nl/ to /Users/casaci/bamboohome/xml-data/build-dir/CASASPECS-DEVTESTPY312147-TTARM15PY312/casa6/casatestutils/nosedir/test_casaconfig/testmeasures ...
01-Oct-2026 07:39:51   ... measures data updated at /Users/casaci/bamboohome/xml-data/build-dir/CASASPECS-DEVTESTPY312147-TTARM15PY312/casa6/casatestutils/nosedir/test_casaconfig/testmeasures
01-Oct-2026 07:39:51 measures_update ... acquiring the lock ...
01-Oct-2026 07:39:51   ... finding available measures ...
01-Oct-2026 07:39:51   ... downloading ./WSRT_Measures_20260928-160001.ztar from https://iers.astron.nl/ to /Users/casaci/bamboohome/xml-data/build-dir/CASASPECS-DEVTESTPY312147-TTARM15PY312/casa6/casatestutils/nosedir/test_casaconfig/testmeasures ...
01-Oct-2026 07:39:51   ... measures data updated at /Users/casaci/bamboohome/xml-data/build-dir/CASASPECS-DEVTESTPY312147-TTARM15PY312/casa6/casatestutils/nosedir/test_casaconfig/testmeasures
01-Oct-2026 07:39:51 PASSED
01-Oct-2026 07:39:51
01-Oct-2026 07:39:51 test_casaconfig.py::casaconfig_test::test_config_import
01-Oct-2026 07:39:51 Tests of the config import
01-Oct-2026 07:39:51 PASSED
01-Oct-2026 07:39:51
01-Oct-2026 07:39:51 test_casaconfig.py::casaconfig_test::test_daily_update
01-Oct-2026 07:39:51 test that updates do not happen if the installed data is less than 1 day old and do happen when they are older
01-Oct-2026 07:39:51 pull_data using version casarundata-2025.12.12-1.tar.gz, acquiring the lock ...
01-Oct-2026 07:39:59 downloading casarundata contents to  /Users/casaci/bamboohome/xml-data/build-dir/CASASPECS-DEVTESTPY312147-TTARM15PY312/casa6/casatestutils/nosedir/test_casaconfig/testrundata (336M) ... done
01-Oct-2026 07:40:05 casarundata installed casarundata-2025.12.12-1.tar.gz at /Users/casaci/bamboohome/xml-data/build-dir/CASASPECS-DEVTESTPY312147-TTARM15PY312/casa6/casatestutils/nosedir/test_casaconfig/testrundata
01-Oct-2026 07:40:05 data_update: version installed or checked less than 1 day(s) ago, nothing updated or checked
01-Oct-2026 07:40:05 measures_update: version installed or checked less than 1 day(s) ago, nothing updated or checked
01-Oct-2026 07:40:05 data_update: version installed or checked less than 1 day(s) ago, nothing updated or checked
01-Oct-2026 07:40:05 measures_update ... acquiring the lock ...
01-Oct-2026 07:40:05   ... finding available measures ...
01-Oct-2026 07:40:05   ... downloading ./WSRT_Measures_20260929-160001.ztar from https://iers.astron.nl/ to /Users/casaci/bamboohome/xml-data/build-dir/CASASPECS-DEVTESTPY312147-TTARM15PY312/casa6/casatestutils/nosedir/test_casaconfig/testrundata ...
01-Oct-2026 07:40:05   ... measures data updated at /Users/casaci/bamboohome/xml-data/build-dir/CASASPECS-DEVTESTPY312147-TTARM15PY312/casa6/casatestutils/nosedir/test_casaconfig/testrundata
01-Oct-2026 07:40:05 data_update using version casarundata-2026.02.19-1.tar.gz, acquiring the lock ...
01-Oct-2026 07:40:05 Removing files using manifest from previous install of casarundata-2025.12.12-1.tar.gz on 2026-10-01
01-Oct-2026 07:40:13 downloading casarundata contents to  /Users/casaci/bamboohome/xml-data/build-dir/CASASPECS-DEVTESTPY312147-TTARM15PY312/casa6/casatestutils/nosedir/test_casaconfig/testrundata (336M) ... done
01-Oct-2026 07:40:20 casarundata installed casarundata-2026.02.19-1.tar.gz at /Users/casaci/bamboohome/xml-data/build-dir/CASASPECS-DEVTESTPY312147-TTARM15PY312/casa6/casatestutils/nosedir/test_casaconfig/testrundata
01-Oct-2026 07:40:20 measures_update ... acquiring the lock ...
01-Oct-2026 07:40:20   ... finding available measures ...
01-Oct-2026 07:40:20   ... downloading ./WSRT_Measures_20260929-160001.ztar from https://iers.astron.nl/ to /Users/casaci/bamboohome/xml-data/build-dir/CASASPECS-DEVTESTPY312147-TTARM15PY312/casa6/casatestutils/nosedir/test_casaconfig/testrundata ...
01-Oct-2026 07:40:20   ... measures data updated at /Users/casaci/bamboohome/xml-data/build-dir/CASASPECS-DEVTESTPY312147-TTARM15PY312/casa6/casatestutils/nosedir/test_casaconfig/testrundata
01-Oct-2026 07:40:20 PASSED
01-Oct-2026 07:40:20
01-Oct-2026 07:40:20 test_casaconfig.py::casaconfig_test::test_exceptions_no_data
01-Oct-2026 07:40:20 test that exceptions that do not require any data happen when expected
01-Oct-2026 07:40:20 PASSED
01-Oct-2026 07:40:20
01-Oct-2026 07:40:20 test_casaconfig.py::casaconfig_test::test_exceptions_with_data
01-Oct-2026 07:40:20 test that exceptions that require data happen when expected
01-Oct-2026 07:40:20 pull_data using version casarundata-2026.02.19-1.tar.gz, acquiring the lock ...
01-Oct-2026 07:40:28 downloading casarundata contents to  /Users/casaci/bamboohome/xml-data/build-dir/CASASPECS-DEVTESTPY312147-TTARM15PY312/casa6/casatestutils/nosedir/test_casaconfig/testrundata (336M) ... done
01-Oct-2026 07:40:30 lock file is not empty : /Users/casaci/bamboohome/xml-data/build-dir/CASASPECS-DEVTESTPY312147-TTARM15PY312/casa6/casatestutils/nosedir/test_casaconfig/testrundata/data_update.lock
01-Oct-2026 07:40:30 The lock file at /Users/casaci/bamboohome/xml-data/build-dir/CASASPECS-DEVTESTPY312147-TTARM15PY312/casa6/casatestutils/nosedir/test_casaconfig/testrundata is not empty.
01-Oct-2026 07:40:30 A previous attempt to update path may have failed or exited prematurely.
01-Oct-2026 07:40:30 Remove the lock file and set force to True with the desired version (default to most recent).
01-Oct-2026 07:40:30 It may be best to completely repopulate path using pull_data and measures_update.
01-Oct-2026 07:40:30 lock file is not empty : /Users/casaci/bamboohome/xml-data/build-dir/CASASPECS-DEVTESTPY312147-TTARM15PY312/casa6/casatestutils/nosedir/test_casaconfig/testrundata/data_update.lock
01-Oct-2026 07:40:30 data_update: the lock file at /Users/casaci/bamboohome/xml-data/build-dir/CASASPECS-DEVTESTPY312147-TTARM15PY312/casa6/casatestutils/nosedir/test_casaconfig/testrundata is not empty.
01-Oct-2026 07:40:30 A previous attempt to update path may have failed or exited prematurely.
01-Oct-2026 07:40:30 Remove the lock file and set force to True with the desired version (default to most recent).
01-Oct-2026 07:40:30 It may be best to completely re-populate path using pull_data and measures_update.
01-Oct-2026 07:40:30 casarundata installed casarundata-2026.02.19-1.tar.gz at /Users/casaci/bamboohome/xml-data/build-dir/CASASPECS-DEVTESTPY312147-TTARM15PY312/casa6/casatestutils/nosedir/test_casaconfig/testrundata
01-Oct-2026 07:40:30 measures_update ... acquiring the lock ...
01-Oct-2026 07:40:30 data_update using version casarundata-2024.02.09-1.tar.gz, acquiring the lock ...
01-Oct-2026 07:40:30 PASSED
01-Oct-2026 07:40:30
01-Oct-2026 07:40:30 test_casaconfig.py::casaconfig_test::test_file_exists
01-Oct-2026 07:40:30 Test Default config.py exists in casaconfig module
01-Oct-2026 07:40:30 PASSED
01-Oct-2026 07:40:30
01-Oct-2026 07:40:33 test_casaconfig.py::casaconfig_test::test_import_casatools_bad_measurespath
01-Oct-2026 07:40:33 Test that import casatools will return ImportError with measurespath set to an empty directory that cannot be written to
01-Oct-2026 07:40:33 PASSED
01-Oct-2026 07:40:33
01-Oct-2026 07:42:51 measures_update can't find specified version ./WSRT_Measures_20260927-160001.ztar at site https://go.nrao.edu/iers/
01-Oct-2026 07:45:13 measures_update can't find specified version NRAO_Measures_20260927-140501.ztar at site https://iers.astron.nl/
01-Oct-2026 07:45:13 Unable to retrieve list of available measures versions, measures_site value may be an empty list or no files were found at measures_site, check and try again.
01-Oct-2026 07:45:13 There was a remote error while attempting to update measures at /Users/casaci/bamboohome/xml-data/build-dir/CASASPECS-DEVTESTPY312147-TTARM15PY312/casa6/casatestutils/nosedir/test_casaconfig/testmeasures
01-Oct-2026 07:45:13 Check the value of measures_site and try again
01-Oct-2026 07:45:13 test_casaconfig.py::casaconfig_test::test_measures_site
01-Oct-2026 07:45:13 tests related to measures site
01-Oct-2026 07:45:13 Warning: the most recent measures tar file at each of the sites was older than config.measures_site_interval
01-Oct-2026 07:45:13 https://go.nrao.edu/iers/ had the most recent measures tar file, returning that list
01-Oct-2026 07:45:13 Warning: the most recent measures tar file at each of the sites was older than config.measures_site_interval
01-Oct-2026 07:45:13 https://go.nrao.edu/iers/ had the most recent measures tar file, returning that list
01-Oct-2026 07:45:13 measures_update ... acquiring the lock ...
01-Oct-2026 07:45:13 A measures update has been requested by the force argument
01-Oct-2026 07:45:13   ... finding available measures ...
01-Oct-2026 07:45:13   ... downloading ./WSRT_Measures_20260929-160001.ztar from https://iers.astron.nl/ to /Users/casaci/bamboohome/xml-data/build-dir/CASASPECS-DEVTESTPY312147-TTARM15PY312/casa6/casatestutils/nosedir/test_casaconfig/testmeasures ...
01-Oct-2026 07:45:13   ... measures data updated at /Users/casaci/bamboohome/xml-data/build-dir/CASASPECS-DEVTESTPY312147-TTARM15PY312/casa6/casatestutils/nosedir/test_casaconfig/testmeasures
01-Oct-2026 07:45:13 di : {'site': 'https://iers.astron.nl/', 'version': './WSRT_Measures_20260929-160001.ztar', 'date': '2026-10-01', 'age': 2.1247952072708697e-09}
01-Oct-2026 07:45:13 measures_update ... acquiring the lock ...
01-Oct-2026 07:45:13 A measures update has been requested by the force argument
01-Oct-2026 07:45:13   ... finding available measures ...
01-Oct-2026 07:45:13   ... downloading ./WSRT_Measures_20260927-160001.ztar from https://iers.astron.nl/ to /Users/casaci/bamboohome/xml-data/build-dir/CASASPECS-DEVTESTPY312147-TTARM15PY312/casa6/casatestutils/nosedir/test_casaconfig/testmeasures ...
01-Oct-2026 07:45:13   ... measures data updated at /Users/casaci/bamboohome/xml-data/build-dir/CASASPECS-DEVTESTPY312147-TTARM15PY312/casa6/casatestutils/nosedir/test_casaconfig/testmeasures
01-Oct-2026 07:45:13 measures_update ... acquiring the lock ...
01-Oct-2026 07:45:13 A measures update has been requested by the force argument
01-Oct-2026 07:45:13   ... finding available measures ...
01-Oct-2026 07:45:13   ... downloading ./WSRT_Measures_20260927-160001.ztar from https://iers.astron.nl/ to /Users/casaci/bamboohome/xml-data/build-dir/CASASPECS-DEVTESTPY312147-TTARM15PY312/casa6/casatestutils/nosedir/test_casaconfig/testmeasures ...
01-Oct-2026 07:45:13   ... measures data updated at /Users/casaci/bamboohome/xml-data/build-dir/CASASPECS-DEVTESTPY312147-TTARM15PY312/casa6/casatestutils/nosedir/test_casaconfig/testmeasures
01-Oct-2026 07:45:13 measures_update ... acquiring the lock ...
01-Oct-2026 07:45:13 A measures update has been requested by the force argument
01-Oct-2026 07:45:13   ... finding available measures ...
01-Oct-2026 07:45:13   ... downloading ./WSRT_Measures_20260929-160001.ztar from https://iers.astron.nl/ to /Users/casaci/bamboohome/xml-data/build-dir/CASASPECS-DEVTESTPY312147-TTARM15PY312/casa6/casatestutils/nosedir/test_casaconfig/testmeasures ...
01-Oct-2026 07:45:13   ... measures data updated at /Users/casaci/bamboohome/xml-data/build-dir/CASASPECS-DEVTESTPY312147-TTARM15PY312/casa6/casatestutils/nosedir/test_casaconfig/testmeasures
01-Oct-2026 07:45:13 measures_update ... acquiring the lock ...
01-Oct-2026 07:45:13 A measures update has been requested by the force argument
01-Oct-2026 07:45:13   ... finding available measures ...
01-Oct-2026 07:45:13 measures_update ... acquiring the lock ...
01-Oct-2026 07:45:13 A measures update has been requested by the force argument
01-Oct-2026 07:45:13   ... finding available measures ...
01-Oct-2026 07:45:13   ... downloading NRAO_Measures_20260927-140501.ztar from https://go.nrao.edu/iers/ to /Users/casaci/bamboohome/xml-data/build-dir/CASASPECS-DEVTESTPY312147-TTARM15PY312/casa6/casatestutils/nosedir/test_casaconfig/testmeasures ...
01-Oct-2026 07:45:13   ... measures data updated at /Users/casaci/bamboohome/xml-data/build-dir/CASASPECS-DEVTESTPY312147-TTARM15PY312/casa6/casatestutils/nosedir/test_casaconfig/testmeasures
01-Oct-2026 07:45:13 measures_update ... acquiring the lock ...
01-Oct-2026 07:45:13 A measures update has been requested by the force argument
01-Oct-2026 07:45:13   ... finding available measures ...
01-Oct-2026 07:45:13   ... downloading NRAO_Measures_20260927-140501.ztar from https://go.nrao.edu/iers/ to /Users/casaci/bamboohome/xml-data/build-dir/CASASPECS-DEVTESTPY312147-TTARM15PY312/casa6/casatestutils/nosedir/test_casaconfig/testmeasures ...
01-Oct-2026 07:45:13   ... measures data updated at /Users/casaci/bamboohome/xml-data/build-dir/CASASPECS-DEVTESTPY312147-TTARM15PY312/casa6/casatestutils/nosedir/test_casaconfig/testmeasures
01-Oct-2026 07:45:13 measures_update ... acquiring the lock ...
01-Oct-2026 07:45:13 A measures update has been requested by the force argument
01-Oct-2026 07:45:13   ... finding available measures ...
01-Oct-2026 07:45:13   ... downloading NRAO_Measures_20260930-140606.ztar from https://go.nrao.edu/iers/ to /Users/casaci/bamboohome/xml-data/build-dir/CASASPECS-DEVTESTPY312147-TTARM15PY312/casa6/casatestutils/nosedir/test_casaconfig/testmeasures ...
01-Oct-2026 07:45:13   ... measures data updated at /Users/casaci/bamboohome/xml-data/build-dir/CASASPECS-DEVTESTPY312147-TTARM15PY312/casa6/casatestutils/nosedir/test_casaconfig/testmeasures
01-Oct-2026 07:45:13 measures_update ... acquiring the lock ...
01-Oct-2026 07:45:13 A measures update has been requested by the force argument
01-Oct-2026 07:45:13   ... finding available measures ...
01-Oct-2026 07:45:13 measures_update ... acquiring the lock ...
01-Oct-2026 07:45:13 A measures update has been requested by the force argument
01-Oct-2026 07:45:13   ... finding available measures ...
01-Oct-2026 07:45:13 PASSED
01-Oct-2026 07:45:13
01-Oct-2026 07:45:14 test_casaconfig.py::casaconfig_test::test_read_measurespath_from_user_config
01-Oct-2026 07:45:14 Test casaconfig downloads specific measures data to location and casatools reads that data location
01-Oct-2026 07:45:14 pull_data using version casarundata-2026.02.19-1.tar.gz, acquiring the lock ...
01-Oct-2026 07:45:21 downloading casarundata contents to  /Users/casaci/bamboohome/xml-data/build-dir/CASASPECS-DEVTESTPY312147-TTARM15PY312/casa6/casatestutils/nosedir/test_casaconfig/testrundata (336M) ... done
01-Oct-2026 07:45:30 casarundata installed casarundata-2026.02.19-1.tar.gz at /Users/casaci/bamboohome/xml-data/build-dir/CASASPECS-DEVTESTPY312147-TTARM15PY312/casa6/casatestutils/nosedir/test_casaconfig/testrundata
01-Oct-2026 07:45:30 PASSED
01-Oct-2026 07:45:30
01-Oct-2026 07:45:30 test_casaconfig.py::casaconfig_test::test_update_interval
01-Oct-2026 07:45:30 tests use of config update_interval values
01-Oct-2026 07:45:30 pull_data using version casarundata-2026.02.19-1.tar.gz, acquiring the lock ...
01-Oct-2026 07:45:37 downloading casarundata contents to  /Users/casaci/bamboohome/xml-data/build-dir/CASASPECS-DEVTESTPY312147-TTARM15PY312/casa6/casatestutils/nosedir/test_casaconfig/testrundata (336M) ... done
01-Oct-2026 07:45:39 casarundata installed casarundata-2026.02.19-1.tar.gz at /Users/casaci/bamboohome/xml-data/build-dir/CASASPECS-DEVTESTPY312147-TTARM15PY312/casa6/casatestutils/nosedir/test_casaconfig/testrundata
01-Oct-2026 07:45:39 data_update using version casarundata-2025.12.12-1.tar.gz, acquiring the lock ...
01-Oct-2026 07:45:39 Removing files using manifest from previous install of casarundata-2026.02.19-1.tar.gz on 2026-10-01
01-Oct-2026 07:45:47 downloading casarundata contents to  /Users/casaci/bamboohome/xml-data/build-dir/CASASPECS-DEVTESTPY312147-TTARM15PY312/casa6/casatestutils/nosedir/test_casaconfig/testrundata (336M) ... done
01-Oct-2026 07:45:48 casarundata installed casarundata-2025.12.12-1.tar.gz at /Users/casaci/bamboohome/xml-data/build-dir/CASASPECS-DEVTESTPY312147-TTARM15PY312/casa6/casatestutils/nosedir/test_casaconfig/testrundata
01-Oct-2026 07:45:48 data_update: version installed or checked less than 1 day(s) ago, nothing updated or checked
01-Oct-2026 07:45:48 data_update using version casarundata-2026.02.19-1.tar.gz, acquiring the lock ...
01-Oct-2026 07:45:48 Removing files using manifest from previous install of casarundata-2025.12.12-1.tar.gz on 2026-10-01
01-Oct-2026 07:45:56 downloading casarundata contents to  /Users/casaci/bamboohome/xml-data/build-dir/CASASPECS-DEVTESTPY312147-TTARM15PY312/casa6/casatestutils/nosedir/test_casaconfig/testrundata (336M) ... done
01-Oct-2026 07:46:06 casarundata installed casarundata-2026.02.19-1.tar.gz at /Users/casaci/bamboohome/xml-data/build-dir/CASASPECS-DEVTESTPY312147-TTARM15PY312/casa6/casatestutils/nosedir/test_casaconfig/testrundata
01-Oct-2026 07:46:06 measures_update ... acquiring the lock ...
01-Oct-2026 07:46:06 A measures update has been requested by the force argument
01-Oct-2026 07:46:06   ... finding available measures ...
01-Oct-2026 07:46:06   ... downloading ./WSRT_Measures_20260928-160001.ztar from https://iers.astron.nl/ to /Users/casaci/bamboohome/xml-data/build-dir/CASASPECS-DEVTESTPY312147-TTARM15PY312/casa6/casatestutils/nosedir/test_casaconfig/testrundata ...
01-Oct-2026 07:46:06   ... measures data updated at /Users/casaci/bamboohome/xml-data/build-dir/CASASPECS-DEVTESTPY312147-TTARM15PY312/casa6/casatestutils/nosedir/test_casaconfig/testrundata
01-Oct-2026 07:46:06 measures_update: version installed or checked less than 1 day(s) ago, nothing updated or checked
01-Oct-2026 07:46:06 measures_update ... acquiring the lock ...
01-Oct-2026 07:46:06   ... finding available measures ...
01-Oct-2026 07:46:06   ... downloading ./WSRT_Measures_20260929-160001.ztar from https://iers.astron.nl/ to /Users/casaci/bamboohome/xml-data/build-dir/CASASPECS-DEVTESTPY312147-TTARM15PY312/casa6/casatestutils/nosedir/test_casaconfig/testrundata ...
01-Oct-2026 07:46:06   ... measures data updated at /Users/casaci/bamboohome/xml-data/build-dir/CASASPECS-DEVTESTPY312147-TTARM15PY312/casa6/casatestutils/nosedir/test_casaconfig/testrundata
01-Oct-2026 07:46:06 PASSED
01-Oct-2026 07:46:06
01-Oct-2026 07:46:06 =================================== FAILURES ===================================
01-Oct-2026 07:46:06 ______________ casaconfig_test.test_casaconfig_measures_available ______________
01-Oct-2026 07:46:06 test_casaconfig.py:176: in test_casaconfig_measures_available
01-Oct-2026 07:46:06     self.assertTrue(any(elem in self.get_meas_avail() for elem in [measuresdata_today, measuresdata_yesterday]))
01-Oct-2026 07:46:06 E   AssertionError: False is not true
01-Oct-2026 07:46:06 - generated xml file: /Users/casaci/bamboohome/xml-data/build-dir/CASASPECS-DEVTESTPY312147-TTARM15PY312/casa6/casatestutils/nosedir/xml/test_casaconfig/nose.xml -
01-Oct-2026 07:46:06 =========================== short test summary info ============================
01-Oct-2026 07:46:06 FAILED test_casaconfig.py::casaconfig_test::test_casaconfig_measures_available
01-Oct-2026 07:46:06 ============= 1 failed, 12 passed, 1 warning in 445.66s (0:07:25) ==============
01-Oct-2026 07:46:06 Namespace(list=False, verbose=False, dry_run=False, classes=None, file=None, mapfile=None, branch=None, merge_target=None, pkg=None, work_dir=None, ncores=2, test_paths='./casaconfig/tests', test_list=None, test_config=None, test_group=None, pmode=None, bamboo=False, cachedir=None, ignore_list='test_casampi,test_task_msview,test_task_imview,test_task_plotms', run_skipped=False, only_skipped=False)
01-Oct-2026 07:46:06
01-Oct-2026 07:46:06 Operating system: Darwin
01-Oct-2026 07:46:06
01-Oct-2026 07:46:06 Arguments Sent Direct To Pytest :  []
01-Oct-2026 07:46:06
01-Oct-2026 07:46:06 Tests to Ignore:  ['test_casampi', 'test_task_msview', 'test_task_imview', 'test_task_plotms']
01-Oct-2026 07:46:06 Running 1 Test(s)
01-Oct-2026 07:46:06 Cleaning: /Users/casaci/bamboohome/xml-data/build-dir/CASASPECS-DEVTESTPY312147-TTARM15PY312/casa6/casatestutils/nosedir/
01-Oct-2026 07:46:06 Tests: ['/Users/casaci/bamboohome/xml-data/build-dir/CASASPECS-DEVTESTPY312147-TTARM15PY312/casa6/casatestutils/casaconfig/tests/test_casaconfig.py']
01-Oct-2026 07:46:06
01-Oct-2026 07:46:06 Setting Working Directory: /Users/casaci/bamboohome/xml-data/build-dir/CASASPECS-DEVTESTPY312147-TTARM15PY312/casa6/casatestutils/nosedir/test_casaconfig/
01-Oct-2026 07:46:06 Test Directory: /Users/casaci/bamboohome/xml-data/build-dir/CASASPECS-DEVTESTPY312147-TTARM15PY312/casa6/casatestutils/nosedir/test_casaconfig
01-Oct-2026 07:46:06
01-Oct-2026 07:46:06 Running Command: pytest --junitxml=/Users/casaci/bamboohome/xml-data/build-dir/CASASPECS-DEVTESTPY312147-TTARM15PY312/casa6/casatestutils/nosedir/xml/test_casaconfig/nose.xml -s --disable-pytest-warnings --verbose -ra --tb=short /Users/casaci/bamboohome/xml-data/build-dir/CASASPECS-DEVTESTPY312147-TTARM15PY312/casa6/casatestutils/nosedir/test_casaconfig/
01-Oct-2026 07:46:06 a nosedir
01-Oct-2026 07:46:06 a nosedir/summary_of_failed.log
01-Oct-2026 07:46:06 a nosedir/xml
01-Oct-2026 07:46:06 a nosedir/test_casaconfig
01-Oct-2026 07:46:06 a nosedir/test_casaconfig/casa-20261001-113936.log
01-Oct-2026 07:46:06 a nosedir/test_casaconfig/test_casaconfig.py
01-Oct-2026 07:46:06 a nosedir/test_casaconfig/conftest.py
01-Oct-2026 07:46:06 a nosedir/test_casaconfig/casa-20261001-113908.log
01-Oct-2026 07:46:06 a nosedir/test_casaconfig/casa-20261001-114523.log
01-Oct-2026 07:46:06 a nosedir/test_casaconfig/casa-20261001-114032.log
01-Oct-2026 07:46:06 a nosedir/test_casaconfig/short_summary.log
01-Oct-2026 07:46:06 a nosedir/test_casaconfig/casa-20261001-113910.log
01-Oct-2026 07:46:06 a nosedir/xml/test_casaconfig
01-Oct-2026 07:46:06 a nosedir/xml/test_casaconfig/nose.xml
01-Oct-2026 07:46:06 Finished task 'Test wheel' with result: Success
01-Oct-2026 07:46:06 Starting task 'Parse tests' of type 'com.atlassian.bamboo.plugins.testresultparser:task.testresultparser.junit'
01-Oct-2026 07:46:06 Parsing test results under /Users/casaci/bamboohome/xml-data/build-dir/CASASPECS-DEVTESTPY312147-TTARM15PY312...
01-Oct-2026 07:46:06 Failing task since 1 failing test cases were found.
01-Oct-2026 07:46:06 Finished task 'Parse tests' with result: Failed
01-Oct-2026 07:46:06 Running post build plugin 'Docker Container Cleanup'
01-Oct-2026 07:46:06 Running post build plugin 'NCover Results Collector'
01-Oct-2026 07:46:06 Running post build plugin 'Build Results Label Collector'
01-Oct-2026 07:46:06 Running post build plugin 'Clover Results Collector'
01-Oct-2026 07:46:06 Running post build plugin 'npm Cache Cleanup'
01-Oct-2026 07:46:06 Running post build plugin 'Artifact Copier'
01-Oct-2026 07:46:06 Publishing an artifact: requirements.txt
01-Oct-2026 07:46:06 Finished publishing of artifact Non required job artifact Http Compression On : [requirements.txt], patterns: [requirements.txt] anchored at: [wheeldirectory/] in 66.25 ms
01-Oct-2026 07:46:06 Publishing an artifact: Workdir
01-Oct-2026 07:46:06 Finished publishing of artifact Non required job artifact Http Compression On : [Workdir], patterns: [work*.tar.gz] anchored at: [wheeldirectory/] in 17.88 ms
01-Oct-2026 07:46:06 Finalising the build...
01-Oct-2026 07:46:06 Stopping timer.
01-Oct-2026 07:46:06 Build CASASPECS-DEVTESTPY312147-TTARM15PY312-5 completed.
01-Oct-2026 07:46:07 Running on server: post build plugin 'Build Hanging Detection Configuration'
01-Oct-2026 07:46:07 Running on server: post build plugin 'NCover Results Collector'
01-Oct-2026 07:46:07 Running on server: post build plugin 'Build Labeller'
01-Oct-2026 07:46:07 Running on server: post build plugin 'Clover Delta Calculator'
01-Oct-2026 07:46:07 Running on server: post build plugin 'Maven Dependencies Postprocessor'
01-Oct-2026 07:46:07 All post build plugins have finished
01-Oct-2026 07:46:07 Generating build results summary...
01-Oct-2026 07:46:07 Saving build results to disk...
01-Oct-2026 07:46:07 Store variable context...
01-Oct-2026 07:46:07 Finished building CASASPECS-DEVTESTPY312147-TTARM15PY312-5.