Build: #5 failed Manual run by CASA adm account

Build result summary

Details

Completed
Queue duration
1 second
Duration
14 minutes
Labels
None
Revisions
CASA6
0162b0f21d9253a10cd8a3ebc52b074f3465cdd1
OPEN-CASA-PKG
e5285e68467f01199807a1f1a978aec8a4781be7
Total tests
1424
Failing since
#3 (Manual run by CASA adm account – )
Fixed in
#7 (Manual run by CASA adm account)

Tests

Responsible

  • Bob Garwood Bob Garwood Automatically assigned

Configuration changes

Some of the jobs or stages referenced by this result no longer exist.

Restarting failed/incomplete builds only is not possible as some of the affected jobs no longer exist.

Tests

Existing test failures 2
Status Test Failing since View job Duration
AssertionError: False is not true
test_casaconfig.py:176: in test_casaconfig_measures_available
    self.assertTrue(any(elem in self.get_meas_avail() for elem in [measuresdata_today, measuresdata_yesterday]))
E   AssertionError: False is not true
AssertionError: False is not true
test_casaconfig.py:176: in test_casaconfig_measures_available
    self.assertTrue(any(elem in self.get_meas_avail() for elem in [measuresdata_today, measuresdata_yesterday]))
E   AssertionError: False is not true