Build: #5 failed
Job: Test Tools Many Linux 2.28 Py3.12 was successful
Build log
The build generated 53,646 lines of output. The output is too long and has been truncated to the last 1,000 lines. Download or view full build log.
| 15-Sep-2026 15:50:39 | 2026-09-15 19:50:40 INFO ImageStatsCalculator::_logStartup -- top-right corner (world) [trcf]: 23:59:24.000, +00.09.00.001, Pangle |
| 15-Sep-2026 15:50:39 | 2026-09-15 19:50:40 INFO Values --- |
| 15-Sep-2026 15:50:39 | 2026-09-15 19:50:40 INFO -- number of points [npts]: 400 |
| 15-Sep-2026 15:50:39 | 2026-09-15 19:50:40 INFO -- maximum value [max]: 22.5001 deg |
| 15-Sep-2026 15:50:39 | 2026-09-15 19:50:40 INFO -- minimum value [min]: 22.5 deg |
| 15-Sep-2026 15:50:39 | 2026-09-15 19:50:40 INFO -- position of max value (pixel) [maxpos]: [1, 0, 0] |
| 15-Sep-2026 15:50:39 | 2026-09-15 19:50:40 INFO -- position of min value (pixel) [minpos]: [3, 0, 0] |
| 15-Sep-2026 15:50:39 | 2026-09-15 19:50:40 INFO -- position of max value (world) [maxposf]: 00:00:36.000, -00.10.00.001, Pangle |
| 15-Sep-2026 15:50:39 | 2026-09-15 19:50:40 INFO -- position of min value (world) [minposf]: 00:00:28.000, -00.10.00.001, Pangle |
| 15-Sep-2026 15:50:39 | 2026-09-15 19:50:40 INFO -- Sum of pixel values [sum]: 9000.02 deg |
| 15-Sep-2026 15:50:39 | 2026-09-15 19:50:40 INFO -- Sum of squared pixel values [sumsq]: 202501 deg.deg |
| 15-Sep-2026 15:50:39 | 2026-09-15 19:50:40 INFO Statistics --- |
| 15-Sep-2026 15:50:39 | 2026-09-15 19:50:40 INFO -- Mean of the pixel values [mean]: 22.5 deg |
| 15-Sep-2026 15:50:39 | 2026-09-15 19:50:40 INFO -- Variance of the pixel values : 6.26899e-10 deg |
| 15-Sep-2026 15:50:39 | 2026-09-15 19:50:40 INFO -- Standard deviation of the Mean [sigma]: 2.5038e-05 deg |
| 15-Sep-2026 15:50:39 | 2026-09-15 19:50:40 INFO -- Root mean square [rms]: 22.5 deg |
| 15-Sep-2026 15:50:39 | 2026-09-15 19:50:40 INFO ImageStatsCalculator::statistics Sum column unit = deg |
| 15-Sep-2026 15:50:39 | 2026-09-15 19:50:40 INFO ImageStatsCalculator::statistics+ Mean column unit = deg |
| 15-Sep-2026 15:50:39 | 2026-09-15 19:50:40 INFO ImageStatsCalculator::statistics+ Std_dev column unit = deg |
| 15-Sep-2026 15:50:39 | 2026-09-15 19:50:40 INFO ImageStatsCalculator::statistics+ Minimum column unit = deg |
| 15-Sep-2026 15:50:39 | 2026-09-15 19:50:40 INFO ImageStatsCalculator::statistics+ Maximum column unit = deg |
| 15-Sep-2026 15:50:39 | 2026-09-15 19:50:40 INFO ImageStatsCalculator::statistics Npts Sum Mean Rms Std_dev Minimum Maximum |
| 15-Sep-2026 15:50:39 | 2026-09-15 19:50:40 INFO ImageStatsCalculator::statistics 4.000000e+02 9.000018e+03 2.250005e+01 2.250005e+01 2.503796e-05 2.249998e+01 2.250008e+01 |
| 15-Sep-2026 15:50:39 | 2026-09-15 19:50:40 INFO deleted table /home/casatest/casa6/casatestutils/nosedir/test_tool_imagepol/pa0.im |
| 15-Sep-2026 15:50:39 | test_tool_imagepol.py::po_rotationmeasure_test::test_algorithm |
| 15-Sep-2026 15:50:39 | Test rotation measure computation algorithm |
| 15-Sep-2026 15:50:39 | PASSED |
| 15-Sep-2026 15:50:39 | |
| 15-Sep-2026 15:50:39 | 2026-09-15 19:50:40 INFO ImageFITSConverter::readBeamsTable Loading multiple beams from BEAMS table |
| 15-Sep-2026 15:50:39 | 2026-09-15 19:50:40 INFO ImagePol::rotationMeasure Creating image 'g' of shape [10, 10] |
| 15-Sep-2026 15:50:39 | 2026-09-15 19:50:40 INFO ImagePolarimetry::sigma Determined noise from V image to be 1.0119 |
| 15-Sep-2026 15:50:39 | 2026-09-15 19:50:40 INFO ImageFITSConverter::readBeamsTable Loading multiple beams from BEAMS table |
| 15-Sep-2026 15:50:39 | 2026-09-15 19:50:40 INFO ImagePol::rotationMeasure Creating image 'hh' of shape [10, 10] |
| 15-Sep-2026 15:50:39 | 2026-09-15 19:50:40 SEVERE imagepol::rotationmeasure Exception Reported: Exception: Input image has multiple beams and the corresponding beams for the stokes planes necessary for this computation are not equal.. |
| 15-Sep-2026 15:50:39 | 2026-09-15 19:50:40 SEVERE imagepol::rotationmeasure+ ... thrown by casacore::Bool casa::ImagePolarimetry::_checkBeams(const std::vector<casa::ImagePolarimetry::StokesTypes>&, casacore::Bool, casacore::Bool) const at File: /source/casa6/casatools/src/code/imageanalysis/ImageAnalysis/ImagePolarimetry.cc, line: 1626 |
| 15-Sep-2026 15:50:39 | test_tool_imagepol.py::po_rotationmeasure_test::test_multibeam |
| 15-Sep-2026 15:50:39 | Test multibeam images for correct behavior |
| 15-Sep-2026 15:50:39 | PASSED |
| 15-Sep-2026 15:50:39 | |
| 15-Sep-2026 15:50:39 | 2026-09-15 19:50:40 INFO ImageFITSConverter::readBeamsTable Loading multiple beams from BEAMS table |
| 15-Sep-2026 15:50:39 | 2026-09-15 19:50:40 INFO ImagePolarimetry::sigma Determined noise from V image to be 1.0119 |
| 15-Sep-2026 15:50:39 | 2026-09-15 19:50:40 INFO ImageFITSConverter::readBeamsTable Loading multiple beams from BEAMS table |
| 15-Sep-2026 15:50:39 | 2026-09-15 19:50:40 INFO ImagePolarimetry::sigma Determined noise from V image to be 1.0119 |
| 15-Sep-2026 15:50:39 | test_tool_imagepol.py::po_sigma_test::test_multibeam |
| 15-Sep-2026 15:50:39 | Test multibeam images for correct behavior |
| 15-Sep-2026 15:50:39 | pol_eq_beams.fits |
| 15-Sep-2026 15:50:39 | PASSED |
| 15-Sep-2026 15:50:39 | |
| 15-Sep-2026 15:50:39 | 2026-09-15 19:50:40 INFO ImageFITSConverter::readBeamsTable Loading multiple beams from BEAMS table |
| 15-Sep-2026 15:50:39 | 2026-09-15 19:50:40 INFO ImageFITSConverter::readBeamsTable Loading multiple beams from BEAMS table |
| 15-Sep-2026 15:50:39 | 2026-09-15 19:50:40 INFO ImagePolarimetry::sigmaLinPolInt Determined noise from Q&U images to be |
| 15-Sep-2026 15:50:39 | 2026-09-15 19:50:40 INFO ImagePolarimetry::sigmaLinPolInt Determined noise from Q&U images to be |
| 15-Sep-2026 15:50:39 | 2026-09-15 19:50:40 INFO ImageFITSConverter::readBeamsTable Loading multiple beams from BEAMS table |
| 15-Sep-2026 15:50:39 | 2026-09-15 19:50:40 INFO ImageFITSConverter::readBeamsTable Loading multiple beams from BEAMS table |
| 15-Sep-2026 15:50:39 | 2026-09-15 19:50:40 SEVERE imagepol::sigmadepolratio Exception Reported: Exception: Beams or beamsets are not equal between the two images, caonnot perform calculation. |
| 15-Sep-2026 15:50:39 | 2026-09-15 19:50:40 SEVERE imagepol::sigmadepolratio+ ... thrown by static void casa::ImagePolarimetry::_checkBeams(const casa::ImagePolarimetry&, const casa::ImagePolarimetry&, const casacore::Vector<casa::ImagePolarimetry::StokesTypes>&) at File: /source/casa6/casatools/src/code/imageanalysis/ImageAnalysis/ImagePolarimetry.cc, line: 1686 |
| 15-Sep-2026 15:50:39 | test_tool_imagepol.py::po_sigmadepolratio_test::test_multibeam |
| 15-Sep-2026 15:50:39 | Test multibeam images for correct behavior |
| 15-Sep-2026 15:50:39 | PASSED |
| 15-Sep-2026 15:50:39 | |
| 15-Sep-2026 15:50:39 | 2026-09-15 19:50:40 INFO ImageFITSConverter::readBeamsTable Loading multiple beams from BEAMS table |
| 15-Sep-2026 15:50:39 | 2026-09-15 19:50:40 INFO ImagePolarimetry::sigmaLinPolInt Determined noise from Q&U images to be |
| 15-Sep-2026 15:50:39 | 2026-09-15 19:50:40 INFO imagepol::sigmaFracLinPol Creating image 'g' of shape [10, 10, 10, 1] |
| 15-Sep-2026 15:50:39 | 2026-09-15 19:50:40 INFO ImageFITSConverter::readBeamsTable Loading multiple beams from BEAMS table |
| 15-Sep-2026 15:50:39 | 2026-09-15 19:50:40 SEVERE imagepol::sigmafraclinpol Exception Reported: Exception: Input image has multiple beams and the corresponding beams for the stokes planes necessary for this computation are not equal.. |
| 15-Sep-2026 15:50:39 | 2026-09-15 19:50:40 SEVERE imagepol::sigmafraclinpol+ ... thrown by casacore::Bool casa::ImagePolarimetry::_checkBeams(const std::vector<casa::ImagePolarimetry::StokesTypes>&, casacore::Bool, casacore::Bool) const at File: /source/casa6/casatools/src/code/imageanalysis/ImageAnalysis/ImagePolarimetry.cc, line: 1626 |
| 15-Sep-2026 15:50:39 | test_tool_imagepol.py::po_sigmafraclinpol_test::test_multibeam |
| 15-Sep-2026 15:50:39 | Test multibeam images for correct behavior |
| 15-Sep-2026 15:50:39 | PASSED |
| 15-Sep-2026 15:50:39 | |
| 15-Sep-2026 15:50:39 | 2026-09-15 19:50:40 INFO ImageFITSConverter::readBeamsTable Loading multiple beams from BEAMS table |
| 15-Sep-2026 15:50:39 | 2026-09-15 19:50:40 INFO ImagePolarimetry::sigma Determined noise from V image to be 1.0119 |
| 15-Sep-2026 15:50:39 | 2026-09-15 19:50:40 INFO imagepol::sigmaFracTotPol Creating image 'g' of shape [10, 10, 10, 1] |
| 15-Sep-2026 15:50:39 | 2026-09-15 19:50:40 INFO ImageFITSConverter::readBeamsTable Loading multiple beams from BEAMS table |
| 15-Sep-2026 15:50:39 | 2026-09-15 19:50:40 WARN ImagePolarimetry::_setDoLinDoCirc (file /source/casa6/casatools/src/code/imageanalysis/ImageAnalysis/ImagePolarimetry.cc, line 272) I, Q, and U beams are not the same, cannot do linear portion |
| 15-Sep-2026 15:50:39 | 2026-09-15 19:50:40 WARN ImagePolarimetry::_setDoLinDoCirc (file /source/casa6/casatools/src/code/imageanalysis/ImageAnalysis/ImagePolarimetry.cc, line 272) I and V beams are not the same, cannot do circular portion |
| 15-Sep-2026 15:50:39 | 2026-09-15 19:50:40 SEVERE imagepol::sigmafractotpol Exception Reported: Exception: Can do neither linear nor circular portions. |
| 15-Sep-2026 15:50:39 | 2026-09-15 19:50:40 SEVERE imagepol::sigmafractotpol+ ... thrown by void casa::ImagePolarimetry::_setDoLinDoCirc(casacore::Bool&, casacore::Bool&) const at File: /source/casa6/casatools/src/code/imageanalysis/ImageAnalysis/ImagePolarimetry.cc, line: 292 |
| 15-Sep-2026 15:50:39 | test_tool_imagepol.py::po_sigmafractotpol_test::test_multibeam |
| 15-Sep-2026 15:50:39 | Test multibeam images for correct behavior |
| 15-Sep-2026 15:50:39 | PASSED |
| 15-Sep-2026 15:50:39 | |
| 15-Sep-2026 15:50:39 | 2026-09-15 19:50:40 INFO ImageFITSConverter::readBeamsTable Loading multiple beams from BEAMS table |
| 15-Sep-2026 15:50:39 | 2026-09-15 19:50:40 INFO ImagePolarimetry::sigmaLinPolInt Determined noise from Q&U images to be |
| 15-Sep-2026 15:50:39 | 2026-09-15 19:50:40 INFO ImageFITSConverter::readBeamsTable Loading multiple beams from BEAMS table |
| 15-Sep-2026 15:50:39 | 2026-09-15 19:50:40 SEVERE imagepol::sigmalinpolint Exception Reported: Exception: Input image has multiple beams and the corresponding beams for the stokes planes necessary for this computation are not equal.. |
| 15-Sep-2026 15:50:39 | 2026-09-15 19:50:40 SEVERE imagepol::sigmalinpolint+ ... thrown by casacore::Bool casa::ImagePolarimetry::_checkBeams(const std::vector<casa::ImagePolarimetry::StokesTypes>&, casacore::Bool, casacore::Bool) const at File: /source/casa6/casatools/src/code/imageanalysis/ImageAnalysis/ImagePolarimetry.cc, line: 1626 |
| 15-Sep-2026 15:50:39 | test_tool_imagepol.py::po_sigmalinpolint_test::test_multibeam |
| 15-Sep-2026 15:50:39 | Test multibeam images for correct behavior |
| 15-Sep-2026 15:50:39 | PASSED |
| 15-Sep-2026 15:50:39 | |
| 15-Sep-2026 15:50:39 | 2026-09-15 19:50:40 INFO ImageFITSConverter::readBeamsTable Loading multiple beams from BEAMS table |
| 15-Sep-2026 15:50:39 | 2026-09-15 19:50:40 INFO ImagePolarimetry::sigma Determined noise from V image to be 1.0119 |
| 15-Sep-2026 15:50:39 | 2026-09-15 19:50:40 INFO imagepol::sigmaLinPolPosAng Creating image 'g' of shape [10, 10, 10, 1] |
| 15-Sep-2026 15:50:39 | 2026-09-15 19:50:40 INFO ImageFITSConverter::readBeamsTable Loading multiple beams from BEAMS table |
| 15-Sep-2026 15:50:39 | 2026-09-15 19:50:40 SEVERE imagepol::sigmalinpolposang Exception Reported: Exception: Input image has multiple beams and the corresponding beams for the stokes planes necessary for this computation are not equal.. |
| 15-Sep-2026 15:50:39 | 2026-09-15 19:50:40 SEVERE imagepol::sigmalinpolposang+ ... thrown by casacore::Bool casa::ImagePolarimetry::_checkBeams(const std::vector<casa::ImagePolarimetry::StokesTypes>&, casacore::Bool, casacore::Bool) const at File: /source/casa6/casatools/src/code/imageanalysis/ImageAnalysis/ImagePolarimetry.cc, line: 1626 |
| 15-Sep-2026 15:50:39 | test_tool_imagepol.py::po_sigmalinpolposang_test::test_multibeam |
| 15-Sep-2026 15:50:39 | Test multibeam images for correct behavior |
| 15-Sep-2026 15:50:39 | PASSED |
| 15-Sep-2026 15:50:39 | |
| 15-Sep-2026 15:50:39 | 2026-09-15 19:50:40 INFO ImageFITSConverter::readBeamsTable Loading multiple beams from BEAMS table |
| 15-Sep-2026 15:50:39 | 2026-09-15 19:50:40 INFO ImagePolTask::_sigma Determined noise from V image to be 1.0119 |
| 15-Sep-2026 15:50:39 | 2026-09-15 19:50:40 INFO ImagePolTask::_sigma Debiasing with sigma = 1.0119 |
| 15-Sep-2026 15:50:39 | 2026-09-15 19:50:40 INFO ImageFITSConverter::readBeamsTable Loading multiple beams from BEAMS table |
| 15-Sep-2026 15:50:39 | test_tool_imagepol.py::po_totpolint_test::test_multibeam |
| 15-Sep-2026 15:50:39 | Test multibeam images for correct behavior |
| 15-Sep-2026 15:50:39 | PASSED |
| 15-Sep-2026 15:50:39 | |
| 15-Sep-2026 15:50:39 | - generated xml file: /home/casatest/casa6/casatestutils/nosedir/xml/test_tool_imagepol/nose.xml - |
| 15-Sep-2026 15:50:39 | ======================== 17 passed, 1 warning in 0.67s ========================= |
| 15-Sep-2026 15:50:39 | ============================= test session starts ============================== |
| 15-Sep-2026 15:50:39 | platform linux -- Python 3.12.9, pytest-9.1.1, pluggy-1.6.0 -- /home/casatest/venv/bin/python3.12 |
| 15-Sep-2026 15:50:39 | cachedir: .pytest_cache |
| 15-Sep-2026 15:50:39 | rootdir: /home/casatest/casa6/casatestutils/nosedir/test_tool_synthesisutils |
| 15-Sep-2026 15:50:39 | configfile: pytest.ini |
| 15-Sep-2026 15:50:40 | collecting ... collected 13 items |
| 15-Sep-2026 15:50:40 | |
| 15-Sep-2026 15:50:40 | |
| 15-Sep-2026 15:50:40 | 2026-09-15 19:50:40 INFO image::_casaQuantityFromVar Will use values specified in major, minor, pa to set beam |
| 15-Sep-2026 15:50:40 | 2026-09-15 19:50:40 INFO BeamManipulator::set Setting (global) restoring beam. |
| 15-Sep-2026 15:50:40 | 2026-09-15 19:50:40 INFO BeamManipulator::set Beam parameters: Major : 1 arcsec |
| 15-Sep-2026 15:50:40 | 2026-09-15 19:50:40 INFO BeamManipulator::set+ Minor : 1 arcsec |
| 15-Sep-2026 15:50:40 | 2026-09-15 19:50:40 INFO BeamManipulator::set+ Position Angle : 0 deg |
| 15-Sep-2026 15:50:40 | 2026-09-15 19:50:40 INFO SIImageStore::Open existing Images SumWt does not exist. Proceeding only with PSF |
| 15-Sep-2026 15:50:40 | 2026-09-15 19:50:40 INFO SynthesisUtilMethods::fitPsfBeam Fitting PSF beam for Imagestore : su_fitpsfbeam_test_mfs |
| 15-Sep-2026 15:50:40 | 2026-09-15 19:50:40 INFO SIImageStore::getPSFGaussian Time to fit Gaussian to PSF 0.004018 |
| 15-Sep-2026 15:50:40 | 2026-09-15 19:50:40 INFO SIImageStore::printBeamSet Beam : 52.9301 arcsec, 49.1474 arcsec, -87.3942 deg |
| 15-Sep-2026 15:50:40 | test_tool_synthesisutils.py::fitpsfbeam_test::test_mfs |
| 15-Sep-2026 15:50:40 | Test that fitting of mfs psf works |
| 15-Sep-2026 15:50:40 | PASSED |
| 15-Sep-2026 15:50:40 | |
| 15-Sep-2026 15:50:40 | 2026-09-15 19:50:40 INFO image::_casaQuantityFromVar Will use values specified in major, minor, pa to set beam |
| 15-Sep-2026 15:50:40 | 2026-09-15 19:50:40 INFO BeamManipulator::set Setting (global) restoring beam. |
| 15-Sep-2026 15:50:40 | 2026-09-15 19:50:40 INFO BeamManipulator::set Beam parameters: Major : 1 arcsec |
| 15-Sep-2026 15:50:40 | 2026-09-15 19:50:40 INFO BeamManipulator::set+ Minor : 1 arcsec |
| 15-Sep-2026 15:50:40 | 2026-09-15 19:50:40 INFO BeamManipulator::set+ Position Angle : 0 deg |
| 15-Sep-2026 15:50:40 | 2026-09-15 19:50:40 INFO SIImageStore::Open existing Images SumWt does not exist. Proceeding only with PSF |
| 15-Sep-2026 15:50:40 | 2026-09-15 19:50:40 INFO SynthesisUtilMethods::fitPsfBeam Fitting PSF beam for Imagestore : su_fitpsfbeam_test_mfs |
| 15-Sep-2026 15:50:40 | 2026-09-15 19:50:40 INFO SIImageStore::getPSFGaussian Time to fit Gaussian to PSF 0.004806 |
| 15-Sep-2026 15:50:40 | 2026-09-15 19:50:40 INFO SIImageStore::printBeamSet Beam : 49.8956 arcsec, 46.8024 arcsec, -88.289 deg |
| 15-Sep-2026 15:50:40 | test_tool_synthesisutils.py::fitpsfbeam_test::test_mfs_largerpsfcutoff |
| 15-Sep-2026 15:50:40 | Test that psfcutoff with a valid (larger) number works |
| 15-Sep-2026 15:50:40 | PASSED |
| 15-Sep-2026 15:50:40 | |
| 15-Sep-2026 15:50:40 | test_tool_synthesisutils.py::fitpsfbeam_test::test_mfs_wrong_nterms |
| 15-Sep-2026 15:50:40 | Test that it catches if nterms is inconsistent with input psf (nterms=2, for a single term psf) |
| 15-Sep-2026 15:50:40 | PASSED |
| 15-Sep-2026 15:50:40 | |
| 15-Sep-2026 15:50:40 | 2026-09-15 19:50:40 WARN SynthesisUtilMethods::fitPsfBeam psfcutoff must be >0 and <1 |
| 15-Sep-2026 15:50:40 | 2026-09-15 19:50:40 WARN SynthesisUtilMethods::fitPsfBeam psfcutoff must be >0 and <1 |
| 15-Sep-2026 15:50:40 | test_tool_synthesisutils.py::fitpsfbeam_test::test_mfs_wrong_psfcutoff |
| 15-Sep-2026 15:50:40 | Test that psfcutoff is given outside the allowed range (1.0) |
| 15-Sep-2026 15:50:40 | PASSED |
| 15-Sep-2026 15:50:40 | |
| 15-Sep-2026 15:50:40 | 2026-09-15 19:50:40 INFO image::_casaQuantityFromVar Will use values specified in major, minor, pa to set beam |
| 15-Sep-2026 15:50:40 | 2026-09-15 19:50:40 INFO BeamManipulator::set Setting (global) restoring beam. |
| 15-Sep-2026 15:50:40 | 2026-09-15 19:50:40 INFO BeamManipulator::set Beam parameters: Major : 1 arcsec |
| 15-Sep-2026 15:50:40 | 2026-09-15 19:50:40 INFO BeamManipulator::set+ Minor : 1 arcsec |
| 15-Sep-2026 15:50:40 | 2026-09-15 19:50:40 INFO BeamManipulator::set+ Position Angle : 0 deg |
| 15-Sep-2026 15:50:40 | 2026-09-15 19:50:40 INFO SIImageStoreMultiTerm::Open existing Images SumWt.ttx do not exist. Proceeding only with PSFs |
| 15-Sep-2026 15:50:40 | 2026-09-15 19:50:40 INFO SynthesisUtilMethods::fitPsfBeam Fitting PSF beam for Imagestore : su_fitpsfbeam_test_mtmfs |
| 15-Sep-2026 15:50:40 | 2026-09-15 19:50:40 INFO SIImageStore::getPSFGaussian Time to fit Gaussian to PSF 0.003546 |
| 15-Sep-2026 15:50:40 | 2026-09-15 19:50:40 INFO SIImageStore::printBeamSet Beam : 52.9301 arcsec, 49.1474 arcsec, -87.3942 deg |
| 15-Sep-2026 15:50:40 | test_tool_synthesisutils.py::fitpsfbeam_test::test_mtmfs_nterms2 |
| 15-Sep-2026 15:50:40 | Test that fitting of multiterm psf works |
| 15-Sep-2026 15:50:40 | 2026-09-15 19:50:40 INFO name:: No table opened. |
| 15-Sep-2026 15:50:40 | 2026-09-15 19:50:40 INFO name:: No table opened. |
| 15-Sep-2026 15:50:40 | PASSED |
| 15-Sep-2026 15:50:40 | |
| 15-Sep-2026 15:50:40 | test_tool_synthesisutils.py::getoptimumsize_test::test_default |
| 15-Sep-2026 15:50:40 | Test default size |
| 15-Sep-2026 15:50:40 | PASSED |
| 15-Sep-2026 15:50:40 | |
| 15-Sep-2026 15:50:40 | test_tool_synthesisutils.py::getoptimumsize_test::test_evenimsize |
| 15-Sep-2026 15:50:40 | Test even non-optimal number |
| 15-Sep-2026 15:50:40 | PASSED |
| 15-Sep-2026 15:50:40 | |
| 15-Sep-2026 15:50:40 | test_tool_synthesisutils.py::getoptimumsize_test::test_oddimsize |
| 15-Sep-2026 15:50:40 | Test odd non-optimal number |
| 15-Sep-2026 15:50:40 | 2026-09-15 19:50:40 INFO name:: No table opened. |
| 15-Sep-2026 15:50:40 | 2026-09-15 19:50:40 INFO name:: No table opened. |
| 15-Sep-2026 15:50:40 | PASSED |
| 15-Sep-2026 15:50:40 | |
| 15-Sep-2026 15:50:41 | 2026-09-15 19:50:41 INFO msmetadata_cmpt.cc::open Performing internal consistency checks on twhya.short.ms... |
| 15-Sep-2026 15:50:41 | 2026-09-15 19:50:41 INFO msmetadata_cmpt.cc::open Performing internal consistency checks on twhya.short.ms... |
| 15-Sep-2026 15:50:41 | test_tool_synthesisutils.py::advisechansel_test::test_advisechanelsel_datasel |
| 15-Sep-2026 15:50:41 | Test that data selection parameters or given frequency range, etc is returned correctly |
| 15-Sep-2026 15:50:41 | PASSED |
| 15-Sep-2026 15:50:41 | |
| 15-Sep-2026 15:50:43 | test_tool_synthesisutils.py::advisechansel_test::test_advisechanelsel_datasel_ephem |
| 15-Sep-2026 15:50:43 | Test that data selection parameters for given frequency range,etc for ephemeris object is returned correctly |
| 15-Sep-2026 15:50:43 | PASSED |
| 15-Sep-2026 15:50:43 | |
| 15-Sep-2026 15:50:43 | 2026-09-15 19:50:44 SEVERE No MeasurementSet has been assigned, please give a valid ms in msname |
| 15-Sep-2026 15:50:44 | test_tool_synthesisutils.py::advisechansel_test::test_su_adivsechanel_defaults |
| 15-Sep-2026 15:50:44 | Test non specified parameter case for proper error/warning message |
| 15-Sep-2026 15:50:44 | PASSED |
| 15-Sep-2026 15:50:44 | |
| 15-Sep-2026 15:50:44 | test_tool_synthesisutils.py::advisechansel_test::test_su_adivsechansel_getfreqrange |
| 15-Sep-2026 15:50:44 | Test that frequency range for given data selections is returned correctly |
| 15-Sep-2026 15:50:44 | PASSED |
| 15-Sep-2026 15:50:44 | |
| 15-Sep-2026 15:50:45 | test_tool_synthesisutils.py::advisechansel_test::test_su_advisechansel_getfreqrange_ephem |
| 15-Sep-2026 15:50:45 | Test that frequency range for given data selections for an ephemeris object is returned correctly |
| 15-Sep-2026 15:50:45 | 2026-09-15 19:50:45 INFO name:: No table opened. |
| 15-Sep-2026 15:50:45 | 2026-09-15 19:50:45 INFO name:: No table opened. |
| 15-Sep-2026 15:50:45 | PASSED |
| 15-Sep-2026 15:50:45 | |
| 15-Sep-2026 15:50:45 | - generated xml file: /home/casatest/casa6/casatestutils/nosedir/xml/test_tool_synthesisutils/nose.xml - |
| 15-Sep-2026 15:50:45 | ======================== 13 passed, 1 warning in 5.60s ========================= |
| 15-Sep-2026 15:50:45 | ============================= test session starts ============================== |
| 15-Sep-2026 15:50:45 | platform linux -- Python 3.12.9, pytest-9.1.1, pluggy-1.6.0 -- /home/casatest/venv/bin/python3.12 |
| 15-Sep-2026 15:50:45 | cachedir: .pytest_cache |
| 15-Sep-2026 15:50:45 | rootdir: /home/casatest/casa6/casatestutils/nosedir/test_tool_image_pbcor |
| 15-Sep-2026 15:50:45 | configfile: pytest.ini |
| 15-Sep-2026 15:50:46 | collecting ... collected 9 items |
| 15-Sep-2026 15:50:46 | |
| 15-Sep-2026 15:50:46 | |
| 15-Sep-2026 15:50:46 | 2026-09-15 19:50:46 INFO FITSCoordinateUtil::fromFITSHeader passing empty or nonexistant spectral Coordinate axis |
| 15-Sep-2026 15:50:46 | 2026-09-15 19:50:46 INFO FITSCoordinateUtil::fromFITSHeader passing empty or nonexistant spectral Coordinate axis |
| 15-Sep-2026 15:50:46 | 2026-09-15 19:50:46 INFO CasacRegionManager::fromBCS No directional region specified. Using full positional plane. |
| 15-Sep-2026 15:50:46 | 2026-09-15 19:50:46 INFO CasacRegionManager::fromBCS Using all spectral channels. |
| 15-Sep-2026 15:50:46 | 2026-09-15 19:50:46 INFO CasacRegionManager::fromBCS Using polarizations ALL |
| 15-Sep-2026 15:50:46 | 2026-09-15 19:50:46 INFO ImageRegion::fromRecord Selected bounding box : |
| 15-Sep-2026 15:50:46 | 2026-09-15 19:50:46 INFO ImageRegion::fromRecord+ [0, 0, 0, 0] to [112, 75, 4, 1] (00:03:44.024, -00.38.00.046, 1.415e+09Hz, I to 23:56:15.977, +00.37.00.043, 1.415e+09Hz, Q) |
| 15-Sep-2026 15:50:46 | 2026-09-15 19:50:46 INFO ImageRegion::fromRecord Selected bounding box : |
| 15-Sep-2026 15:50:46 | 2026-09-15 19:50:46 INFO ImageRegion::fromRecord+ [0, 0, 0, 0] to [112, 75, 4, 1] (00:03:44.024, -00.38.00.046, 1.415e+09Hz, I to 23:56:15.977, +00.37.00.043, 1.415e+09Hz, Q) |
| 15-Sep-2026 15:50:46 | 2026-09-15 19:50:46 INFO SubImageFactory::createImage Creating image 'mypb.im' of shape [113, 76, 5, 2] |
| 15-Sep-2026 15:50:46 | 2026-09-15 19:50:46 INFO ImageMaskAttacher::makeMask Created mask `mask0' |
| 15-Sep-2026 15:50:46 | 2026-09-15 19:50:46 INFO ImageRegion::fromRecord Selected bounding box : |
| 15-Sep-2026 15:50:46 | 2026-09-15 19:50:46 INFO ImageRegion::fromRecord+ [0, 0, 0, 0] to [112, 75, 0, 0] (00:03:44.024, -00.38.00.046, 1.415e+09Hz, I to 23:56:15.977, +00.37.00.043, 1.415e+09Hz, I) |
| 15-Sep-2026 15:50:46 | 2026-09-15 19:50:46 INFO CasacRegionManager::fromBCS No directional region specified. Using full positional plane. |
| 15-Sep-2026 15:50:46 | 2026-09-15 19:50:46 INFO CasacRegionManager::fromBCS Using all spectral channels. |
| 15-Sep-2026 15:50:46 | 2026-09-15 19:50:46 INFO CasacRegionManager::fromBCS Using polarizations ALL |
| 15-Sep-2026 15:50:46 | 2026-09-15 19:50:46 INFO ImageRegion::fromRecord Selected bounding box : |
| 15-Sep-2026 15:50:46 | 2026-09-15 19:50:46 INFO ImageRegion::fromRecord+ [0, 0, 0, 0] to [112, 75, 4, 1] (00:03:44.024, -00.38.00.046, 1.415e+09Hz, I to 23:56:15.977, +00.37.00.043, 1.415e+09Hz, Q) |
| 15-Sep-2026 15:50:46 | 2026-09-15 19:50:46 INFO ImageRegion::fromRecord Selected bounding box : |
| 15-Sep-2026 15:50:46 | 2026-09-15 19:50:46 INFO ImageRegion::fromRecord+ [0, 0, 0, 0] to [112, 75, 4, 1] (00:03:44.024, -00.38.00.046, 1.415e+09Hz, I to 23:56:15.977, +00.37.00.043, 1.415e+09Hz, Q) |
| 15-Sep-2026 15:50:46 | 2026-09-15 19:50:46 INFO SubImageFactory::createImage Creating image 'mypb.im' of shape [113, 76, 5, 2] |
| 15-Sep-2026 15:50:46 | 2026-09-15 19:50:46 INFO ImageMaskAttacher::makeMask Created mask `mask0' |
| 15-Sep-2026 15:50:46 | 2026-09-15 19:50:46 INFO name:: No table opened. |
| 15-Sep-2026 15:50:46 | 2026-09-15 19:50:46 INFO showcache:: The Table Cache is empty. |
| 15-Sep-2026 15:50:46 | test_tool_image_pbcor.py::ia_pbcor_test::test_4d_image_with_2d_pb |
| 15-Sep-2026 15:50:46 | ia.pbcor: Test full image divide with cutoff. Primary beam is 2 D, image is 4 D |
| 15-Sep-2026 15:50:46 | PASSED |
| 15-Sep-2026 15:50:46 | |
| 15-Sep-2026 15:50:46 | 2026-09-15 19:50:46 INFO SubImageFactory::createImage Creating image 'mypb.im' of shape [5, 5, 1, 1] |
| 15-Sep-2026 15:50:46 | 2026-09-15 19:50:46 INFO name:: No table opened. |
| 15-Sep-2026 15:50:46 | 2026-09-15 19:50:46 INFO showcache:: The Table Cache is empty. |
| 15-Sep-2026 15:50:46 | test_tool_image_pbcor.py::ia_pbcor_test::test_diff_spectral_coordinate |
| 15-Sep-2026 15:50:46 | Verify fix that a different spectral coordinates in target and template don't matter, CAS-5096 |
| 15-Sep-2026 15:50:46 | PASSED |
| 15-Sep-2026 15:50:46 | |
| 15-Sep-2026 15:50:46 | 2026-09-15 19:50:46 INFO ImageFactory::createImage Created Paged image 't_in.im' of shape [20, 20, 4, 20] with float valued pixels. |
| 15-Sep-2026 15:50:46 | 2026-09-15 19:50:46 INFO ImageFactory::createImage Created Paged image 't_pb_in.im' of shape [20, 20, 4, 20] with float valued pixels. |
| 15-Sep-2026 15:50:46 | 2026-09-15 19:50:46 INFO CasacRegionManager::fromBCS No directional region specified. Using full positional plane. |
| 15-Sep-2026 15:50:46 | 2026-09-15 19:50:46 INFO CasacRegionManager::fromBCS Using all spectral channels. |
| 15-Sep-2026 15:50:46 | 2026-09-15 19:50:46 INFO CasacRegionManager::fromBCS Using polarizations I |
| 15-Sep-2026 15:50:46 | 2026-09-15 19:50:46 INFO ImageRegion::fromRecord Selected bounding box : |
| 15-Sep-2026 15:50:46 | 2026-09-15 19:50:46 INFO ImageRegion::fromRecord+ [0, 0, 0, 0] to [19, 19, 0, 19] (00:00:40.000, -00.10.00.001, I, 1.41499e+09Hz to 23:59:24.000, +00.09.00.001, I, 1.41501e+09Hz) |
| 15-Sep-2026 15:50:46 | 2026-09-15 19:50:46 INFO ImageRegion::fromRecord Selected bounding box : |
| 15-Sep-2026 15:50:46 | 2026-09-15 19:50:46 INFO ImageRegion::fromRecord+ [0, 0, 0, 0] to [19, 19, 0, 19] (00:00:40.000, -00.10.00.001, I, 1.41499e+09Hz to 23:59:24.000, +00.09.00.001, I, 1.41501e+09Hz) |
| 15-Sep-2026 15:50:46 | 2026-09-15 19:50:46 INFO SubImageFactory::createImage Creating image 't_out.im' of shape [20, 20, 1, 20] |
| 15-Sep-2026 15:50:46 | 2026-09-15 19:50:46 INFO name:: No table opened. |
| 15-Sep-2026 15:50:46 | 2026-09-15 19:50:46 INFO showcache:: The Table Cache is empty. |
| 15-Sep-2026 15:50:46 | test_tool_image_pbcor.py::ia_pbcor_test::test_empty_region_and_stokes |
| 15-Sep-2026 15:50:46 | Test specifying stokes with empty region works (CAS-11708) |
| 15-Sep-2026 15:50:46 | PASSED |
| 15-Sep-2026 15:50:46 | |
| 15-Sep-2026 15:50:46 | 2026-09-15 19:50:46 SEVERE image::open (file src/tools/image/image_cmpt.cc, line 4208) Exception Reported: Exception: File name is empty. |
| 15-Sep-2026 15:50:46 | 2026-09-15 19:50:46 SEVERE image::open (file src/tools/image/image_cmpt.cc, line 4208)+ ... thrown by static void casa::ImageFactory::_checkInfile(const casacore::String&) at File: /source/casa6/casatools/src/code/imageanalysis/ImageAnalysis/ImageFactory2.cc, line: 371 |
| 15-Sep-2026 15:50:46 | 2026-09-15 19:50:46 SEVERE image::open (file src/tools/image/image_cmpt.cc, line 4208) Exception Reported: Exception: File totally_bogus does not exist.. |
| 15-Sep-2026 15:50:46 | 2026-09-15 19:50:46 SEVERE image::open (file src/tools/image/image_cmpt.cc, line 4208)+ ... thrown by static void casa::ImageFactory::_checkInfile(const casacore::String&) at File: /source/casa6/casatools/src/code/imageanalysis/ImageAnalysis/ImageFactory2.cc, line: 375 |
| 15-Sep-2026 15:50:46 | 2026-09-15 19:50:46 INFO FITSCoordinateUtil::fromFITSHeader passing empty or nonexistant spectral Coordinate axis |
| 15-Sep-2026 15:50:46 | 2026-09-15 19:50:46 SEVERE image::pbcor (file src/tools/image/image_cmpt.cc, line 4289) Exception Reported: Exception: The image filename is empty. |
| 15-Sep-2026 15:50:46 | 2026-09-15 19:50:46 SEVERE image::pbcor (file src/tools/image/image_cmpt.cc, line 4289)+ ... thrown by static void casacore::ImageUtilities::openImage(casacore::ImageInterface<T>*&, const casacore::String&) [with T = float] at File: /source/casainstall/include/casacore/images/Images/ImageUtilities2.tcc, line: 255 |
| 15-Sep-2026 15:50:46 | 2026-09-15 19:50:46 INFO FITSCoordinateUtil::fromFITSHeader passing empty or nonexistant spectral Coordinate axis |
| 15-Sep-2026 15:50:46 | 2026-09-15 19:50:46 SEVERE image::pbcor (file src/tools/image/image_cmpt.cc, line 4289) Exception Reported: Exception: File 'totally_bogus2' does not exist. |
| 15-Sep-2026 15:50:46 | 2026-09-15 19:50:46 SEVERE image::pbcor (file src/tools/image/image_cmpt.cc, line 4289)+ ... thrown by static void casacore::ImageUtilities::openImage(casacore::ImageInterface<T>*&, const casacore::String&) [with T = float] at File: /source/casainstall/include/casacore/images/Images/ImageUtilities2.tcc, line: 260 |
| 15-Sep-2026 15:50:46 | 2026-09-15 19:50:46 INFO FITSCoordinateUtil::fromFITSHeader passing empty or nonexistant spectral Coordinate axis |
| 15-Sep-2026 15:50:46 | 2026-09-15 19:50:46 INFO FITSCoordinateUtil::fromFITSHeader passing empty or nonexistant spectral Coordinate axis |
| 15-Sep-2026 15:50:46 | 2026-09-15 19:50:46 SEVERE ImageInputProcessor::_process Requested output image /bogusplace/bogusimage cannot be created so will not be written |
| 15-Sep-2026 15:50:46 | 2026-09-15 19:50:46 SEVERE image::pbcor (file src/tools/image/image_cmpt.cc, line 4289) Exception Reported: 2026-09-15 19:50:46 SEVERE ImageInputProcessor::_process Requested output image /bogusplace/bogusimage cannot be created so will not be written |
| 15-Sep-2026 15:50:46 | 2026-09-15 19:50:46 INFO FITSCoordinateUtil::fromFITSHeader passing empty or nonexistant spectral Coordinate axis |
| 15-Sep-2026 15:50:46 | 2026-09-15 19:50:46 INFO FITSCoordinateUtil::fromFITSHeader passing empty or nonexistant spectral Coordinate axis |
| 15-Sep-2026 15:50:46 | 2026-09-15 19:50:46 WARN /home/casatest/casa6/casatestutils/nosedir/test_tool_image_pbcor/pbtest1_im.fits is not a valid or readable table |
| 15-Sep-2026 15:50:46 | 2026-09-15 19:50:46 SEVERE Cannot read image /home/casatest/casa6/casatestutils/nosedir/test_tool_image_pbcor/pbtest1_im.fits to get region bogus_region |
| 15-Sep-2026 15:50:46 | 2026-09-15 19:50:46 SEVERE image::pbcor (file src/tools/image/image_cmpt.cc, line 4289) Exception Reported: Unable to open region file or region table description bogus_region in image /home/casatest/casa6/casatestutils/nosedir/test_tool_image_pbcor/pbtest1_im.fits at File: /source/casa6/casatools/src/code/imageanalysis/Regions/CasacRegionManager.cc, line: 486 |
| 15-Sep-2026 15:50:46 | 2026-09-15 19:50:46 INFO FITSCoordinateUtil::fromFITSHeader passing empty or nonexistant spectral Coordinate axis |
| 15-Sep-2026 15:50:46 | 2026-09-15 19:50:46 INFO FITSCoordinateUtil::fromFITSHeader passing empty or nonexistant spectral Coordinate axis |
| 15-Sep-2026 15:50:46 | 2026-09-15 19:50:46 SEVERE image::pbcor (file src/tools/image/image_cmpt.cc, line 4289) Exception Reported: Unknown mode zz |
| 15-Sep-2026 15:50:46 | 2026-09-15 19:50:46 INFO FITSCoordinateUtil::fromFITSHeader passing empty or nonexistant spectral Coordinate axis |
| 15-Sep-2026 15:50:46 | 2026-09-15 19:50:46 INFO FITSCoordinateUtil::fromFITSHeader passing empty or nonexistant spectral Coordinate axis |
| 15-Sep-2026 15:50:46 | 2026-09-15 19:50:46 SEVERE image::pbcor (file src/tools/image/image_cmpt.cc, line 4289) Exception Reported: Coordinate systems of image and template are different: The DirectionCoordinates have differing LinearXform components at File: /source/casa6/casatools/src/code/imageanalysis/ImageAnalysis/ImagePrimaryBeamCorrector.cc, line: 141 |
| 15-Sep-2026 15:50:46 | 2026-09-15 19:50:46 INFO name:: No table opened. |
| 15-Sep-2026 15:50:46 | 2026-09-15 19:50:46 INFO showcache:: The Table Cache is empty. |
| 15-Sep-2026 15:50:46 | test_tool_image_pbcor.py::ia_pbcor_test::test_exceptions |
| 15-Sep-2026 15:50:46 | ia.pbcor: Test various exception cases |
| 15-Sep-2026 15:50:46 | PASSED |
| 15-Sep-2026 15:50:46 | |
| 15-Sep-2026 15:50:46 | 2026-09-15 19:50:46 INFO FITSCoordinateUtil::fromFITSHeader passing empty or nonexistant spectral Coordinate axis |
| 15-Sep-2026 15:50:46 | 2026-09-15 19:50:46 INFO FITSCoordinateUtil::fromFITSHeader passing empty or nonexistant spectral Coordinate axis |
| 15-Sep-2026 15:50:46 | 2026-09-15 19:50:46 INFO FITSCoordinateUtil::fromFITSHeader passing empty or nonexistant spectral Coordinate axis |
| 15-Sep-2026 15:50:46 | 2026-09-15 19:50:46 INFO CasacRegionManager::fromBCS No directional region specified. Using full positional plane. |
| 15-Sep-2026 15:50:46 | 2026-09-15 19:50:46 INFO ImageRegion::fromRecord Selected bounding box : |
| 15-Sep-2026 15:50:46 | 2026-09-15 19:50:46 INFO ImageRegion::fromRecord+ [0, 0] to [112, 75] (00:00:29.333, -00.07.24.000 to 23:59:29.600, +00.07.36.000) |
| 15-Sep-2026 15:50:46 | 2026-09-15 19:50:46 INFO ImageRegion::fromRecord Selected bounding box : |
| 15-Sep-2026 15:50:46 | 2026-09-15 19:50:46 INFO ImageRegion::fromRecord+ [0, 0] to [112, 75] (00:00:29.333, -00.07.24.000 to 23:59:29.600, +00.07.36.000) |
| 15-Sep-2026 15:50:46 | 2026-09-15 19:50:46 INFO SubImageFactory::createImage Creating image 'mypb.im' of shape [113, 76] |
| 15-Sep-2026 15:50:46 | 2026-09-15 19:50:46 INFO FITSCoordinateUtil::fromFITSHeader passing empty or nonexistant spectral Coordinate axis |
| 15-Sep-2026 15:50:46 | 2026-09-15 19:50:46 INFO FITSCoordinateUtil::fromFITSHeader passing empty or nonexistant spectral Coordinate axis |
| 15-Sep-2026 15:50:46 | 2026-09-15 19:50:46 INFO CasacRegionManager::fromBCS No directional region specified. Using full positional plane. |
| 15-Sep-2026 15:50:46 | 2026-09-15 19:50:46 INFO ImageRegion::fromRecord Selected bounding box : |
| 15-Sep-2026 15:50:46 | 2026-09-15 19:50:46 INFO ImageRegion::fromRecord+ [0, 0] to [112, 75] (00:00:29.333, -00.07.24.000 to 23:59:29.600, +00.07.36.000) |
| 15-Sep-2026 15:50:46 | 2026-09-15 19:50:46 INFO ImageRegion::fromRecord Selected bounding box : |
| 15-Sep-2026 15:50:46 | 2026-09-15 19:50:46 INFO ImageRegion::fromRecord+ [0, 0] to [112, 75] (00:00:29.333, -00.07.24.000 to 23:59:29.600, +00.07.36.000) |
| 15-Sep-2026 15:50:46 | 2026-09-15 19:50:46 INFO SubImageFactory::createImage Creating image 'mypb.im' of shape [113, 76] |
| 15-Sep-2026 15:50:46 | 2026-09-15 19:50:46 INFO FITSCoordinateUtil::fromFITSHeader passing empty or nonexistant spectral Coordinate axis |
| 15-Sep-2026 15:50:46 | 2026-09-15 19:50:46 INFO name:: No table opened. |
| 15-Sep-2026 15:50:46 | 2026-09-15 19:50:46 INFO showcache:: The Table Cache is empty. |
| 15-Sep-2026 15:50:46 | test_tool_image_pbcor.py::ia_pbcor_test::test_full_image_divide |
| 15-Sep-2026 15:50:46 | ia.pbcor: Test full image divide |
| 15-Sep-2026 15:50:46 | PASSED |
| 15-Sep-2026 15:50:46 | |
| 15-Sep-2026 15:50:46 | 2026-09-15 19:50:46 INFO FITSCoordinateUtil::fromFITSHeader passing empty or nonexistant spectral Coordinate axis |
| 15-Sep-2026 15:50:46 | 2026-09-15 19:50:46 INFO FITSCoordinateUtil::fromFITSHeader passing empty or nonexistant spectral Coordinate axis |
| 15-Sep-2026 15:50:46 | 2026-09-15 19:50:46 INFO FITSCoordinateUtil::fromFITSHeader passing empty or nonexistant spectral Coordinate axis |
| 15-Sep-2026 15:50:46 | 2026-09-15 19:50:46 INFO CasacRegionManager::fromBCS No directional region specified. Using full positional plane. |
| 15-Sep-2026 15:50:46 | 2026-09-15 19:50:46 INFO ImageRegion::fromRecord Selected bounding box : |
| 15-Sep-2026 15:50:46 | 2026-09-15 19:50:46 INFO ImageRegion::fromRecord+ [0, 0] to [112, 75] (00:00:29.333, -00.07.24.000 to 23:59:29.600, +00.07.36.000) |
| 15-Sep-2026 15:50:46 | 2026-09-15 19:50:46 INFO ImageRegion::fromRecord Selected bounding box : |
| 15-Sep-2026 15:50:46 | 2026-09-15 19:50:46 INFO ImageRegion::fromRecord+ [0, 0] to [112, 75] (00:00:29.333, -00.07.24.000 to 23:59:29.600, +00.07.36.000) |
| 15-Sep-2026 15:50:46 | 2026-09-15 19:50:46 INFO SubImageFactory::createImage Creating image 'mypb.im' of shape [113, 76] |
| 15-Sep-2026 15:50:46 | 2026-09-15 19:50:46 INFO ImageMaskAttacher::makeMask Created mask `mask0' |
| 15-Sep-2026 15:50:46 | 2026-09-15 19:50:46 INFO FITSCoordinateUtil::fromFITSHeader passing empty or nonexistant spectral Coordinate axis |
| 15-Sep-2026 15:50:46 | 2026-09-15 19:50:46 INFO CasacRegionManager::fromBCS No directional region specified. Using full positional plane. |
| 15-Sep-2026 15:50:46 | 2026-09-15 19:50:46 INFO ImageRegion::fromRecord Selected bounding box : |
| 15-Sep-2026 15:50:46 | 2026-09-15 19:50:46 INFO ImageRegion::fromRecord+ [0, 0] to [112, 75] (00:00:29.333, -00.07.24.000 to 23:59:29.600, +00.07.36.000) |
| 15-Sep-2026 15:50:46 | 2026-09-15 19:50:46 INFO ImageRegion::fromRecord Selected bounding box : |
| 15-Sep-2026 15:50:46 | 2026-09-15 19:50:46 INFO ImageRegion::fromRecord+ [0, 0] to [112, 75] (00:00:29.333, -00.07.24.000 to 23:59:29.600, +00.07.36.000) |
| 15-Sep-2026 15:50:46 | 2026-09-15 19:50:46 INFO SubImageFactory::createImage Creating image 'mypb.im' of shape [113, 76] |
| 15-Sep-2026 15:50:46 | 2026-09-15 19:50:46 INFO ImageMaskAttacher::makeMask Created mask `mask0' |
| 15-Sep-2026 15:50:46 | 2026-09-15 19:50:46 INFO name:: No table opened. |
| 15-Sep-2026 15:50:46 | 2026-09-15 19:50:46 INFO showcache:: The Table Cache is empty. |
| 15-Sep-2026 15:50:46 | test_tool_image_pbcor.py::ia_pbcor_test::test_full_image_using_cutoff |
| 15-Sep-2026 15:50:46 | ia.pbcor: Test full image divide with cutoff |
| 15-Sep-2026 15:50:46 | PASSED |
| 15-Sep-2026 15:50:46 | |
| 15-Sep-2026 15:50:46 | 2026-09-15 19:50:46 INFO ImageFactory::createImage Created Paged image 'zz.im' of shape [20, 20] with float valued pixels. |
| 15-Sep-2026 15:50:46 | 2026-09-15 19:50:46 INFO SubImageFactory::createImage Creating image 'pb_out.im' of shape [20, 20] |
| 15-Sep-2026 15:50:46 | 2026-09-15 19:50:46 INFO ::::ImageFactory::createImage Created Paged image 'zz.im' of shape [20, 20] with float valued pixels. |
| 15-Sep-2026 15:50:46 | 2026-09-15 19:50:46 INFO ::::image::fromshape Ran ia.fromshape |
| 15-Sep-2026 15:50:46 | 2026-09-15 19:50:46 INFO ::::image::fromshape ia.fromshape(outfile="zz.im", shape=[20,20], csys={...}, linear=false, overwrite=false, log=true, type="f") |
| 15-Sep-2026 15:50:46 | 2026-09-15 19:50:46 INFO ::::image::pbcor Ran ia.pbcor |
| 15-Sep-2026 15:50:46 | 2026-09-15 19:50:46 INFO ::::image::pbcor ia.pbcor(pbimage="(...)", outfile="pb_out.im", overwrite=false, box="", region={...}, chans="", stokes="", mask="", mode="divide", cutoff=-1.000000, stretch=false) |
| 15-Sep-2026 15:50:46 | 2026-09-15 19:50:46 INFO name:: No table opened. |
| 15-Sep-2026 15:50:46 | 2026-09-15 19:50:46 INFO showcache:: The Table Cache is empty. |
| 15-Sep-2026 15:50:46 | test_tool_image_pbcor.py::ia_pbcor_test::test_history |
| 15-Sep-2026 15:50:46 | Test history records are written |
| 15-Sep-2026 15:50:46 | PASSED |
| 15-Sep-2026 15:50:46 | |
| 15-Sep-2026 15:50:46 | 2026-09-15 19:50:46 INFO FITSCoordinateUtil::fromFITSHeader passing empty or nonexistant spectral Coordinate axis |
| 15-Sep-2026 15:50:46 | 2026-09-15 19:50:46 INFO ImageFactory::createImage Created Paged image 'mult_pb.im' of shape [113, 76] with float valued pixels. |
| 15-Sep-2026 15:50:46 | 2026-09-15 19:50:46 INFO CasacRegionManager::fromBCS No directional region specified. Using full positional plane. |
| 15-Sep-2026 15:50:46 | 2026-09-15 19:50:46 INFO CasacRegionManager::fromBCS Using all spectral channels. |
| 15-Sep-2026 15:50:46 | 2026-09-15 19:50:46 INFO CasacRegionManager::fromBCS Using polarizations ALL |
| 15-Sep-2026 15:50:46 | 2026-09-15 19:50:46 INFO ImageRegion::fromRecord Selected bounding box : |
| 15-Sep-2026 15:50:46 | 2026-09-15 19:50:46 INFO ImageRegion::fromRecord+ [0, 0, 0, 0] to [112, 75, 4, 1] (00:03:44.024, -00.38.00.046, 1.415e+09Hz, I to 23:56:15.977, +00.37.00.043, 1.415e+09Hz, Q) |
| 15-Sep-2026 15:50:46 | 2026-09-15 19:50:46 INFO ImageRegion::fromRecord Selected bounding box : |
| 15-Sep-2026 15:50:46 | 2026-09-15 19:50:46 INFO ImageRegion::fromRecord+ [0, 0, 0, 0] to [112, 75, 4, 1] (00:03:44.024, -00.38.00.046, 1.415e+09Hz, I to 23:56:15.977, +00.37.00.043, 1.415e+09Hz, Q) |
| 15-Sep-2026 15:50:46 | 2026-09-15 19:50:46 INFO SubImageFactory::createImage Creating image 'mypb.im' of shape [113, 76, 5, 2] |
| 15-Sep-2026 15:50:46 | 2026-09-15 19:50:46 INFO ImageMaskAttacher::makeMask Created mask `mask0' |
| 15-Sep-2026 15:50:46 | 2026-09-15 19:50:46 INFO ImageRegion::fromRecord Selected bounding box : |
| 15-Sep-2026 15:50:46 | 2026-09-15 19:50:46 INFO ImageRegion::fromRecord+ [0, 0, 0, 0] to [112, 75, 0, 0] (00:03:44.024, -00.38.00.046, 1.415e+09Hz, I to 23:56:15.977, +00.37.00.043, 1.415e+09Hz, I) |
| 15-Sep-2026 15:50:46 | 2026-09-15 19:50:46 INFO CasacRegionManager::fromBCS No directional region specified. Using full positional plane. |
| 15-Sep-2026 15:50:46 | 2026-09-15 19:50:46 INFO CasacRegionManager::fromBCS Using all spectral channels. |
| 15-Sep-2026 15:50:46 | 2026-09-15 19:50:46 INFO CasacRegionManager::fromBCS Using polarizations ALL |
| 15-Sep-2026 15:50:46 | 2026-09-15 19:50:46 INFO ImageRegion::fromRecord Selected bounding box : |
| 15-Sep-2026 15:50:46 | 2026-09-15 19:50:46 INFO ImageRegion::fromRecord+ [0, 0, 0, 0] to [112, 75, 4, 1] (00:03:44.024, -00.38.00.046, 1.415e+09Hz, I to 23:56:15.977, +00.37.00.043, 1.415e+09Hz, Q) |
| 15-Sep-2026 15:50:46 | 2026-09-15 19:50:46 INFO ImageRegion::fromRecord Selected bounding box : |
| 15-Sep-2026 15:50:46 | 2026-09-15 19:50:46 INFO ImageRegion::fromRecord+ [0, 0, 0, 0] to [112, 75, 4, 1] (00:03:44.024, -00.38.00.046, 1.415e+09Hz, I to 23:56:15.977, +00.37.00.043, 1.415e+09Hz, Q) |
| 15-Sep-2026 15:50:46 | 2026-09-15 19:50:46 INFO SubImageFactory::createImage Creating image 'mypb.im' of shape [113, 76, 5, 2] |
| 15-Sep-2026 15:50:46 | 2026-09-15 19:50:46 INFO ImageMaskAttacher::makeMask Created mask `mask0' |
| 15-Sep-2026 15:50:46 | 2026-09-15 19:50:46 INFO name:: No table opened. |
| 15-Sep-2026 15:50:46 | 2026-09-15 19:50:46 INFO showcache:: The Table Cache is empty. |
| 15-Sep-2026 15:50:46 | test_tool_image_pbcor.py::ia_pbcor_test::test_multiply |
| 15-Sep-2026 15:50:46 | ia.pbcor: Test full image multiply with cutoff. Primary beam is 2 D, image is 4 D |
| 15-Sep-2026 15:50:46 | PASSED |
| 15-Sep-2026 15:50:46 | |
| 15-Sep-2026 15:50:46 | 2026-09-15 19:50:46 INFO ImageFactory::createImage Created Temp image of shape [113, 76, 1, 1] with float valued pixels. |
| 15-Sep-2026 15:50:46 | 2026-09-15 19:50:46 INFO SubImageFactory::createImage Creating image 'maskim' of shape [113, 76, 1, 1] |
| 15-Sep-2026 15:50:46 | 2026-09-15 19:50:46 INFO FITSCoordinateUtil::fromFITSHeader passing empty or nonexistant spectral Coordinate axis |
| 15-Sep-2026 15:50:46 | 2026-09-15 19:50:46 SEVERE image::pbcor (file src/tools/image/image_cmpt.cc, line 4289) Exception Reported: The input image shape ([113, 76, 5, 2]) and mask shape ([113, 76, 1, 1]) are different, and it was specified that the mask should not be extended, so the mask cannot be applied to the (sub)image. Specifying that the mask should be extended may resolve the issue at File: /source/casainstall/include/casacpp/imageanalysis/ImageAnalysis/SubImageFactory.tcc, line: 306 |
| 15-Sep-2026 15:50:46 | 2026-09-15 19:50:46 WARN image::open (file src/tools/image/image_cmpt.cc, line 4208) Another image is already open, closing first |
| 15-Sep-2026 15:50:46 | 2026-09-15 19:50:46 INFO FITSCoordinateUtil::fromFITSHeader passing empty or nonexistant spectral Coordinate axis |
| 15-Sep-2026 15:50:46 | 2026-09-15 19:50:46 INFO SubImageFactory::createImage Creating image 'blahblah' of shape [113, 76, 5, 2] |
| 15-Sep-2026 15:50:46 | 2026-09-15 19:50:46 INFO ImageMaskAttacher::makeMask Created mask `mask0' |
| 15-Sep-2026 15:50:46 | 2026-09-15 19:50:46 INFO name:: No table opened. |
| 15-Sep-2026 15:50:46 | 2026-09-15 19:50:46 INFO showcache:: The Table Cache is empty. |
| 15-Sep-2026 15:50:46 | test_tool_image_pbcor.py::ia_pbcor_test::test_stretch |
| 15-Sep-2026 15:50:46 | ia.pbcor(): Test stretch parameter |
| 15-Sep-2026 15:50:46 | PASSED |
| 15-Sep-2026 15:50:46 | |
| 15-Sep-2026 15:50:46 | - generated xml file: /home/casatest/casa6/casatestutils/nosedir/xml/test_tool_image_pbcor/nose.xml - |
| 15-Sep-2026 15:50:46 | ========================= 9 passed, 1 warning in 0.77s ========================= |
| 15-Sep-2026 15:50:46 | |
| 15-Sep-2026 15:50:46 | |
| 15-Sep-2026 15:50:46 | Setting Working Directory: /home/casatest/casa6/casatestutils/nosedir/test_tool_ms_createmultims/ |
| 15-Sep-2026 15:50:46 | Test Directory: /home/casatest/casa6/casatestutils/nosedir/test_tool_ms_createmultims |
| 15-Sep-2026 15:50:46 | |
| 15-Sep-2026 15:50:46 | Running Command: pytest --junitxml=/home/casatest/casa6/casatestutils/nosedir/xml/test_tool_ms_createmultims/nose.xml -s --disable-pytest-warnings --verbose -ra --tb=short /home/casatest/casa6/casatestutils/nosedir/test_tool_ms_createmultims/ |
| 15-Sep-2026 15:50:46 | |
| 15-Sep-2026 15:50:46 | Setting Working Directory: /home/casatest/casa6/casatestutils/nosedir/test_tool_componentlist/ |
| 15-Sep-2026 15:50:46 | Test Directory: /home/casatest/casa6/casatestutils/nosedir/test_tool_componentlist |
| 15-Sep-2026 15:50:46 | |
| 15-Sep-2026 15:50:46 | Running Command: pytest --junitxml=/home/casatest/casa6/casatestutils/nosedir/xml/test_tool_componentlist/nose.xml -s --disable-pytest-warnings --verbose -ra --tb=short /home/casatest/casa6/casatestutils/nosedir/test_tool_componentlist/ |
| 15-Sep-2026 15:50:46 | |
| 15-Sep-2026 15:50:46 | Setting Working Directory: /home/casatest/casa6/casatestutils/nosedir/test_tool_quanta/ |
| 15-Sep-2026 15:50:46 | Test Directory: /home/casatest/casa6/casatestutils/nosedir/test_tool_quanta |
| 15-Sep-2026 15:50:46 | |
| 15-Sep-2026 15:50:46 | Running Command: pytest --junitxml=/home/casatest/casa6/casatestutils/nosedir/xml/test_tool_quanta/nose.xml -s --disable-pytest-warnings --verbose -ra --tb=short /home/casatest/casa6/casatestutils/nosedir/test_tool_quanta/ |
| 15-Sep-2026 15:50:46 | |
| 15-Sep-2026 15:50:46 | Setting Working Directory: /home/casatest/casa6/casatestutils/nosedir/test_tool_ms/ |
| 15-Sep-2026 15:50:46 | Test Directory: /home/casatest/casa6/casatestutils/nosedir/test_tool_ms |
| 15-Sep-2026 15:50:46 | |
| 15-Sep-2026 15:50:46 | Running Command: pytest --junitxml=/home/casatest/casa6/casatestutils/nosedir/xml/test_tool_ms/nose.xml -s --disable-pytest-warnings --verbose -ra --tb=short /home/casatest/casa6/casatestutils/nosedir/test_tool_ms/ |
| 15-Sep-2026 15:50:46 | |
| 15-Sep-2026 15:50:46 | Setting Working Directory: /home/casatest/casa6/casatestutils/nosedir/test_tool_vpmanager/ |
| 15-Sep-2026 15:50:46 | Test Directory: /home/casatest/casa6/casatestutils/nosedir/test_tool_vpmanager |
| 15-Sep-2026 15:50:46 | |
| 15-Sep-2026 15:50:46 | Running Command: pytest --junitxml=/home/casatest/casa6/casatestutils/nosedir/xml/test_tool_vpmanager/nose.xml -s --disable-pytest-warnings --verbose -ra --tb=short /home/casatest/casa6/casatestutils/nosedir/test_tool_vpmanager/ |
| 15-Sep-2026 15:50:46 | |
| 15-Sep-2026 15:50:46 | Setting Working Directory: /home/casatest/casa6/casatestutils/nosedir/test_tool_image_subimage/ |
| 15-Sep-2026 15:50:46 | Test Directory: /home/casatest/casa6/casatestutils/nosedir/test_tool_image_subimage |
| 15-Sep-2026 15:50:46 | |
| 15-Sep-2026 15:50:46 | Running Command: pytest --junitxml=/home/casatest/casa6/casatestutils/nosedir/xml/test_tool_image_subimage/nose.xml -s --disable-pytest-warnings --verbose -ra --tb=short /home/casatest/casa6/casatestutils/nosedir/test_tool_image_subimage/ |
| 15-Sep-2026 15:50:46 | |
| 15-Sep-2026 15:50:46 | Setting Working Directory: /home/casatest/casa6/casatestutils/nosedir/test_tool_image_transpose/ |
| 15-Sep-2026 15:50:46 | Test Directory: /home/casatest/casa6/casatestutils/nosedir/test_tool_image_transpose |
| 15-Sep-2026 15:50:46 | |
| 15-Sep-2026 15:50:46 | Running Command: pytest --junitxml=/home/casatest/casa6/casatestutils/nosedir/xml/test_tool_image_transpose/nose.xml -s --disable-pytest-warnings --verbose -ra --tb=short /home/casatest/casa6/casatestutils/nosedir/test_tool_image_transpose/ |
| 15-Sep-2026 15:50:46 | |
| 15-Sep-2026 15:50:46 | Setting Working Directory: /home/casatest/casa6/casatestutils/nosedir/test_tool_image/ |
| 15-Sep-2026 15:50:46 | Test Directory: /home/casatest/casa6/casatestutils/nosedir/test_tool_image |
| 15-Sep-2026 15:50:46 | |
| 15-Sep-2026 15:50:46 | Running Command: pytest --junitxml=/home/casatest/casa6/casatestutils/nosedir/xml/test_tool_image/nose.xml -s --disable-pytest-warnings --verbose -ra --tb=short /home/casatest/casa6/casatestutils/nosedir/test_tool_image/ |
| 15-Sep-2026 15:50:46 | |
| 15-Sep-2026 15:50:46 | Setting Working Directory: /home/casatest/casa6/casatestutils/nosedir/test_tool_coordsys/ |
| 15-Sep-2026 15:50:46 | Test Directory: /home/casatest/casa6/casatestutils/nosedir/test_tool_coordsys |
| 15-Sep-2026 15:50:46 | |
| 15-Sep-2026 15:50:46 | Running Command: pytest --junitxml=/home/casatest/casa6/casatestutils/nosedir/xml/test_tool_coordsys/nose.xml -s --disable-pytest-warnings --verbose -ra --tb=short /home/casatest/casa6/casatestutils/nosedir/test_tool_coordsys/ |
| 15-Sep-2026 15:50:46 | |
| 15-Sep-2026 15:50:46 | Setting Working Directory: /home/casatest/casa6/casatestutils/nosedir/test_tool_regionmanager/ |
| 15-Sep-2026 15:50:46 | Test Directory: /home/casatest/casa6/casatestutils/nosedir/test_tool_regionmanager |
| 15-Sep-2026 15:50:46 | |
| 15-Sep-2026 15:50:46 | Running Command: pytest --junitxml=/home/casatest/casa6/casatestutils/nosedir/xml/test_tool_regionmanager/nose.xml -s --disable-pytest-warnings --verbose -ra --tb=short /home/casatest/casa6/casatestutils/nosedir/test_tool_regionmanager/ |
| 15-Sep-2026 15:50:46 | |
| 15-Sep-2026 15:50:46 | Setting Working Directory: /home/casatest/casa6/casatestutils/nosedir/test_tool_linearmosaic/ |
| 15-Sep-2026 15:50:46 | Test Directory: /home/casatest/casa6/casatestutils/nosedir/test_tool_linearmosaic |
| 15-Sep-2026 15:50:46 | |
| 15-Sep-2026 15:50:46 | Running Command: pytest --junitxml=/home/casatest/casa6/casatestutils/nosedir/xml/test_tool_linearmosaic/nose.xml -s --disable-pytest-warnings --verbose -ra --tb=short /home/casatest/casa6/casatestutils/nosedir/test_tool_linearmosaic/ |
| 15-Sep-2026 15:50:46 | |
| 15-Sep-2026 15:50:46 | Setting Working Directory: /home/casatest/casa6/casatestutils/nosedir/test_tool_simulator/ |
| 15-Sep-2026 15:50:46 | Test Directory: /home/casatest/casa6/casatestutils/nosedir/test_tool_simulator |
| 15-Sep-2026 15:50:46 | |
| 15-Sep-2026 15:50:46 | Running Command: pytest --junitxml=/home/casatest/casa6/casatestutils/nosedir/xml/test_tool_simulator/nose.xml -s --disable-pytest-warnings --verbose -ra --tb=short /home/casatest/casa6/casatestutils/nosedir/test_tool_simulator/ |
| 15-Sep-2026 15:50:46 | |
| 15-Sep-2026 15:50:46 | Setting Working Directory: /home/casatest/casa6/casatestutils/nosedir/test_tool_agentflagger/ |
| 15-Sep-2026 15:50:46 | Test Directory: /home/casatest/casa6/casatestutils/nosedir/test_tool_agentflagger |
| 15-Sep-2026 15:50:46 | |
| 15-Sep-2026 15:50:46 | Running Command: pytest --junitxml=/home/casatest/casa6/casatestutils/nosedir/xml/test_tool_agentflagger/nose.xml -s --disable-pytest-warnings --verbose -ra --tb=short /home/casatest/casa6/casatestutils/nosedir/test_tool_agentflagger/ |
| 15-Sep-2026 15:50:46 | |
| 15-Sep-2026 15:50:46 | Setting Working Directory: /home/casatest/casa6/casatestutils/nosedir/test_tool_sdm/ |
| 15-Sep-2026 15:50:46 | Test Directory: /home/casatest/casa6/casatestutils/nosedir/test_tool_sdm |
| 15-Sep-2026 15:50:46 | |
| 15-Sep-2026 15:50:46 | Running Command: pytest --junitxml=/home/casatest/casa6/casatestutils/nosedir/xml/test_tool_sdm/nose.xml -s --disable-pytest-warnings --verbose -ra --tb=short /home/casatest/casa6/casatestutils/nosedir/test_tool_sdm/ |
| 15-Sep-2026 15:50:46 | |
| 15-Sep-2026 15:50:46 | Setting Working Directory: /home/casatest/casa6/casatestutils/nosedir/test_tool_image_collapse/ |
| 15-Sep-2026 15:50:46 | Test Directory: /home/casatest/casa6/casatestutils/nosedir/test_tool_image_collapse |
| 15-Sep-2026 15:50:46 | |
| 15-Sep-2026 15:50:46 | Running Command: pytest --junitxml=/home/casatest/casa6/casatestutils/nosedir/xml/test_tool_image_collapse/nose.xml -s --disable-pytest-warnings --verbose -ra --tb=short /home/casatest/casa6/casatestutils/nosedir/test_tool_image_collapse/ |
| 15-Sep-2026 15:50:46 | |
| 15-Sep-2026 15:50:46 | Setting Working Directory: /home/casatest/casa6/casatestutils/nosedir/test_tool_imagepol/ |
| 15-Sep-2026 15:50:46 | Test Directory: /home/casatest/casa6/casatestutils/nosedir/test_tool_imagepol |
| 15-Sep-2026 15:50:46 | |
| 15-Sep-2026 15:50:46 | Running Command: pytest --junitxml=/home/casatest/casa6/casatestutils/nosedir/xml/test_tool_imagepol/nose.xml -s --disable-pytest-warnings --verbose -ra --tb=short /home/casatest/casa6/casatestutils/nosedir/test_tool_imagepol/ |
| 15-Sep-2026 15:50:46 | |
| 15-Sep-2026 15:50:46 | Setting Working Directory: /home/casatest/casa6/casatestutils/nosedir/test_tool_synthesisutils/ |
| 15-Sep-2026 15:50:46 | Test Directory: /home/casatest/casa6/casatestutils/nosedir/test_tool_synthesisutils |
| 15-Sep-2026 15:50:46 | |
| 15-Sep-2026 15:50:46 | Running Command: pytest --junitxml=/home/casatest/casa6/casatestutils/nosedir/xml/test_tool_synthesisutils/nose.xml -s --disable-pytest-warnings --verbose -ra --tb=short /home/casatest/casa6/casatestutils/nosedir/test_tool_synthesisutils/ |
| 15-Sep-2026 15:50:46 | |
| 15-Sep-2026 15:50:46 | Setting Working Directory: /home/casatest/casa6/casatestutils/nosedir/test_tool_image_pbcor/ |
| 15-Sep-2026 15:50:46 | Test Directory: /home/casatest/casa6/casatestutils/nosedir/test_tool_image_pbcor |
| 15-Sep-2026 15:50:46 | |
| 15-Sep-2026 15:50:46 | Running Command: pytest --junitxml=/home/casatest/casa6/casatestutils/nosedir/xml/test_tool_image_pbcor/nose.xml -s --disable-pytest-warnings --verbose -ra --tb=short /home/casatest/casa6/casatestutils/nosedir/test_tool_image_pbcor/ |
| 15-Sep-2026 15:50:46 | total 77816 |
| 15-Sep-2026 15:50:46 | -rw-r--r-- 1 casaci 15001 161131 Sep 15 19:38 casatestutils-6.7.7.7a14812.dev4-py3-none-any.whl |
| 15-Sep-2026 15:50:46 | -rw-r--r-- 1 casaci 15001 79350410 Sep 15 19:38 casatools-6.7.7.7a14812.dev4-cp312-cp312-manylinux_2_28_x86_64.whl |
| 15-Sep-2026 15:50:46 | -rw-r--r-- 1 casaci root 4340 Sep 15 19:50 test_tool_agentflagger.xml |
| 15-Sep-2026 15:50:46 | -rw-r--r-- 1 casaci root 1006 Sep 15 19:50 test_tool_calanalysis.xml |
| 15-Sep-2026 15:50:46 | -rw-r--r-- 1 casaci root 2667 Sep 15 19:50 test_tool_calibrater.xml |
| 15-Sep-2026 15:50:46 | -rw-r--r-- 1 casaci root 687 Sep 15 19:50 test_tool_componentlist.xml |
| 15-Sep-2026 15:50:46 | -rw-r--r-- 1 casaci root 7467 Sep 15 19:50 test_tool_coordsys.xml |
| 15-Sep-2026 15:50:46 | -rw-r--r-- 1 casaci root 12935 Sep 15 19:50 test_tool_image.xml |
| 15-Sep-2026 15:50:46 | -rw-r--r-- 1 casaci root 2220 Sep 15 19:50 test_tool_image_collapse.xml |
| 15-Sep-2026 15:50:46 | -rw-r--r-- 1 casaci root 1048 Sep 15 19:50 test_tool_image_deviation.xml |
| 15-Sep-2026 15:50:46 | -rw-r--r-- 1 casaci root 2574 Sep 15 19:50 test_tool_image_fitprofile.xml |
| 15-Sep-2026 15:50:46 | -rw-r--r-- 1 casaci root 1178 Sep 15 19:50 test_tool_image_pbcor.xml |
| 15-Sep-2026 15:50:46 | -rw-r--r-- 1 casaci root 883 Sep 15 19:50 test_tool_image_pv.xml |
| 15-Sep-2026 15:50:46 | -rw-r--r-- 1 casaci root 1006 Sep 15 19:50 test_tool_image_rebin.xml |
| 15-Sep-2026 15:50:46 | -rw-r--r-- 1 casaci root 1336 Sep 15 19:50 test_tool_image_regrid.xml |
| 15-Sep-2026 15:50:46 | -rw-r--r-- 1 casaci root 1639 Sep 15 19:50 test_tool_image_statistics.xml |
| 15-Sep-2026 15:50:46 | -rw-r--r-- 1 casaci root 765 Sep 15 19:50 test_tool_image_subimage.xml |
| 15-Sep-2026 15:50:46 | -rw-r--r-- 1 casaci root 890 Sep 15 19:50 test_tool_image_transpose.xml |
| 15-Sep-2026 15:50:46 | -rw-r--r-- 1 casaci root 1966 Sep 15 19:50 test_tool_imagepol.xml |
| 15-Sep-2026 15:50:46 | -rw-r--r-- 1 casaci root 838 Sep 15 19:50 test_tool_linearmosaic.xml |
| 15-Sep-2026 15:50:46 | -rw-r--r-- 1 casaci root 669 Sep 15 19:50 test_tool_logsink.xml |
| 15-Sep-2026 15:50:46 | -rw-r--r-- 1 casaci root 549 Sep 15 19:50 test_tool_measures.xml |
| 15-Sep-2026 15:50:46 | -rw-r--r-- 1 casaci root 5224 Sep 15 19:50 test_tool_ms.xml |
| 15-Sep-2026 15:50:46 | -rw-r--r-- 1 casaci root 367 Sep 15 19:50 test_tool_ms_createmultims.xml |
| 15-Sep-2026 15:50:46 | -rw-r--r-- 1 casaci root 2099 Sep 15 19:50 test_tool_ms_statwt.xml |
| 15-Sep-2026 15:50:46 | -rw-r--r-- 1 casaci root 8633 Sep 15 19:50 test_tool_msmetadata.xml |
| 15-Sep-2026 15:50:46 | -rw-r--r-- 1 casaci root 359 Sep 15 19:50 test_tool_msuvbinner.xml |
| 15-Sep-2026 15:50:46 | -rw-r--r-- 1 casaci root 1171 Sep 15 19:50 test_tool_quanta.xml |
| 15-Sep-2026 15:50:46 | -rw-r--r-- 1 casaci root 3975 Sep 15 19:50 test_tool_regionmanager.xml |
| 15-Sep-2026 15:50:46 | -rw-r--r-- 1 casaci root 2071 Sep 15 19:50 test_tool_sdm.xml |
| 15-Sep-2026 15:50:46 | -rw-r--r-- 1 casaci root 2190 Sep 15 19:50 test_tool_sdm_toms.xml |
| 15-Sep-2026 15:50:46 | -rw-r--r-- 1 casaci root 670 Sep 15 19:50 test_tool_simulator.xml |
| 15-Sep-2026 15:50:46 | -rw-r--r-- 1 casaci root 1716 Sep 15 19:50 test_tool_synthesisutils.xml |
| 15-Sep-2026 15:50:46 | -rw-r--r-- 1 casaci root 1462 Sep 15 19:50 test_tool_table.xml |
| 15-Sep-2026 15:50:46 | -rw-r--r-- 1 casaci root 1717 Sep 15 19:50 test_tool_vpmanager.xml |
| 15-Sep-2026 15:50:46 | Finished task 'Test wheel' with result: Success |
| 15-Sep-2026 15:50:46 | Substituting variable: ${bamboo.agentId} with 153550854 |
| 15-Sep-2026 15:50:46 | Substituting variable: ${bamboo.agentId} with 153550854 |
| 15-Sep-2026 15:50:46 | Substituting variable: ${bamboo.agentId} with 153550854 |
| 15-Sep-2026 15:50:46 | Substituting variable: ${bamboo.agentId} with 153550854 |
| 15-Sep-2026 15:50:46 | Starting task 'Tar work directory' of type 'com.atlassian.bamboo.plugins.scripttask:task.builder.script' |
| 15-Sep-2026 15:50:46 | Beginning to execute external process for build 'CASASPECS - Dev Test 3.12 - CAS-14812 - Test Tools Many Linux 2.28 Py3.12 #5 (CASASPECS-DEVTESTPY312118-TTOMLPY312-5)' ... running command line: /opt/ci_workspace/casa/bamboo/agent6/temp/CASASPECS-DEVTESTPY312118-TTOMLPY312-5-ScriptBuildTask-15989732866674536278.sh ... in: /opt/ci_workspace/casa/bamboo/agent6/xml-data/build-dir/CASASPECS-DEVTESTPY312118-TTOMLPY312 |
| 15-Sep-2026 15:50:46 | Package working directory |
| 15-Sep-2026 15:50:46 | nosedir/ |
| 15-Sep-2026 15:50:46 | nosedir/test_tool_image_pv/ |
| 15-Sep-2026 15:50:46 | nosedir/test_tool_image_pv/test_tool_image_pv.py |
| 15-Sep-2026 15:50:46 | nosedir/test_tool_image_pv/conftest.py |
| 15-Sep-2026 15:50:46 | nosedir/test_tool_image_pv/casa-20260915-193955.log |
| 15-Sep-2026 15:50:46 | nosedir/test_tool_image_pv/short_summary.log |
| 15-Sep-2026 15:50:46 | nosedir/xml/ |
| 15-Sep-2026 15:50:46 | nosedir/xml/test_tool_image_pv/ |
| 15-Sep-2026 15:50:46 | nosedir/xml/test_tool_image_pv/nose.xml |
| 15-Sep-2026 15:50:46 | nosedir/xml/test_tool_calanalysis/ |
| 15-Sep-2026 15:50:46 | nosedir/xml/test_tool_calanalysis/nose.xml |
| 15-Sep-2026 15:50:46 | nosedir/xml/test_tool_image_regrid/ |
| 15-Sep-2026 15:50:46 | nosedir/xml/test_tool_image_regrid/nose.xml |
| 15-Sep-2026 15:50:46 | nosedir/xml/test_tool_logsink/ |
| 15-Sep-2026 15:50:46 | nosedir/xml/test_tool_logsink/nose.xml |
| 15-Sep-2026 15:50:46 | nosedir/xml/test_tool_sdm_toms/ |
| 15-Sep-2026 15:50:46 | nosedir/xml/test_tool_sdm_toms/nose.xml |
| 15-Sep-2026 15:50:46 | nosedir/xml/test_tool_image_deviation/ |
| 15-Sep-2026 15:50:46 | nosedir/xml/test_tool_image_deviation/nose.xml |
| 15-Sep-2026 15:50:46 | nosedir/xml/test_tool_calibrater/ |
| 15-Sep-2026 15:50:46 | nosedir/xml/test_tool_calibrater/nose.xml |
| 15-Sep-2026 15:50:46 | nosedir/xml/test_tool_image_rebin/ |
| 15-Sep-2026 15:50:46 | nosedir/xml/test_tool_image_rebin/nose.xml |
| 15-Sep-2026 15:50:46 | nosedir/xml/test_tool_image_fitprofile/ |
| 15-Sep-2026 15:50:46 | nosedir/xml/test_tool_image_fitprofile/nose.xml |
| 15-Sep-2026 15:50:46 | nosedir/xml/test_tool_msuvbinner/ |
| 15-Sep-2026 15:50:46 | nosedir/xml/test_tool_msuvbinner/nose.xml |
| 15-Sep-2026 15:50:46 | nosedir/xml/test_tool_msmetadata/ |
| 15-Sep-2026 15:50:46 | nosedir/xml/test_tool_msmetadata/nose.xml |
| 15-Sep-2026 15:50:46 | nosedir/xml/test_tool_image_statistics/ |
| 15-Sep-2026 15:50:46 | nosedir/xml/test_tool_image_statistics/nose.xml |
| 15-Sep-2026 15:50:46 | nosedir/xml/test_tool_measures/ |
| 15-Sep-2026 15:50:46 | nosedir/xml/test_tool_measures/nose.xml |
| 15-Sep-2026 15:50:46 | nosedir/xml/test_tool_table/ |
| 15-Sep-2026 15:50:46 | nosedir/xml/test_tool_table/nose.xml |
| 15-Sep-2026 15:50:46 | nosedir/xml/test_tool_ms_statwt/ |
| 15-Sep-2026 15:50:46 | nosedir/xml/test_tool_ms_statwt/nose.xml |
| 15-Sep-2026 15:50:46 | nosedir/xml/test_tool_ms_createmultims/ |
| 15-Sep-2026 15:50:46 | nosedir/xml/test_tool_ms_createmultims/nose.xml |
| 15-Sep-2026 15:50:46 | nosedir/xml/test_tool_componentlist/ |
| 15-Sep-2026 15:50:46 | nosedir/xml/test_tool_componentlist/nose.xml |
| 15-Sep-2026 15:50:46 | nosedir/xml/test_tool_quanta/ |
| 15-Sep-2026 15:50:46 | nosedir/xml/test_tool_quanta/nose.xml |
| 15-Sep-2026 15:50:46 | nosedir/xml/test_tool_ms/ |
| 15-Sep-2026 15:50:46 | nosedir/xml/test_tool_ms/nose.xml |
| 15-Sep-2026 15:50:46 | nosedir/xml/test_tool_vpmanager/ |
| 15-Sep-2026 15:50:46 | nosedir/xml/test_tool_vpmanager/nose.xml |
| 15-Sep-2026 15:50:46 | nosedir/xml/test_tool_image_subimage/ |
| 15-Sep-2026 15:50:46 | nosedir/xml/test_tool_image_subimage/nose.xml |
| 15-Sep-2026 15:50:46 | nosedir/xml/test_tool_image_transpose/ |
| 15-Sep-2026 15:50:46 | nosedir/xml/test_tool_image_transpose/nose.xml |
| 15-Sep-2026 15:50:46 | nosedir/xml/test_tool_image/ |
| 15-Sep-2026 15:50:46 | nosedir/xml/test_tool_image/nose.xml |
| 15-Sep-2026 15:50:46 | nosedir/xml/test_tool_coordsys/ |
| 15-Sep-2026 15:50:46 | nosedir/xml/test_tool_coordsys/nose.xml |
| 15-Sep-2026 15:50:46 | nosedir/xml/test_tool_regionmanager/ |
| 15-Sep-2026 15:50:46 | nosedir/xml/test_tool_regionmanager/nose.xml |
| 15-Sep-2026 15:50:46 | nosedir/xml/test_tool_linearmosaic/ |
| 15-Sep-2026 15:50:46 | nosedir/xml/test_tool_linearmosaic/nose.xml |
| 15-Sep-2026 15:50:46 | nosedir/xml/test_tool_simulator/ |
| 15-Sep-2026 15:50:46 | nosedir/xml/test_tool_simulator/nose.xml |
| 15-Sep-2026 15:50:46 | nosedir/xml/test_tool_agentflagger/ |
| 15-Sep-2026 15:50:46 | nosedir/xml/test_tool_agentflagger/nose.xml |
| 15-Sep-2026 15:50:46 | nosedir/xml/test_tool_sdm/ |
| 15-Sep-2026 15:50:46 | nosedir/xml/test_tool_sdm/nose.xml |
| 15-Sep-2026 15:50:46 | nosedir/xml/test_tool_image_collapse/ |
| 15-Sep-2026 15:50:46 | nosedir/xml/test_tool_image_collapse/nose.xml |
| 15-Sep-2026 15:50:46 | nosedir/xml/test_tool_imagepol/ |
| 15-Sep-2026 15:50:46 | nosedir/xml/test_tool_imagepol/nose.xml |
| 15-Sep-2026 15:50:46 | nosedir/xml/test_tool_synthesisutils/ |
| 15-Sep-2026 15:50:46 | nosedir/xml/test_tool_synthesisutils/nose.xml |
| 15-Sep-2026 15:50:46 | nosedir/xml/test_tool_image_pbcor/ |
| 15-Sep-2026 15:50:46 | nosedir/xml/test_tool_image_pbcor/nose.xml |
| 15-Sep-2026 15:50:46 | nosedir/test_tool_calanalysis/ |
| 15-Sep-2026 15:50:46 | nosedir/test_tool_calanalysis/test_tool_calanalysis.py |
| 15-Sep-2026 15:50:46 | nosedir/test_tool_calanalysis/conftest.py |
| 15-Sep-2026 15:50:46 | nosedir/test_tool_calanalysis/casa-20260915-193957.log |
| 15-Sep-2026 15:50:46 | nosedir/test_tool_calanalysis/short_summary.log |
| 15-Sep-2026 15:50:46 | nosedir/test_tool_image_regrid/ |
| 15-Sep-2026 15:50:46 | nosedir/test_tool_image_regrid/test_tool_image_regrid.py |
| 15-Sep-2026 15:50:46 | nosedir/test_tool_image_regrid/conftest.py |
| 15-Sep-2026 15:50:46 | nosedir/test_tool_image_regrid/casa-20260915-193957.log |
| 15-Sep-2026 15:50:46 | nosedir/test_tool_image_regrid/short_summary.log |
| 15-Sep-2026 15:50:46 | nosedir/test_tool_logsink/ |
| 15-Sep-2026 15:50:46 | nosedir/test_tool_logsink/test_tool_logsink.py |
| 15-Sep-2026 15:50:46 | nosedir/test_tool_logsink/conftest.py |
| 15-Sep-2026 15:50:46 | nosedir/test_tool_logsink/casa-20260915-193959.log |
| 15-Sep-2026 15:50:46 | nosedir/test_tool_logsink/short_summary.log |
| 15-Sep-2026 15:50:46 | nosedir/test_tool_sdm_toms/ |
| 15-Sep-2026 15:50:46 | nosedir/test_tool_sdm_toms/test_tool_sdm_toms.py |
| 15-Sep-2026 15:50:46 | nosedir/test_tool_sdm_toms/conftest.py |
| 15-Sep-2026 15:50:46 | nosedir/test_tool_sdm_toms/casa-20260915-194000.log |
| 15-Sep-2026 15:50:46 | nosedir/test_tool_sdm_toms/short_summary.log |
| 15-Sep-2026 15:50:46 | nosedir/summary_of_failed.log |
| 15-Sep-2026 15:50:46 | nosedir/test_tool_image_deviation/ |
| 15-Sep-2026 15:50:46 | nosedir/test_tool_image_deviation/test_tool_image_deviation.py |
| 15-Sep-2026 15:50:46 | nosedir/test_tool_image_deviation/conftest.py |
| 15-Sep-2026 15:50:46 | nosedir/test_tool_image_deviation/casa-20260915-194212.log |
| 15-Sep-2026 15:50:46 | nosedir/test_tool_image_deviation/short_summary.log |
| 15-Sep-2026 15:50:46 | nosedir/test_tool_calibrater/ |
| 15-Sep-2026 15:50:46 | nosedir/test_tool_calibrater/test_tool_calibrater.py |
| 15-Sep-2026 15:50:46 | nosedir/test_tool_calibrater/conftest.py |
| 15-Sep-2026 15:50:46 | nosedir/test_tool_calibrater/casa-20260915-194216.log |
| 15-Sep-2026 15:50:46 | nosedir/test_tool_calibrater/short_summary.log |
| 15-Sep-2026 15:50:46 | nosedir/test_tool_image_rebin/ |
| 15-Sep-2026 15:50:46 | nosedir/test_tool_image_rebin/test_tool_image_rebin.py |
| 15-Sep-2026 15:50:46 | nosedir/test_tool_image_rebin/conftest.py |
| 15-Sep-2026 15:50:46 | nosedir/test_tool_image_rebin/casa-20260915-194432.log |
| 15-Sep-2026 15:50:46 | nosedir/test_tool_image_rebin/short_summary.log |
| 15-Sep-2026 15:50:46 | nosedir/test_tool_image_fitprofile/ |
| 15-Sep-2026 15:50:46 | nosedir/test_tool_image_fitprofile/test_tool_image_fitprofile.py |
| 15-Sep-2026 15:50:46 | nosedir/test_tool_image_fitprofile/conftest.py |
| 15-Sep-2026 15:50:46 | nosedir/test_tool_image_fitprofile/casa-20260915-194432.log |
| 15-Sep-2026 15:50:46 | nosedir/test_tool_image_fitprofile/short_summary.log |
| 15-Sep-2026 15:50:46 | nosedir/test_tool_msuvbinner/ |
| 15-Sep-2026 15:50:46 | nosedir/test_tool_msuvbinner/test_tool_msuvbinner.py |
| 15-Sep-2026 15:50:46 | nosedir/test_tool_msuvbinner/conftest.py |
| 15-Sep-2026 15:50:46 | nosedir/test_tool_msuvbinner/casa-20260915-194438.log |
| 15-Sep-2026 15:50:46 | nosedir/test_tool_msuvbinner/short_summary.log |
| 15-Sep-2026 15:50:46 | nosedir/test_tool_msmetadata/ |
| 15-Sep-2026 15:50:46 | nosedir/test_tool_msmetadata/test_tool_msmetadata.py |
| 15-Sep-2026 15:50:46 | nosedir/test_tool_msmetadata/conftest.py |
| 15-Sep-2026 15:50:46 | nosedir/test_tool_msmetadata/casa-20260915-194439.log |
| 15-Sep-2026 15:50:46 | nosedir/test_tool_msmetadata/short_summary.log |
| 15-Sep-2026 15:50:46 | nosedir/test_tool_image_statistics/ |
| 15-Sep-2026 15:50:46 | nosedir/test_tool_image_statistics/test_tool_image_statistics.py |
| 15-Sep-2026 15:50:46 | nosedir/test_tool_image_statistics/conftest.py |
| 15-Sep-2026 15:50:46 | nosedir/test_tool_image_statistics/casa-20260915-194443.log |
| 15-Sep-2026 15:50:46 | nosedir/test_tool_image_statistics/short_summary.log |
| 15-Sep-2026 15:50:46 | nosedir/test_tool_measures/ |
| 15-Sep-2026 15:50:46 | nosedir/test_tool_measures/test_tool_measures.py |
| 15-Sep-2026 15:50:46 | nosedir/test_tool_measures/conftest.py |
| 15-Sep-2026 15:50:46 | nosedir/test_tool_measures/casa-20260915-194607.log |
| 15-Sep-2026 15:50:46 | nosedir/test_tool_measures/short_summary.log |
| 15-Sep-2026 15:50:46 | nosedir/test_tool_table/ |
| 15-Sep-2026 15:50:46 | nosedir/test_tool_table/test_tool_table.py |
| 15-Sep-2026 15:50:46 | nosedir/test_tool_table/conftest.py |
| 15-Sep-2026 15:50:46 | nosedir/test_tool_table/casa-20260915-194608.log |
| 15-Sep-2026 15:50:46 | nosedir/test_tool_table/short_summary.log |
| 15-Sep-2026 15:50:46 | nosedir/test_tool_ms_statwt/ |
| 15-Sep-2026 15:50:46 | nosedir/test_tool_ms_statwt/test_tool_ms_statwt.py |
| 15-Sep-2026 15:50:46 | nosedir/test_tool_ms_statwt/conftest.py |
| 15-Sep-2026 15:50:46 | nosedir/test_tool_ms_statwt/casa-20260915-194609.log |
| 15-Sep-2026 15:50:46 | nosedir/test_tool_ms_statwt/short_summary.log |
| 15-Sep-2026 15:50:46 | nosedir/test_tool_ms_createmultims/ |
| 15-Sep-2026 15:50:46 | nosedir/test_tool_ms_createmultims/test_tool_ms_createmultims.py |
| 15-Sep-2026 15:50:46 | nosedir/test_tool_ms_createmultims/conftest.py |
| 15-Sep-2026 15:50:46 | nosedir/test_tool_ms_createmultims/casa-20260915-194818.log |
| 15-Sep-2026 15:50:46 | nosedir/test_tool_ms_createmultims/short_summary.log |
| 15-Sep-2026 15:50:46 | nosedir/test_tool_componentlist/ |
| 15-Sep-2026 15:50:46 | nosedir/test_tool_componentlist/test_tool_componentlist.py |
| 15-Sep-2026 15:50:46 | nosedir/test_tool_componentlist/conftest.py |
| 15-Sep-2026 15:50:46 | nosedir/test_tool_componentlist/casa-20260915-194822.log |
| 15-Sep-2026 15:50:46 | nosedir/test_tool_componentlist/short_summary.log |
| 15-Sep-2026 15:50:46 | nosedir/test_tool_quanta/ |
| 15-Sep-2026 15:50:46 | nosedir/test_tool_quanta/test_tool_quanta.py |
| 15-Sep-2026 15:50:46 | nosedir/test_tool_quanta/conftest.py |
| 15-Sep-2026 15:50:46 | nosedir/test_tool_quanta/casa-20260915-194822.log |
| 15-Sep-2026 15:50:46 | nosedir/test_tool_quanta/short_summary.log |
| 15-Sep-2026 15:50:46 | nosedir/test_tool_ms/ |
| 15-Sep-2026 15:50:46 | nosedir/test_tool_ms/test_tool_ms.py |
| 15-Sep-2026 15:50:46 | nosedir/test_tool_ms/conftest.py |
| 15-Sep-2026 15:50:46 | nosedir/test_tool_ms/casa-20260915-194823.log |
| 15-Sep-2026 15:50:46 | nosedir/test_tool_ms/short_summary.log |
| 15-Sep-2026 15:50:46 | nosedir/test_tool_vpmanager/ |
| 15-Sep-2026 15:50:46 | nosedir/test_tool_vpmanager/test_tool_vpmanager.py |
| 15-Sep-2026 15:50:46 | nosedir/test_tool_vpmanager/conftest.py |
| 15-Sep-2026 15:50:46 | nosedir/test_tool_vpmanager/casa-20260915-194849.log |
| 15-Sep-2026 15:50:46 | nosedir/test_tool_vpmanager/short_summary.log |
| 15-Sep-2026 15:50:46 | nosedir/test_tool_image_subimage/ |
| 15-Sep-2026 15:50:46 | nosedir/test_tool_image_subimage/test_tool_image_subimage.py |
| 15-Sep-2026 15:50:46 | nosedir/test_tool_image_subimage/conftest.py |
| 15-Sep-2026 15:50:46 | nosedir/test_tool_image_subimage/casa-20260915-194852.log |
| 15-Sep-2026 15:50:46 | nosedir/test_tool_image_subimage/short_summary.log |
| 15-Sep-2026 15:50:46 | nosedir/test_tool_image_transpose/ |
| 15-Sep-2026 15:50:46 | nosedir/test_tool_image_transpose/test_tool_image_transpose.py |
| 15-Sep-2026 15:50:46 | nosedir/test_tool_image_transpose/conftest.py |
| 15-Sep-2026 15:50:46 | nosedir/test_tool_image_transpose/casa-20260915-194853.log |
| 15-Sep-2026 15:50:46 | nosedir/test_tool_image_transpose/short_summary.log |
| 15-Sep-2026 15:50:46 | nosedir/test_tool_image/ |
| 15-Sep-2026 15:50:46 | nosedir/test_tool_image/test_tool_image.py |
| 15-Sep-2026 15:50:46 | nosedir/test_tool_image/conftest.py |
| 15-Sep-2026 15:50:46 | nosedir/test_tool_image/casa-20260915-194853.log |
| 15-Sep-2026 15:50:46 | nosedir/test_tool_image/short_summary.log |
| 15-Sep-2026 15:50:46 | nosedir/test_tool_coordsys/ |
| 15-Sep-2026 15:50:46 | nosedir/test_tool_coordsys/test_tool_coordsys.py |
| 15-Sep-2026 15:50:46 | nosedir/test_tool_coordsys/conftest.py |
| 15-Sep-2026 15:50:46 | nosedir/test_tool_coordsys/casa-20260915-194926.log |
| 15-Sep-2026 15:50:46 | nosedir/test_tool_coordsys/short_summary.log |
| 15-Sep-2026 15:50:46 | nosedir/test_tool_regionmanager/ |
| 15-Sep-2026 15:50:46 | nosedir/test_tool_regionmanager/test_tool_regionmanager.py |
| 15-Sep-2026 15:50:46 | nosedir/test_tool_regionmanager/conftest.py |
| 15-Sep-2026 15:50:46 | nosedir/test_tool_regionmanager/casa-20260915-194927.log |
| 15-Sep-2026 15:50:46 | nosedir/test_tool_regionmanager/short_summary.log |
| 15-Sep-2026 15:50:46 | nosedir/test_tool_linearmosaic/ |
| 15-Sep-2026 15:50:46 | nosedir/test_tool_linearmosaic/test_tool_linearmosaic.py |
| 15-Sep-2026 15:50:46 | nosedir/test_tool_linearmosaic/conftest.py |
| 15-Sep-2026 15:50:46 | nosedir/test_tool_linearmosaic/casa-20260915-194936.log |
| 15-Sep-2026 15:50:46 | nosedir/test_tool_linearmosaic/short_summary.log |
| 15-Sep-2026 15:50:46 | nosedir/test_tool_simulator/ |
| 15-Sep-2026 15:50:46 | nosedir/test_tool_simulator/test_tool_simulator.py |
| 15-Sep-2026 15:50:46 | nosedir/test_tool_simulator/conftest.py |
| 15-Sep-2026 15:50:46 | nosedir/test_tool_simulator/casa-20260915-194942.log |
| 15-Sep-2026 15:50:46 | nosedir/test_tool_simulator/short_summary.log |
| 15-Sep-2026 15:50:46 | nosedir/test_tool_agentflagger/ |
| 15-Sep-2026 15:50:46 | nosedir/test_tool_agentflagger/test_tool_agentflagger.py |
| 15-Sep-2026 15:50:46 | nosedir/test_tool_agentflagger/conftest.py |
| 15-Sep-2026 15:50:46 | nosedir/test_tool_agentflagger/casa-20260915-194948.log |
| 15-Sep-2026 15:50:46 | nosedir/test_tool_agentflagger/short_summary.log |
| 15-Sep-2026 15:50:46 | nosedir/test_tool_sdm/ |
| 15-Sep-2026 15:50:46 | nosedir/test_tool_sdm/test_tool_sdm.py |
| 15-Sep-2026 15:50:46 | nosedir/test_tool_sdm/conftest.py |
| 15-Sep-2026 15:50:46 | nosedir/test_tool_sdm/casa-20260915-195030.log |
| 15-Sep-2026 15:50:46 | nosedir/test_tool_sdm/short_summary.log |
| 15-Sep-2026 15:50:46 | nosedir/test_tool_image_collapse/ |
| 15-Sep-2026 15:50:46 | nosedir/test_tool_image_collapse/test_tool_image_collapse.py |
| 15-Sep-2026 15:50:46 | nosedir/test_tool_image_collapse/conftest.py |
| 15-Sep-2026 15:50:46 | nosedir/test_tool_image_collapse/casa-20260915-195038.log |
| 15-Sep-2026 15:50:46 | nosedir/test_tool_image_collapse/short_summary.log |
| 15-Sep-2026 15:50:46 | nosedir/test_tool_imagepol/ |
| 15-Sep-2026 15:50:46 | nosedir/test_tool_imagepol/test_tool_imagepol.py |
| 15-Sep-2026 15:50:46 | nosedir/test_tool_imagepol/conftest.py |
| 15-Sep-2026 15:50:46 | nosedir/test_tool_imagepol/casa-20260915-195039.log |
| 15-Sep-2026 15:50:46 | nosedir/test_tool_imagepol/short_summary.log |
| 15-Sep-2026 15:50:46 | nosedir/test_tool_synthesisutils/ |
| 15-Sep-2026 15:50:46 | nosedir/test_tool_synthesisutils/test_tool_synthesisutils.py |
| 15-Sep-2026 15:50:46 | nosedir/test_tool_synthesisutils/conftest.py |
| 15-Sep-2026 15:50:46 | nosedir/test_tool_synthesisutils/casa-20260915-195040.log |
| 15-Sep-2026 15:50:46 | nosedir/test_tool_synthesisutils/short_summary.log |
| 15-Sep-2026 15:50:46 | nosedir/test_tool_image_pbcor/ |
| 15-Sep-2026 15:50:46 | nosedir/test_tool_image_pbcor/test_tool_image_pbcor.py |
| 15-Sep-2026 15:50:46 | nosedir/test_tool_image_pbcor/conftest.py |
| 15-Sep-2026 15:50:46 | nosedir/test_tool_image_pbcor/casa-20260915-195045.log |
| 15-Sep-2026 15:50:46 | nosedir/test_tool_image_pbcor/short_summary.log |
| 15-Sep-2026 15:50:46 | total 78000 |
| 15-Sep-2026 15:50:46 | -rw-r--r-- 1 casaci 15001 161131 Sep 15 19:38 casatestutils-6.7.7.7a14812.dev4-py3-none-any.whl |
| 15-Sep-2026 15:50:46 | -rw-r--r-- 1 casaci 15001 79350410 Sep 15 19:38 casatools-6.7.7.7a14812.dev4-cp312-cp312-manylinux_2_28_x86_64.whl |
| 15-Sep-2026 15:50:46 | -rw-r--r-- 1 casaci root 4340 Sep 15 19:50 test_tool_agentflagger.xml |
| 15-Sep-2026 15:50:46 | -rw-r--r-- 1 casaci root 1006 Sep 15 19:50 test_tool_calanalysis.xml |
| 15-Sep-2026 15:50:46 | -rw-r--r-- 1 casaci root 2667 Sep 15 19:50 test_tool_calibrater.xml |
| 15-Sep-2026 15:50:46 | -rw-r--r-- 1 casaci root 687 Sep 15 19:50 test_tool_componentlist.xml |
| 15-Sep-2026 15:50:46 | -rw-r--r-- 1 casaci root 7467 Sep 15 19:50 test_tool_coordsys.xml |
| 15-Sep-2026 15:50:46 | -rw-r--r-- 1 casaci root 12935 Sep 15 19:50 test_tool_image.xml |
| 15-Sep-2026 15:50:46 | -rw-r--r-- 1 casaci root 2220 Sep 15 19:50 test_tool_image_collapse.xml |
| 15-Sep-2026 15:50:46 | -rw-r--r-- 1 casaci root 1048 Sep 15 19:50 test_tool_image_deviation.xml |
| 15-Sep-2026 15:50:46 | -rw-r--r-- 1 casaci root 2574 Sep 15 19:50 test_tool_image_fitprofile.xml |
| 15-Sep-2026 15:50:46 | -rw-r--r-- 1 casaci root 1178 Sep 15 19:50 test_tool_image_pbcor.xml |
| 15-Sep-2026 15:50:46 | -rw-r--r-- 1 casaci root 883 Sep 15 19:50 test_tool_image_pv.xml |
| 15-Sep-2026 15:50:46 | -rw-r--r-- 1 casaci root 1006 Sep 15 19:50 test_tool_image_rebin.xml |
| 15-Sep-2026 15:50:46 | -rw-r--r-- 1 casaci root 1336 Sep 15 19:50 test_tool_image_regrid.xml |
| 15-Sep-2026 15:50:46 | -rw-r--r-- 1 casaci root 1639 Sep 15 19:50 test_tool_image_statistics.xml |
| 15-Sep-2026 15:50:46 | -rw-r--r-- 1 casaci root 765 Sep 15 19:50 test_tool_image_subimage.xml |
| 15-Sep-2026 15:50:46 | -rw-r--r-- 1 casaci root 890 Sep 15 19:50 test_tool_image_transpose.xml |
| 15-Sep-2026 15:50:46 | -rw-r--r-- 1 casaci root 1966 Sep 15 19:50 test_tool_imagepol.xml |
| 15-Sep-2026 15:50:46 | -rw-r--r-- 1 casaci root 838 Sep 15 19:50 test_tool_linearmosaic.xml |
| 15-Sep-2026 15:50:46 | -rw-r--r-- 1 casaci root 669 Sep 15 19:50 test_tool_logsink.xml |
| 15-Sep-2026 15:50:46 | -rw-r--r-- 1 casaci root 549 Sep 15 19:50 test_tool_measures.xml |
| 15-Sep-2026 15:50:46 | -rw-r--r-- 1 casaci root 5224 Sep 15 19:50 test_tool_ms.xml |
| 15-Sep-2026 15:50:46 | -rw-r--r-- 1 casaci root 367 Sep 15 19:50 test_tool_ms_createmultims.xml |
| 15-Sep-2026 15:50:46 | -rw-r--r-- 1 casaci root 2099 Sep 15 19:50 test_tool_ms_statwt.xml |
| 15-Sep-2026 15:50:46 | -rw-r--r-- 1 casaci root 8633 Sep 15 19:50 test_tool_msmetadata.xml |
| 15-Sep-2026 15:50:46 | -rw-r--r-- 1 casaci root 359 Sep 15 19:50 test_tool_msuvbinner.xml |
| 15-Sep-2026 15:50:46 | -rw-r--r-- 1 casaci root 1171 Sep 15 19:50 test_tool_quanta.xml |
| 15-Sep-2026 15:50:46 | -rw-r--r-- 1 casaci root 3975 Sep 15 19:50 test_tool_regionmanager.xml |
| 15-Sep-2026 15:50:46 | -rw-r--r-- 1 casaci root 2071 Sep 15 19:50 test_tool_sdm.xml |
| 15-Sep-2026 15:50:46 | -rw-r--r-- 1 casaci root 2190 Sep 15 19:50 test_tool_sdm_toms.xml |
| 15-Sep-2026 15:50:46 | -rw-r--r-- 1 casaci root 670 Sep 15 19:50 test_tool_simulator.xml |
| 15-Sep-2026 15:50:46 | -rw-r--r-- 1 casaci root 1716 Sep 15 19:50 test_tool_synthesisutils.xml |
| 15-Sep-2026 15:50:46 | -rw-r--r-- 1 casaci root 1462 Sep 15 19:50 test_tool_table.xml |
| 15-Sep-2026 15:50:46 | -rw-r--r-- 1 casaci root 1717 Sep 15 19:50 test_tool_vpmanager.xml |
| 15-Sep-2026 15:50:46 | -rw-r--r-- 1 casaci root 188250 Sep 15 19:50 work-manylinux_228_casatools-3.12.tar.gz |
| 15-Sep-2026 15:50:46 | Done packaging working directory |
| 15-Sep-2026 15:50:46 | Finished task 'Tar work directory' with result: Success |
| 15-Sep-2026 15:50:46 | Starting task 'Parse tests' of type 'com.atlassian.bamboo.plugins.testresultparser:task.testresultparser.junit' |
| 15-Sep-2026 15:50:46 | Parsing test results under /opt/ci_workspace/casa/bamboo/agent6/xml-data/build-dir/CASASPECS-DEVTESTPY312118-TTOMLPY312... |
| 15-Sep-2026 15:50:46 | Finished task 'Parse tests' with result: Success |
| 15-Sep-2026 15:50:46 | Substituting variable: ${bamboo.agentId} with 153550854 |
| 15-Sep-2026 15:50:46 | Substituting variable: ${bamboo.repository.branch.name} with CAS-14812 |
| 15-Sep-2026 15:50:46 | Substituting variable: ${bamboo.agentId} with 153550854 |
| 15-Sep-2026 15:50:46 | Substituting variable: ${bamboo.agentId} with 153550854 |
| 15-Sep-2026 15:50:46 | Substituting variable: ${bamboo.agentId} with 153550854 |
| 15-Sep-2026 15:50:46 | Substituting variable: ${bamboo.agentId} with 153550854 |
| 15-Sep-2026 15:50:46 | Substituting variable: ${bamboo.agentId} with 153550854 |
| 15-Sep-2026 15:50:46 | Starting task 'Upload wheel' of type 'com.atlassian.bamboo.plugins.scripttask:task.builder.script' |
| 15-Sep-2026 15:50:46 | Beginning to execute external process for build 'CASASPECS - Dev Test 3.12 - CAS-14812 - Test Tools Many Linux 2.28 Py3.12 #5 (CASASPECS-DEVTESTPY312118-TTOMLPY312-5)' ... running command line: /opt/ci_workspace/casa/bamboo/agent6/temp/CASASPECS-DEVTESTPY312118-TTOMLPY312-5-ScriptBuildTask-16525123229970191023.sh ... in: /opt/ci_workspace/casa/bamboo/agent6/xml-data/build-dir/CASASPECS-DEVTESTPY312118-TTOMLPY312 |
| 15-Sep-2026 15:50:47 | Collecting twine |
| 15-Sep-2026 15:50:47 | Downloading twine-7.0.0-py3-none-any.whl (43 kB) |
| 15-Sep-2026 15:50:47 | ━━━━━━━━━━━━━━━━━━━━━━━━━━━━━━━━━━━━━━━━ 43.2/43.2 kB 8.8 MB/s eta 0:00:00 |
| 15-Sep-2026 15:50:47 | Collecting rich>=14.3.3 |
| 15-Sep-2026 15:50:47 | Downloading rich-15.0.0-py3-none-any.whl (310 kB) |
| 15-Sep-2026 15:50:47 | ━━━━━━━━━━━━━━━━━━━━━━━━━━━━━━━━━━━━━━ 310.7/310.7 kB 29.0 MB/s eta 0:00:00 |
| 15-Sep-2026 15:50:47 | Collecting keyring>=21.2.0 |
| 15-Sep-2026 15:50:47 | Downloading keyring-25.7.0-py3-none-any.whl (39 kB) |
| 15-Sep-2026 15:50:47 | Collecting id |
| 15-Sep-2026 15:50:47 | Downloading id-1.6.1-py3-none-any.whl (14 kB) |
| 15-Sep-2026 15:50:47 | Collecting packaging>=26.1 |
| 15-Sep-2026 15:50:47 | Downloading packaging-26.3-py3-none-any.whl (129 kB) |
| 15-Sep-2026 15:50:47 | ━━━━━━━━━━━━━━━━━━━━━━━━━━━━━━━━━━━━━━ 130.0/130.0 kB 50.3 MB/s eta 0:00:00 |
| 15-Sep-2026 15:50:47 | Collecting requests>=2.20 |
| 15-Sep-2026 15:50:47 | Downloading requests-2.34.2-py3-none-any.whl (73 kB) |
| 15-Sep-2026 15:50:47 | ━━━━━━━━━━━━━━━━━━━━━━━━━━━━━━━━━━━━━━━━ 73.1/73.1 kB 33.0 MB/s eta 0:00:00 |
| 15-Sep-2026 15:50:47 | Collecting rfc3986>=1.4.0 |
| 15-Sep-2026 15:50:47 | Downloading rfc3986-2.0.0-py2.py3-none-any.whl (31 kB) |
| 15-Sep-2026 15:50:47 | Collecting readme-renderer>=35.0 |
| 15-Sep-2026 15:50:47 | Downloading readme_renderer-46.0-py3-none-any.whl (14 kB) |
| 15-Sep-2026 15:50:47 | Collecting requests-toolbelt!=0.9.0,>=0.8.0 |
| 15-Sep-2026 15:50:47 | Downloading requests_toolbelt-1.0.0-py2.py3-none-any.whl (54 kB) |
| 15-Sep-2026 15:50:47 | ━━━━━━━━━━━━━━━━━━━━━━━━━━━━━━━━━━━━━━━━ 54.5/54.5 kB 27.2 MB/s eta 0:00:00 |
| 15-Sep-2026 15:50:47 | Collecting urllib3>=1.26.0 |
| 15-Sep-2026 15:50:47 | Downloading urllib3-2.8.0-py3-none-any.whl (135 kB) |
| 15-Sep-2026 15:50:47 | ━━━━━━━━━━━━━━━━━━━━━━━━━━━━━━━━━━━━━━ 135.7/135.7 kB 57.7 MB/s eta 0:00:00 |
| 15-Sep-2026 15:50:47 | Collecting SecretStorage>=3.2 |
| 15-Sep-2026 15:50:47 | Downloading secretstorage-3.5.0-py3-none-any.whl (15 kB) |
| 15-Sep-2026 15:50:47 | Collecting importlib_metadata>=4.11.4 |
| 15-Sep-2026 15:50:47 | Downloading importlib_metadata-9.0.1-py3-none-any.whl (27 kB) |
| 15-Sep-2026 15:50:47 | Collecting jeepney>=0.4.2 |
| 15-Sep-2026 15:50:47 | Downloading jeepney-0.9.0-py3-none-any.whl (49 kB) |
| 15-Sep-2026 15:50:47 | ━━━━━━━━━━━━━━━━━━━━━━━━━━━━━━━━━━━━━━━━ 49.0/49.0 kB 28.8 MB/s eta 0:00:00 |
| 15-Sep-2026 15:50:47 | Collecting jaraco.classes |
| 15-Sep-2026 15:50:47 | Downloading jaraco.classes-3.4.0-py3-none-any.whl (6.8 kB) |
| 15-Sep-2026 15:50:47 | Collecting jaraco.functools |
| 15-Sep-2026 15:50:47 | Downloading jaraco_functools-4.6.0-py3-none-any.whl (11 kB) |
| 15-Sep-2026 15:50:47 | Collecting jaraco.context |
| 15-Sep-2026 15:50:47 | Downloading jaraco_context-6.1.2-py3-none-any.whl (7.9 kB) |
| 15-Sep-2026 15:50:47 | Collecting Pygments>=2.5.1 |
| 15-Sep-2026 15:50:47 | Downloading pygments-2.21.0-py3-none-any.whl (1.3 MB) |
| 15-Sep-2026 15:50:47 | ━━━━━━━━━━━━━━━━━━━━━━━━━━━━━━━━━━━━━━━━ 1.3/1.3 MB 99.9 MB/s eta 0:00:00 |
| 15-Sep-2026 15:50:48 | Collecting docutils>=0.21.2 |
| 15-Sep-2026 15:50:48 | Downloading docutils-0.23-py3-none-any.whl (634 kB) |
| 15-Sep-2026 15:50:48 | ━━━━━━━━━━━━━━━━━━━━━━━━━━━━━━━━━━━━━━ 634.7/634.7 kB 91.4 MB/s eta 0:00:00 |
| 15-Sep-2026 15:50:48 | Collecting nh3>=0.2.14 |
| 15-Sep-2026 15:50:48 | Downloading nh3-0.3.7-cp38-abi3-manylinux_2_17_x86_64.manylinux2014_x86_64.whl (832 kB) |
| 15-Sep-2026 15:50:48 | ━━━━━━━━━━━━━━━━━━━━━━━━━━━━━━━━━━━━━ 832.2/832.2 kB 135.2 MB/s eta 0:00:00 |
| 15-Sep-2026 15:50:48 | Collecting charset_normalizer<4,>=2 |
| 15-Sep-2026 15:50:48 | Downloading charset_normalizer-3.5.1-cp310-cp310-manylinux2014_x86_64.manylinux_2_17_x86_64.manylinux_2_28_x86_64.whl (261 kB) |
| 15-Sep-2026 15:50:48 | ━━━━━━━━━━━━━━━━━━━━━━━━━━━━━━━━━━━━━━ 261.6/261.6 kB 75.6 MB/s eta 0:00:00 |
| 15-Sep-2026 15:50:48 | Collecting idna<4,>=2.5 |
| 15-Sep-2026 15:50:48 | Downloading idna-3.19-py3-none-any.whl (68 kB) |
| 15-Sep-2026 15:50:48 | ━━━━━━━━━━━━━━━━━━━━━━━━━━━━━━━━━━━━━━━━ 68.5/68.5 kB 32.3 MB/s eta 0:00:00 |
| 15-Sep-2026 15:50:48 | Collecting certifi>=2023.5.7 |
| 15-Sep-2026 15:50:48 | Downloading certifi-2026.7.22-py3-none-any.whl (136 kB) |
| 15-Sep-2026 15:50:48 | ━━━━━━━━━━━━━━━━━━━━━━━━━━━━━━━━━━━━━━ 137.0/137.0 kB 56.8 MB/s eta 0:00:00 |
| 15-Sep-2026 15:50:48 | Collecting markdown-it-py>=2.2.0 |
| 15-Sep-2026 15:50:48 | Downloading markdown_it_py-4.2.0-py3-none-any.whl (91 kB) |
| 15-Sep-2026 15:50:48 | ━━━━━━━━━━━━━━━━━━━━━━━━━━━━━━━━━━━━━━━━ 91.7/91.7 kB 43.0 MB/s eta 0:00:00 |
| 15-Sep-2026 15:50:48 | Collecting zipp>=3.20 |
| 15-Sep-2026 15:50:48 | Downloading zipp-4.1.0-py3-none-any.whl (10 kB) |
| 15-Sep-2026 15:50:48 | Collecting mdurl~=0.1 |
| 15-Sep-2026 15:50:48 | Downloading mdurl-0.1.2-py3-none-any.whl (10.0 kB) |
| 15-Sep-2026 15:50:48 | Collecting cryptography>=2.0 |
| 15-Sep-2026 15:50:48 | Downloading cryptography-50.0.1-cp39-abi3-manylinux_2_28_x86_64.whl (4.8 MB) |
| 15-Sep-2026 15:50:48 | ━━━━━━━━━━━━━━━━━━━━━━━━━━━━━━━━━━━━━━━━ 4.8/4.8 MB 136.7 MB/s eta 0:00:00 |
| 15-Sep-2026 15:50:48 | Collecting more-itertools |
| 15-Sep-2026 15:50:48 | Downloading more_itertools-11.1.0-py3-none-any.whl (72 kB) |
| 15-Sep-2026 15:50:48 | ━━━━━━━━━━━━━━━━━━━━━━━━━━━━━━━━━━━━━━━━ 72.2/72.2 kB 41.4 MB/s eta 0:00:00 |
| 15-Sep-2026 15:50:48 | Collecting backports.tarfile |
| 15-Sep-2026 15:50:48 | Downloading backports.tarfile-1.2.0-py3-none-any.whl (30 kB) |
| 15-Sep-2026 15:50:49 | Collecting typing-extensions>=4.13.2 |
| 15-Sep-2026 15:50:49 | Downloading typing_extensions-4.16.0-py3-none-any.whl (45 kB) |
| 15-Sep-2026 15:50:49 | ━━━━━━━━━━━━━━━━━━━━━━━━━━━━━━━━━━━━━━━━ 45.6/45.6 kB 23.2 MB/s eta 0:00:00 |
| 15-Sep-2026 15:50:49 | Collecting cffi>=2.0.0 |
| 15-Sep-2026 15:50:49 | Downloading cffi-2.1.1-cp310-cp310-manylinux2014_x86_64.manylinux_2_17_x86_64.whl (218 kB) |
| 15-Sep-2026 15:50:49 | ━━━━━━━━━━━━━━━━━━━━━━━━━━━━━━━━━━━━━━ 218.7/218.7 kB 64.3 MB/s eta 0:00:00 |
| 15-Sep-2026 15:50:49 | Collecting pycparser |
| 15-Sep-2026 15:50:49 | Downloading pycparser-3.0-py3-none-any.whl (48 kB) |
| 15-Sep-2026 15:50:49 | ━━━━━━━━━━━━━━━━━━━━━━━━━━━━━━━━━━━━━━━━ 48.2/48.2 kB 22.2 MB/s eta 0:00:00 |
| 15-Sep-2026 15:50:49 | Installing collected packages: zipp, urllib3, typing-extensions, rfc3986, Pygments, pycparser, packaging, nh3, more-itertools, mdurl, jeepney, idna, docutils, charset_normalizer, certifi, backports.tarfile, requests, readme-renderer, markdown-it-py, jaraco.functools, jaraco.context, jaraco.classes, importlib_metadata, id, cffi, rich, requests-toolbelt, cryptography, SecretStorage, keyring, twine |
| 15-Sep-2026 15:50:51 | Successfully installed Pygments-2.21.0 SecretStorage-3.5.0 backports.tarfile-1.2.0 certifi-2026.7.22 cffi-2.1.1 charset_normalizer-3.5.1 cryptography-50.0.1 docutils-0.23 id-1.6.1 idna-3.19 importlib_metadata-9.0.1 jaraco.classes-3.4.0 jaraco.context-6.1.2 jaraco.functools-4.6.0 jeepney-0.9.0 keyring-25.7.0 markdown-it-py-4.2.0 mdurl-0.1.2 more-itertools-11.1.0 nh3-0.3.7 packaging-26.3 pycparser-3.0 readme-renderer-46.0 requests-2.34.2 requests-toolbelt-1.0.0 rfc3986-2.0.0 rich-15.0.0 twine-7.0.0 typing-extensions-4.16.0 urllib3-2.8.0 zipp-4.1.0 |
| 15-Sep-2026 15:50:51 | WARNING: Running pip as the 'root' user can result in broken permissions and conflicting behaviour with the system package manager. It is recommended to use a virtual environment instead: https://pip.pypa.io/warnings/venv |
| 15-Sep-2026 15:50:51 | |
| 15-Sep-2026 15:50:51 | [notice] A new release of pip is available: 23.0.1 -> 26.2.1 |
| 15-Sep-2026 15:50:51 | [notice] To update, run: pip3 install --upgrade pip |
| 15-Sep-2026 15:50:51 | Cloning into 'casa-build-utils'... |
| 15-Sep-2026 15:50:51 | Uploading distributions to |
| 15-Sep-2026 15:50:51 | https://casa-pip.nrao.edu:443/repository/casa-dev-wheel/ |
| 15-Sep-2026 15:50:51 | Uploading casatools-6.7.7.7a14812.dev4-cp312-cp312-manylinux_2_28_x86_64.whl |
| 15-Sep-2026 15:50:51 | |
| 15-Sep-2026 15:50:51 | 0% ━━━━━━━━━━━━━━━━━━━━━━━━━━━━━━━━━━━━━━━━ 0.0/79.4 MB • --:-- • ? |
| 15-Sep-2026 15:50:52 | 8% ━━━╺━━━━━━━━━━━━━━━━━━━━━━━━━━━━━━━━━━━━ 6.1/79.4 MB • 00:01 • 94.4 MB/s |
| 15-Sep-2026 15:50:52 | 12% ━━━━╸━━━━━━━━━━━━━━━━━━━━━━━━━━━━━━━━━━━ 9.2/79.4 MB • 00:01 • 106.9 MB/s |
| 15-Sep-2026 15:50:52 | 15% ━━━━━╸━━━━━━━━━━━━━━━━━━━━━━━━━━━━━━━━━━ 11.7/79.4 MB • 00:02 • 59.3 MB/s |
| 15-Sep-2026 15:50:52 | 20% ━━━━━━━╸━━━━━━━━━━━━━━━━━━━━━━━━━━━━━━━━ 15.6/79.4 MB • 00:02 • 43.3 MB/s |
| 15-Sep-2026 15:50:52 | 23% ━━━━━━━━━╺━━━━━━━━━━━━━━━━━━━━━━━━━━━━━━ 18.4/79.4 MB • 00:02 • 36.1 MB/s |
| 15-Sep-2026 15:50:52 | 26% ━━━━━━━━━━╺━━━━━━━━━━━━━━━━━━━━━━━━━━━━━ 20.6/79.4 MB • 00:02 • 31.3 MB/s |
| 15-Sep-2026 15:50:52 | 29% ━━━━━━━━━━━╸━━━━━━━━━━━━━━━━━━━━━━━━━━━━ 22.9/79.4 MB • 00:03 • 27.0 MB/s |
| 15-Sep-2026 15:50:52 | 31% ━━━━━━━━━━━━╸━━━━━━━━━━━━━━━━━━━━━━━━━━━ 24.8/79.4 MB • 00:03 • 23.6 MB/s |
| 15-Sep-2026 15:50:52 | 32% ━━━━━━━━━━━━╸━━━━━━━━━━━━━━━━━━━━━━━━━━━ 25.5/79.4 MB • 00:03 • 23.6 MB/s |
| 15-Sep-2026 15:50:52 | 34% ━━━━━━━━━━━━━╸━━━━━━━━━━━━━━━━━━━━━━━━━━ 27.4/79.4 MB • 00:03 • 22.8 MB/s |
| 15-Sep-2026 15:50:53 | 38% ━━━━━━━━━━━━━━━╺━━━━━━━━━━━━━━━━━━━━━━━━ 30.1/79.4 MB • 00:02 • 24.9 MB/s |
| 15-Sep-2026 15:50:53 | 41% ━━━━━━━━━━━━━━━━╺━━━━━━━━━━━━━━━━━━━━━━━ 32.6/79.4 MB • 00:03 • 23.2 MB/s |
| 15-Sep-2026 15:50:53 | 44% ━━━━━━━━━━━━━━━━━╸━━━━━━━━━━━━━━━━━━━━━━ 35.1/79.4 MB • 00:02 • 24.1 MB/s |
| 15-Sep-2026 15:50:53 | 47% ━━━━━━━━━━━━━━━━━━╸━━━━━━━━━━━━━━━━━━━━━ 37.4/79.4 MB • 00:02 • 25.3 MB/s |
| 15-Sep-2026 15:50:53 | 50% ━━━━━━━━━━━━━━━━━━━╸━━━━━━━━━━━━━━━━━━━━ 39.5/79.4 MB • 00:02 • 20.4 MB/s |
| 15-Sep-2026 15:50:53 | 50% ━━━━━━━━━━━━━━━━━━━╸━━━━━━━━━━━━━━━━━━━━ 39.5/79.4 MB • 00:02 • 20.4 MB/s |
| 15-Sep-2026 15:50:53 | 50% ━━━━━━━━━━━━━━━━━━━╸━━━━━━━━━━━━━━━━━━━━ 39.5/79.4 MB • 00:02 • 20.4 MB/s |
| 15-Sep-2026 15:50:53 | 52% ━━━━━━━━━━━━━━━━━━━━╸━━━━━━━━━━━━━━━━━━━ 41.4/79.4 MB • 00:03 • 17.0 MB/s |
| 15-Sep-2026 15:50:53 | 55% ━━━━━━━━━━━━━━━━━━━━━━╺━━━━━━━━━━━━━━━━━ 43.9/79.4 MB • 00:02 • 19.6 MB/s |
| 15-Sep-2026 15:50:53 | 58% ━━━━━━━━━━━━━━━━━━━━━━━╺━━━━━━━━━━━━━━━━ 46.2/79.4 MB • 00:02 • 16.7 MB/s |
| 15-Sep-2026 15:50:54 | 60% ━━━━━━━━━━━━━━━━━━━━━━━━╺━━━━━━━━━━━━━━━ 47.7/79.4 MB • 00:02 • 18.9 MB/s |
| 15-Sep-2026 15:50:54 | 64% ━━━━━━━━━━━━━━━━━━━━━━━━━╸━━━━━━━━━━━━━━ 51.0/79.4 MB • 00:02 • 16.9 MB/s |
| 15-Sep-2026 15:50:54 | 69% ━━━━━━━━━━━━━━━━━━━━━━━━━━━╺━━━━━━━━━━━━ 54.6/79.4 MB • 00:02 • 20.4 MB/s |
| 15-Sep-2026 15:50:54 | 71% ━━━━━━━━━━━━━━━━━━━━━━━━━━━━╸━━━━━━━━━━━ 56.6/79.4 MB • 00:01 • 26.4 MB/s |
| 15-Sep-2026 15:50:54 | 74% ━━━━━━━━━━━━━━━━━━━━━━━━━━━━━╸━━━━━━━━━━ 58.8/79.4 MB • 00:01 • 26.7 MB/s |
| 15-Sep-2026 15:50:54 | 80% ━━━━━━━━━━━━━━━━━━━━━━━━━━━━━━━╸━━━━━━━━ 63.1/79.4 MB • 00:01 • 27.7 MB/s |
| 15-Sep-2026 15:50:54 | 82% ━━━━━━━━━━━━━━━━━━━━━━━━━━━━━━━━╸━━━━━━━ 65.2/79.4 MB • 00:01 • 29.9 MB/s |
| 15-Sep-2026 15:50:54 | 85% ━━━━━━━━━━━━━━━━━━━━━━━━━━━━━━━━━╸━━━━━━ 67.3/79.4 MB • 00:01 • 29.2 MB/s |
| 15-Sep-2026 15:50:54 | 87% ━━━━━━━━━━━━━━━━━━━━━━━━━━━━━━━━━━╸━━━━━ 69.4/79.4 MB • 00:01 • 27.2 MB/s |
| 15-Sep-2026 15:50:54 | 90% ━━━━━━━━━━━━━━━━━━━━━━━━━━━━━━━━━━━━╺━━━ 71.7/79.4 MB • 00:01 • 26.6 MB/s |
| 15-Sep-2026 15:50:55 | 91% ━━━━━━━━━━━━━━━━━━━━━━━━━━━━━━━━━━━━╸━━━ 72.5/79.4 MB • 00:01 • 21.7 MB/s |
| 15-Sep-2026 15:50:55 | 96% ━━━━━━━━━━━━━━━━━━━━━━━━━━━━━━━━━━━━━━╸━ 76.5/79.4 MB • 00:01 • 23.6 MB/s |
| 15-Sep-2026 15:50:55 | 96% ━━━━━━━━━━━━━━━━━━━━━━━━━━━━━━━━━━━━━━╸━ 76.5/79.4 MB • 00:01 • 23.6 MB/s |
| 15-Sep-2026 15:50:55 | 99% ━━━━━━━━━━━━━━━━━━━━━━━━━━━━━━━━━━━━━━━╸ 78.5/79.4 MB • 00:01 • 20.9 MB/s |
| 15-Sep-2026 15:50:55 | 100% ━━━━━━━━━━━━━━━━━━━━━━━━━━━━━━━━━━━━━━━━ 79.4/79.4 MB • 00:03 • 19.2 MB/s |
| 15-Sep-2026 15:50:55 | 100% ━━━━━━━━━━━━━━━━━━━━━━━━━━━━━━━━━━━━━━━━ 79.4/79.4 MB • 00:03 • 19.2 MB/s |
| 15-Sep-2026 15:50:55 | 100% ━━━━━━━━━━━━━━━━━━━━━━━━━━━━━━━━━━━━━━━━ 79.4/79.4 MB • 00:03 • 19.2 MB/s |
| 15-Sep-2026 15:50:55 | 100% ━━━━━━━━━━━━━━━━━━━━━━━━━━━━━━━━━━━━━━━━ 79.4/79.4 MB • 00:03 • 19.2 MB/s |
| 15-Sep-2026 15:50:55 | 100% ━━━━━━━━━━━━━━━━━━━━━━━━━━━━━━━━━━━━━━━━ 79.4/79.4 MB • 00:03 • 19.2 MB/s |
| 15-Sep-2026 15:50:55 | Uploading distributions to |
| 15-Sep-2026 15:50:55 | https://casa-pip.nrao.edu:443/repository/casa-dev-wheel/ |
| 15-Sep-2026 15:50:55 | Uploading casatestutils-6.7.7.7a14812.dev4-py3-none-any.whl |
| 15-Sep-2026 15:50:55 | |
| 15-Sep-2026 15:50:56 | 0% ━━━━━━━━━━━━━━━━━━━━━━━━━━━━━━━━━━━━━━━━ 0.0/174.5 kB • --:-- • ? |
| 15-Sep-2026 15:50:56 | 100% ━━━━━━━━━━━━━━━━━━━━━━━━━━━━━━━━━━━━━━━ 174.5/174.5 kB • 00:00 • 193.5 MB/s |
| 15-Sep-2026 15:50:56 | 100% ━━━━━━━━━━━━━━━━━━━━━━━━━━━━━━━━━━━━━━━ 174.5/174.5 kB • 00:00 • 193.5 MB/s |
| 15-Sep-2026 15:50:56 | |
| 15-Sep-2026 15:50:56 | Finished task 'Upload wheel' with result: Success |
| 15-Sep-2026 15:50:56 | Substituting variable: ${bamboo.agentId} with 153550854 |
| 15-Sep-2026 15:50:56 | Substituting variable: ${bamboo.agentId} with 153550854 |
| 15-Sep-2026 15:50:56 | Starting task 'Cleanup' of type 'com.atlassian.bamboo.plugins.scripttask:task.builder.script' |
| 15-Sep-2026 15:50:56 | Beginning to execute external process for build 'CASASPECS - Dev Test 3.12 - CAS-14812 - Test Tools Many Linux 2.28 Py3.12 #5 (CASASPECS-DEVTESTPY312118-TTOMLPY312-5)' ... running command line: /opt/ci_workspace/casa/bamboo/agent6/temp/CASASPECS-DEVTESTPY312118-TTOMLPY312-5-ScriptBuildTask-9149272090020879480.sh ... in: /opt/ci_workspace/casa/bamboo/agent6/xml-data/build-dir/CASASPECS-DEVTESTPY312118-TTOMLPY312 |
| 15-Sep-2026 15:50:56 | Starting cleanup |
| 15-Sep-2026 15:51:06 | wheel-container-test_153550854 |
| 15-Sep-2026 15:51:08 | wheel-container-test_153550854 |
| 15-Sep-2026 15:51:08 | Cleanup complete |
| 15-Sep-2026 15:51:08 | Finished task 'Cleanup' with result: Success |
| 15-Sep-2026 15:51:08 | Running post build plugin 'Docker Container Cleanup' |
| 15-Sep-2026 15:51:08 | Beginning to execute external process for build 'CASASPECS - Dev Test 3.12 - CAS-14812 - Test Tools Many Linux 2.28 Py3.12 #5 (CASASPECS-DEVTESTPY312118-TTOMLPY312-5)' ... running command line: /usr/bin/docker rm -f wheel-container-test_153550854 ... in: /opt/ci_workspace/casa/bamboo/agent6/xml-data/build-dir/CASASPECS-DEVTESTPY312118-TTOMLPY312 |
| 15-Sep-2026 15:51:08 | Running post build plugin 'NCover Results Collector' |
| 15-Sep-2026 15:51:08 | Running post build plugin 'Build Results Label Collector' |
| 15-Sep-2026 15:51:08 | Running post build plugin 'Clover Results Collector' |
| 15-Sep-2026 15:51:08 | Running post build plugin 'npm Cache Cleanup' |
| 15-Sep-2026 15:51:08 | Running post build plugin 'Artifact Copier' |
| 15-Sep-2026 15:51:08 | Publishing an artifact: Workdir |
| 15-Sep-2026 15:51:08 | Finished publishing of artifact Non required job artifact Http Compression On : [Workdir], patterns: [work*.tar.gz] anchored at: [wheeldirectory/] in 98.27 ms |
| 15-Sep-2026 15:51:08 | Publishing an artifact: XML Directories |
| 15-Sep-2026 15:51:08 | Finished publishing of artifact Non required job artifact Http Compression On : [XML Directories], patterns: [**/*.xml] anchored at: [wheeldirectory/] in 153.9 ms |
| 15-Sep-2026 15:51:08 | Finalising the build... |
| 15-Sep-2026 15:51:08 | Stopping timer. |
| 15-Sep-2026 15:51:08 | Build CASASPECS-DEVTESTPY312118-TTOMLPY312-5 completed. |
| 15-Sep-2026 15:51:08 | Running on server: post build plugin 'Build Hanging Detection Configuration' |
| 15-Sep-2026 15:51:08 | Running on server: post build plugin 'NCover Results Collector' |
| 15-Sep-2026 15:51:08 | Running on server: post build plugin 'Build Labeller' |
| 15-Sep-2026 15:51:08 | Running on server: post build plugin 'Clover Delta Calculator' |
| 15-Sep-2026 15:51:08 | Running on server: post build plugin 'Maven Dependencies Postprocessor' |
| 15-Sep-2026 15:51:08 | All post build plugins have finished |
| 15-Sep-2026 15:51:08 | Generating build results summary... |
| 15-Sep-2026 15:51:09 | Saving build results to disk... |
| 15-Sep-2026 15:51:09 | Store variable context... |
| 15-Sep-2026 15:51:09 | Finished building CASASPECS-DEVTESTPY312118-TTOMLPY312-5. |