Build: #5 failed Manual run by CASA adm account

Build result summary

Details

Completed
Queue duration
1 second
Duration
144 minutes
Labels
None
Revisions
CASA6
9ad00efe86dd924754722ea8981b6561fdd68f0d
OPEN-CASA-PKG
e5285e68467f01199807a1f1a978aec8a4781be7
Total tests
2110

Tests

Responsible

  • Kumar Golap Kumar Golap Automatically assigned

Tests

Existing test failures 2
Status Test Failing since View job Duration
AssertionError: False is not true
test_task_tclean.py:4341: in test_widefield_mvc_squint_awp2
    self.assertTrue(self.check_final(report))
E   AssertionError: False is not true
AssertionError: False is not true
test_task_tclean.py:4341: in test_widefield_mvc_squint_awp2
    self.assertTrue(self.check_final(report))
E   AssertionError: False is not true