Build: #4 failed

Job: Test Tools Many Linux 2.28 Python 3.10 L4 was successful

Build log

The build generated 53,324 lines of output.   The output is too long and has been truncated to the last 1,000 lines. Download or view full build log.

24-Aug-2026 20:11:43 2026-08-24 20:11:44        SEVERE        imagepol::complexlinpol        Exception Reported: Exception: Input image has multiple beams and the corresponding beams for the stokes planes necessary for this computation are not equal..
24-Aug-2026 20:11:43 2026-08-24 20:11:44        SEVERE        imagepol::complexlinpol+        ... thrown by casacore::Bool casa::ImagePolarimetry::_checkBeams(const std::vector<casa::ImagePolarimetry::StokesTypes>&, casacore::Bool, casacore::Bool) const at File: /source/casa6/casatools/src/code/imageanalysis/ImageAnalysis/ImagePolarimetry.cc, line: 1626
24-Aug-2026 20:11:43 test_tool_imagepol.py::po_complexlinpol_test::test_multibeam
24-Aug-2026 20:11:43 Test multibeam images for correct behavior
24-Aug-2026 20:11:43 2026-08-24 20:11:44        INFO        name::        No table opened.
24-Aug-2026 20:11:43 2026-08-24 20:11:44        INFO        showcache::        The Table Cache is empty.
24-Aug-2026 20:11:43 PASSED
24-Aug-2026 20:11:43
24-Aug-2026 20:11:43 2026-08-24 20:11:44        INFO        ImageFITSConverter::readBeamsTable        Loading multiple beams from BEAMS table
24-Aug-2026 20:11:43 2026-08-24 20:11:44        INFO        ImageFITSConverter::readBeamsTable        Loading multiple beams from BEAMS table
24-Aug-2026 20:11:43 2026-08-24 20:11:44        INFO        ImageFITSConverter::readBeamsTable        Loading multiple beams from BEAMS table
24-Aug-2026 20:11:43 2026-08-24 20:11:44        INFO        ImageFITSConverter::readBeamsTable        Loading multiple beams from BEAMS table
24-Aug-2026 20:11:43 2026-08-24 20:11:44        SEVERE        imagepol::depolratio        Exception Reported: Exception: Input image has multiple beams and the corresponding beams for the stokes planes necessary for this computation are not equal..
24-Aug-2026 20:11:43 2026-08-24 20:11:44        SEVERE        imagepol::depolratio+        ... thrown by casacore::Bool casa::ImagePolarimetry::_checkBeams(const std::vector<casa::ImagePolarimetry::StokesTypes>&, casacore::Bool, casacore::Bool) const at File: /source/casa6/casatools/src/code/imageanalysis/ImageAnalysis/ImagePolarimetry.cc, line: 1626
24-Aug-2026 20:11:43 2026-08-24 20:11:44        INFO        ImageFITSConverter::readBeamsTable        Loading multiple beams from BEAMS table
24-Aug-2026 20:11:43 2026-08-24 20:11:44        SEVERE        imagepol::depolratio        Exception Reported: Exception: Input image has multiple beams and the corresponding beams for the stokes planes necessary for this computation are not equal..
24-Aug-2026 20:11:43 2026-08-24 20:11:44        SEVERE        imagepol::depolratio+        ... thrown by casacore::Bool casa::ImagePolarimetry::_checkBeams(const std::vector<casa::ImagePolarimetry::StokesTypes>&, casacore::Bool, casacore::Bool) const at File: /source/casa6/casatools/src/code/imageanalysis/ImageAnalysis/ImagePolarimetry.cc, line: 1626
24-Aug-2026 20:11:43 test_tool_imagepol.py::po_depolratio_test::test_multibeam
24-Aug-2026 20:11:43 Test multibeam images for correct behavior
24-Aug-2026 20:11:43 pol_eq_beams.fits
24-Aug-2026 20:11:43 PASSED
24-Aug-2026 20:11:43
24-Aug-2026 20:11:43 2026-08-24 20:11:44        INFO        ImageFITSConverter::readBeamsTable        Loading multiple beams from BEAMS table
24-Aug-2026 20:11:43 2026-08-24 20:11:44        SEVERE        imagepol::fourierRotationMeasure (file /source/casa6/casatools/src/code/imageanalysis/ImageAnalysis/ImagePolProxy.cc, line 623)        Cannot run fourierRotationMeasure on an image with multiple beams
24-Aug-2026 20:11:43 2026-08-24 20:11:44        SEVERE        imagepol::fourierrotationmeasure        Exception Reported: 2026-08-24 20:11:44        SEVERE        imagepol::fourierRotationMeasure (file /source/casa6/casatools/src/code/imageanalysis/ImageAnalysis/ImagePolProxy.cc, line 623)        Cannot run fourierRotationMeasure on an image with multiple beams
24-Aug-2026 20:11:43 2026-08-24 20:11:44        INFO        ImageFITSConverter::readBeamsTable        Loading multiple beams from BEAMS table
24-Aug-2026 20:11:43 2026-08-24 20:11:44        SEVERE        imagepol::fourierRotationMeasure (file /source/casa6/casatools/src/code/imageanalysis/ImageAnalysis/ImagePolProxy.cc, line 623)        Cannot run fourierRotationMeasure on an image with multiple beams
24-Aug-2026 20:11:43 2026-08-24 20:11:44        SEVERE        imagepol::fourierrotationmeasure        Exception Reported: 2026-08-24 20:11:44        SEVERE        imagepol::fourierRotationMeasure (file /source/casa6/casatools/src/code/imageanalysis/ImageAnalysis/ImagePolProxy.cc, line 623)        Cannot run fourierRotationMeasure on an image with multiple beams
24-Aug-2026 20:11:43 test_tool_imagepol.py::po_fourierrotationmeasure_test::test_multibeam
24-Aug-2026 20:11:43 Test multibeam images for correct behavior
24-Aug-2026 20:11:43 pol_eq_beams.fits
24-Aug-2026 20:11:43 PASSED
24-Aug-2026 20:11:43
24-Aug-2026 20:11:43 2026-08-24 20:11:44        INFO        ImageFITSConverter::readBeamsTable        Loading multiple beams from BEAMS table
24-Aug-2026 20:11:43 2026-08-24 20:11:44        INFO        ImagePolarimetry::sigma         Determined noise from V image to be 1.0119
24-Aug-2026 20:11:43 2026-08-24 20:11:44        INFO        ImagePolarimetry::fracLinPol         Debiasing with sigma  = 1.0119
24-Aug-2026 20:11:43 2026-08-24 20:11:44        INFO        ImageFITSConverter::readBeamsTable        Loading multiple beams from BEAMS table
24-Aug-2026 20:11:43 test_tool_imagepol.py::po_fraclinpol_test::test_multibeam
24-Aug-2026 20:11:43 Test multibeam images for correct behavior
24-Aug-2026 20:11:43 pol_eq_beams.fits
24-Aug-2026 20:11:43 PASSED
24-Aug-2026 20:11:43
24-Aug-2026 20:11:43 2026-08-24 20:11:44        INFO        ImageFITSConverter::readBeamsTable        Loading multiple beams from BEAMS table
24-Aug-2026 20:11:43 2026-08-24 20:11:44        INFO        ImagePolarimetry::sigma         Determined noise from V image to be 1.0119
24-Aug-2026 20:11:43 2026-08-24 20:11:44        INFO        ImagePolarimetry::fracTotPol         Debiasing with sigma = 1.0119
24-Aug-2026 20:11:43 2026-08-24 20:11:44        INFO        ImageFITSConverter::readBeamsTable        Loading multiple beams from BEAMS table
24-Aug-2026 20:11:43 test_tool_imagepol.py::po_fractotpol_test::test_multibeam
24-Aug-2026 20:11:43 Test multibeam images for correct behavior
24-Aug-2026 20:11:43 pol_eq_beams.fits
24-Aug-2026 20:11:43 PASSED
24-Aug-2026 20:11:43
24-Aug-2026 20:11:43 2026-08-24 20:11:44        INFO        ImageFITSConverter::readBeamsTable        Loading multiple beams from BEAMS table
24-Aug-2026 20:11:43 2026-08-24 20:11:44        INFO        ImagePolTask::_sigma         Determined noise from V image to be 1.0119
24-Aug-2026 20:11:43 2026-08-24 20:11:44        INFO        ImagePolTask::_sigma         Debiasing with sigma = 1.0119
24-Aug-2026 20:11:43 2026-08-24 20:11:44        INFO        ImageFITSConverter::readBeamsTable        Loading multiple beams from BEAMS table
24-Aug-2026 20:11:43 test_tool_imagepol.py::po_linpolint_test::test_multibeam
24-Aug-2026 20:11:43 Test multibeam images for correct behavior
24-Aug-2026 20:11:43 pol_eq_beams.fits
24-Aug-2026 20:11:43 PASSED
24-Aug-2026 20:11:43
24-Aug-2026 20:11:43 2026-08-24 20:11:44        INFO        ImageFITSConverter::readBeamsTable        Loading multiple beams from BEAMS table
24-Aug-2026 20:11:43 2026-08-24 20:11:44        WARN        LinearPolarizationAngleCalculator::compute (file /source/casa6/casatools/src/code/imageanalysis/ImageAnalysis/LinearPolarizationAngleCalculator.cc, line 40)        The input image has multiple beams. Because these beams can vary with stokes/polarization, they will not be copied to the output image
24-Aug-2026 20:11:43 2026-08-24 20:11:44        INFO        SubImageFactory::createImage        Creating image 'g' of shape [10, 10, 10, 1]
24-Aug-2026 20:11:43 2026-08-24 20:11:44        INFO        ImageFITSConverter::readBeamsTable        Loading multiple beams from BEAMS table
24-Aug-2026 20:11:43 2026-08-24 20:11:44        SEVERE        imagepol::linpolposang        Exception Reported: Exception: Input image has multiple beams and the corresponding beams for the stokes planes necessary for this computation are not equal..
24-Aug-2026 20:11:43 2026-08-24 20:11:44        SEVERE        imagepol::linpolposang+        ... thrown by casacore::Bool casa::ImagePolTask::_checkBeams(const std::vector<casa::ImagePolTask::StokesTypes>&, casacore::Bool, casacore::Bool) const at File: /source/casa6/casatools/src/code/imageanalysis/ImageAnalysis/ImagePolTask.cc, line: 79
24-Aug-2026 20:11:43 test_tool_imagepol.py::po_linpolposang_test::test_multibeam
24-Aug-2026 20:11:43 Test multibeam images for correct behavior
24-Aug-2026 20:11:43 pol_eq_beams.fits
24-Aug-2026 20:11:43 PASSED
24-Aug-2026 20:11:43
24-Aug-2026 20:11:43 2026-08-24 20:11:44        INFO        ImageFactory::createImage        Created Paged image 'rm_input.im' of shape [20, 20, 4, 20] with float valued pixels.
24-Aug-2026 20:11:43 2026-08-24 20:11:44        INFO        ImagePol::rotationMeasure        Creating image 'rm.im' of shape [20, 20]
24-Aug-2026 20:11:43 2026-08-24 20:11:44        INFO        ImagePol::rotationMeasure        Creating image 'pa0.im' of shape [20, 20, 1]
24-Aug-2026 20:11:43 2026-08-24 20:11:44        INFO        image::statistics         Determining stats for image rm.im
24-Aug-2026 20:11:43 2026-08-24 20:11:44        INFO        CasacRegionManager::fromBCS        No directional region specified. Using full positional plane.
24-Aug-2026 20:11:43 2026-08-24 20:11:44        INFO        ImageRegion::fromRecord        Selected bounding box :
24-Aug-2026 20:11:43 2026-08-24 20:11:44        INFO        ImageRegion::fromRecord+            [0, 0] to [19, 19]  (00:00:40.000, -00.10.00.001 to 23:59:24.000, +00.09.00.001)
24-Aug-2026 20:11:43 2026-08-24 20:11:44        INFO        ImageStatsCalculator::_logStartup        Statistics calculated using Classic algorithm
24-Aug-2026 20:11:43 2026-08-24 20:11:44        INFO        ImageStatsCalculator::_logStartup        Regions ---
24-Aug-2026 20:11:43 2026-08-24 20:11:44        INFO        ImageStatsCalculator::_logStartup                 -- bottom-left corner (pixel) [blc]:  [0, 0]
24-Aug-2026 20:11:43 2026-08-24 20:11:44        INFO        ImageStatsCalculator::_logStartup                 -- top-right corner (pixel) [trc]:    [19, 19]
24-Aug-2026 20:11:43 2026-08-24 20:11:44        INFO        ImageStatsCalculator::_logStartup                 -- bottom-left corner (world) [blcf]: 00:00:40.000, -00.10.00.001
24-Aug-2026 20:11:43 2026-08-24 20:11:44        INFO        ImageStatsCalculator::_logStartup                 -- top-right corner (world) [trcf]:   23:59:24.000, +00.09.00.001
24-Aug-2026 20:11:43 2026-08-24 20:11:44        INFO                Values ---
24-Aug-2026 20:11:43 2026-08-24 20:11:44        INFO                         -- number of points [npts]:                400
24-Aug-2026 20:11:43 2026-08-24 20:11:44        INFO                         -- maximum value [max]:                    9.60001 rad/m/m
24-Aug-2026 20:11:43 2026-08-24 20:11:44        INFO                         -- minimum value [min]:                    9.59997 rad/m/m
24-Aug-2026 20:11:43 2026-08-24 20:11:44        INFO                         -- position of max value (pixel) [maxpos]: [3, 0]
24-Aug-2026 20:11:43 2026-08-24 20:11:44        INFO                         -- position of min value (pixel) [minpos]: [1, 0]
24-Aug-2026 20:11:43 2026-08-24 20:11:44        INFO                         -- position of max value (world) [maxposf]: 00:00:28.000, -00.10.00.001
24-Aug-2026 20:11:43 2026-08-24 20:11:44        INFO                         -- position of min value (world) [minposf]: 00:00:36.000, -00.10.00.001
24-Aug-2026 20:11:43 2026-08-24 20:11:44        INFO                         -- Sum of pixel values [sum]:               3839.99 rad/m/m
24-Aug-2026 20:11:43 2026-08-24 20:11:44        INFO                         -- Sum of squared pixel values [sumsq]:     36863.9 rad/m/m.rad/m/m
24-Aug-2026 20:11:43 2026-08-24 20:11:44        INFO                Statistics ---
24-Aug-2026 20:11:43 2026-08-24 20:11:44        INFO                        -- Mean of the pixel values [mean]:         9.59998 rad/m/m
24-Aug-2026 20:11:43 2026-08-24 20:11:44        INFO                        -- Variance of the pixel values :           9.48741e-11 rad/m/m
24-Aug-2026 20:11:43 2026-08-24 20:11:44        INFO                        -- Standard deviation of the Mean [sigma]:  9.74033e-06 rad/m/m
24-Aug-2026 20:11:43 2026-08-24 20:11:44        INFO                        -- Root mean square [rms]:                  9.59998 rad/m/m
24-Aug-2026 20:11:43 2026-08-24 20:11:44        INFO        ImageStatsCalculator::statistics        Sum column unit = rad/m/m
24-Aug-2026 20:11:43 2026-08-24 20:11:44        INFO        ImageStatsCalculator::statistics+        Mean column unit = rad/m/m
24-Aug-2026 20:11:43 2026-08-24 20:11:44        INFO        ImageStatsCalculator::statistics+        Std_dev column unit = rad/m/m
24-Aug-2026 20:11:43 2026-08-24 20:11:44        INFO        ImageStatsCalculator::statistics+        Minimum column unit = rad/m/m
24-Aug-2026 20:11:43 2026-08-24 20:11:44        INFO        ImageStatsCalculator::statistics+        Maximum column unit = rad/m/m
24-Aug-2026 20:11:43 2026-08-24 20:11:44        INFO        ImageStatsCalculator::statistics        Npts          Sum           Mean          Rms           Std_dev       Minimum       Maximum     
24-Aug-2026 20:11:43 2026-08-24 20:11:44        INFO        ImageStatsCalculator::statistics         4.000000e+02  3.839993e+03  9.599982e+00  9.599982e+00  9.740334e-06  9.599969e+00  9.600007e+00
24-Aug-2026 20:11:43 2026-08-24 20:11:44        INFO                deleted table /home/casatest/casa6/casatestutils/nosedir/test_tool_imagepol/rm.im
24-Aug-2026 20:11:43 2026-08-24 20:11:44        INFO        image::statistics         Determining stats for image pa0.im
24-Aug-2026 20:11:43 2026-08-24 20:11:44        INFO        CasacRegionManager::fromBCS        No directional region specified. Using full positional plane.
24-Aug-2026 20:11:43 2026-08-24 20:11:44        INFO        CasacRegionManager::fromBCS        Using polarizations ALL
24-Aug-2026 20:11:43 2026-08-24 20:11:44        INFO        ImageRegion::fromRecord        Selected bounding box :
24-Aug-2026 20:11:43 2026-08-24 20:11:44        INFO        ImageRegion::fromRecord+            [0, 0, 0] to [19, 19, 0]  (00:00:40.000, -00.10.00.001, Pangle to 23:59:24.000, +00.09.00.001, Pangle)
24-Aug-2026 20:11:43 2026-08-24 20:11:44        INFO        ImageStatsCalculator::_logStartup        Statistics calculated using Classic algorithm
24-Aug-2026 20:11:43 2026-08-24 20:11:44        INFO        ImageStatsCalculator::_logStartup        Regions ---
24-Aug-2026 20:11:43 2026-08-24 20:11:44        INFO        ImageStatsCalculator::_logStartup                 -- bottom-left corner (pixel) [blc]:  [0, 0, 0]
24-Aug-2026 20:11:43 2026-08-24 20:11:44        INFO        ImageStatsCalculator::_logStartup                 -- top-right corner (pixel) [trc]:    [19, 19, 0]
24-Aug-2026 20:11:43 2026-08-24 20:11:44        INFO        ImageStatsCalculator::_logStartup                 -- bottom-left corner (world) [blcf]: 00:00:40.000, -00.10.00.001, Pangle
24-Aug-2026 20:11:43 2026-08-24 20:11:44        INFO        ImageStatsCalculator::_logStartup                 -- top-right corner (world) [trcf]:   23:59:24.000, +00.09.00.001, Pangle
24-Aug-2026 20:11:43 2026-08-24 20:11:44        INFO                Values ---
24-Aug-2026 20:11:43 2026-08-24 20:11:44        INFO                         -- number of points [npts]:                400
24-Aug-2026 20:11:43 2026-08-24 20:11:44        INFO                         -- maximum value [max]:                    22.5001 deg
24-Aug-2026 20:11:43 2026-08-24 20:11:44        INFO                         -- minimum value [min]:                    22.5 deg
24-Aug-2026 20:11:43 2026-08-24 20:11:44        INFO                         -- position of max value (pixel) [maxpos]: [1, 0, 0]
24-Aug-2026 20:11:43 2026-08-24 20:11:44        INFO                         -- position of min value (pixel) [minpos]: [3, 0, 0]
24-Aug-2026 20:11:43 2026-08-24 20:11:44        INFO                         -- position of max value (world) [maxposf]: 00:00:36.000, -00.10.00.001, Pangle
24-Aug-2026 20:11:43 2026-08-24 20:11:44        INFO                         -- position of min value (world) [minposf]: 00:00:28.000, -00.10.00.001, Pangle
24-Aug-2026 20:11:43 2026-08-24 20:11:44        INFO                         -- Sum of pixel values [sum]:               9000.02 deg
24-Aug-2026 20:11:43 2026-08-24 20:11:44        INFO                         -- Sum of squared pixel values [sumsq]:     202501 deg.deg
24-Aug-2026 20:11:43 2026-08-24 20:11:44        INFO                Statistics ---
24-Aug-2026 20:11:43 2026-08-24 20:11:44        INFO                        -- Mean of the pixel values [mean]:         22.5 deg
24-Aug-2026 20:11:43 2026-08-24 20:11:44        INFO                        -- Variance of the pixel values :           6.26899e-10 deg
24-Aug-2026 20:11:43 2026-08-24 20:11:44        INFO                        -- Standard deviation of the Mean [sigma]:  2.5038e-05 deg
24-Aug-2026 20:11:43 2026-08-24 20:11:44        INFO                        -- Root mean square [rms]:                  22.5 deg
24-Aug-2026 20:11:43 2026-08-24 20:11:44        INFO        ImageStatsCalculator::statistics        Sum column unit = deg
24-Aug-2026 20:11:43 2026-08-24 20:11:44        INFO        ImageStatsCalculator::statistics+        Mean column unit = deg
24-Aug-2026 20:11:43 2026-08-24 20:11:44        INFO        ImageStatsCalculator::statistics+        Std_dev column unit = deg
24-Aug-2026 20:11:43 2026-08-24 20:11:44        INFO        ImageStatsCalculator::statistics+        Minimum column unit = deg
24-Aug-2026 20:11:43 2026-08-24 20:11:44        INFO        ImageStatsCalculator::statistics+        Maximum column unit = deg
24-Aug-2026 20:11:43 2026-08-24 20:11:44        INFO        ImageStatsCalculator::statistics        Npts          Sum           Mean          Rms           Std_dev       Minimum       Maximum     
24-Aug-2026 20:11:43 2026-08-24 20:11:44        INFO        ImageStatsCalculator::statistics         4.000000e+02  9.000018e+03  2.250005e+01  2.250005e+01  2.503796e-05  2.249998e+01  2.250008e+01
24-Aug-2026 20:11:43 2026-08-24 20:11:44        INFO                deleted table /home/casatest/casa6/casatestutils/nosedir/test_tool_imagepol/pa0.im
24-Aug-2026 20:11:43 test_tool_imagepol.py::po_rotationmeasure_test::test_algorithm
24-Aug-2026 20:11:43 Test rotation measure computation algorithm
24-Aug-2026 20:11:43 PASSED
24-Aug-2026 20:11:43
24-Aug-2026 20:11:43 2026-08-24 20:11:44        INFO        ImageFITSConverter::readBeamsTable        Loading multiple beams from BEAMS table
24-Aug-2026 20:11:43 2026-08-24 20:11:44        INFO        ImagePol::rotationMeasure        Creating image 'g' of shape [10, 10]
24-Aug-2026 20:11:43 2026-08-24 20:11:44        INFO        ImagePolarimetry::sigma         Determined noise from V image to be 1.0119
24-Aug-2026 20:11:44 2026-08-24 20:11:44        INFO        ImageFITSConverter::readBeamsTable        Loading multiple beams from BEAMS table
24-Aug-2026 20:11:44 2026-08-24 20:11:44        INFO        ImagePol::rotationMeasure        Creating image 'hh' of shape [10, 10]
24-Aug-2026 20:11:44 2026-08-24 20:11:44        SEVERE        imagepol::rotationmeasure        Exception Reported: Exception: Input image has multiple beams and the corresponding beams for the stokes planes necessary for this computation are not equal..
24-Aug-2026 20:11:44 2026-08-24 20:11:44        SEVERE        imagepol::rotationmeasure+        ... thrown by casacore::Bool casa::ImagePolarimetry::_checkBeams(const std::vector<casa::ImagePolarimetry::StokesTypes>&, casacore::Bool, casacore::Bool) const at File: /source/casa6/casatools/src/code/imageanalysis/ImageAnalysis/ImagePolarimetry.cc, line: 1626
24-Aug-2026 20:11:44 test_tool_imagepol.py::po_rotationmeasure_test::test_multibeam
24-Aug-2026 20:11:44 Test multibeam images for correct behavior
24-Aug-2026 20:11:44 PASSED
24-Aug-2026 20:11:44
24-Aug-2026 20:11:44 2026-08-24 20:11:44        INFO        ImageFITSConverter::readBeamsTable        Loading multiple beams from BEAMS table
24-Aug-2026 20:11:44 2026-08-24 20:11:44        INFO        ImagePolarimetry::sigma         Determined noise from V image to be 1.0119
24-Aug-2026 20:11:44 2026-08-24 20:11:44        INFO        ImageFITSConverter::readBeamsTable        Loading multiple beams from BEAMS table
24-Aug-2026 20:11:44 2026-08-24 20:11:44        INFO        ImagePolarimetry::sigma         Determined noise from V image to be 1.0119
24-Aug-2026 20:11:44 test_tool_imagepol.py::po_sigma_test::test_multibeam
24-Aug-2026 20:11:44 Test multibeam images for correct behavior
24-Aug-2026 20:11:44 pol_eq_beams.fits
24-Aug-2026 20:11:44 PASSED
24-Aug-2026 20:11:44
24-Aug-2026 20:11:44 2026-08-24 20:11:44        INFO        ImageFITSConverter::readBeamsTable        Loading multiple beams from BEAMS table
24-Aug-2026 20:11:44 2026-08-24 20:11:44        INFO        ImageFITSConverter::readBeamsTable        Loading multiple beams from BEAMS table
24-Aug-2026 20:11:44 2026-08-24 20:11:44        INFO        ImagePolarimetry::sigmaLinPolInt         Determined noise from Q&U images to be
24-Aug-2026 20:11:44 2026-08-24 20:11:44        INFO        ImagePolarimetry::sigmaLinPolInt         Determined noise from Q&U images to be
24-Aug-2026 20:11:44 2026-08-24 20:11:44        INFO        ImageFITSConverter::readBeamsTable        Loading multiple beams from BEAMS table
24-Aug-2026 20:11:44 2026-08-24 20:11:44        INFO        ImageFITSConverter::readBeamsTable        Loading multiple beams from BEAMS table
24-Aug-2026 20:11:44 2026-08-24 20:11:44        SEVERE        imagepol::sigmadepolratio        Exception Reported: Exception: Beams or beamsets are not equal between the two images, caonnot perform calculation.
24-Aug-2026 20:11:44 2026-08-24 20:11:44        SEVERE        imagepol::sigmadepolratio+        ... thrown by static void casa::ImagePolarimetry::_checkBeams(const casa::ImagePolarimetry&, const casa::ImagePolarimetry&, const casacore::Vector<casa::ImagePolarimetry::StokesTypes>&) at File: /source/casa6/casatools/src/code/imageanalysis/ImageAnalysis/ImagePolarimetry.cc, line: 1686
24-Aug-2026 20:11:44 test_tool_imagepol.py::po_sigmadepolratio_test::test_multibeam
24-Aug-2026 20:11:44 Test multibeam images for correct behavior
24-Aug-2026 20:11:44 PASSED
24-Aug-2026 20:11:44
24-Aug-2026 20:11:44 2026-08-24 20:11:44        INFO        ImageFITSConverter::readBeamsTable        Loading multiple beams from BEAMS table
24-Aug-2026 20:11:44 2026-08-24 20:11:44        INFO        ImagePolarimetry::sigmaLinPolInt         Determined noise from Q&U images to be
24-Aug-2026 20:11:44 2026-08-24 20:11:44        INFO        imagepol::sigmaFracLinPol        Creating image 'g' of shape [10, 10, 10, 1]
24-Aug-2026 20:11:44 2026-08-24 20:11:44        INFO        ImageFITSConverter::readBeamsTable        Loading multiple beams from BEAMS table
24-Aug-2026 20:11:44 2026-08-24 20:11:44        SEVERE        imagepol::sigmafraclinpol        Exception Reported: Exception: Input image has multiple beams and the corresponding beams for the stokes planes necessary for this computation are not equal..
24-Aug-2026 20:11:44 2026-08-24 20:11:44        SEVERE        imagepol::sigmafraclinpol+        ... thrown by casacore::Bool casa::ImagePolarimetry::_checkBeams(const std::vector<casa::ImagePolarimetry::StokesTypes>&, casacore::Bool, casacore::Bool) const at File: /source/casa6/casatools/src/code/imageanalysis/ImageAnalysis/ImagePolarimetry.cc, line: 1626
24-Aug-2026 20:11:44 test_tool_imagepol.py::po_sigmafraclinpol_test::test_multibeam
24-Aug-2026 20:11:44 Test multibeam images for correct behavior
24-Aug-2026 20:11:44 PASSED
24-Aug-2026 20:11:44
24-Aug-2026 20:11:44 2026-08-24 20:11:44        INFO        ImageFITSConverter::readBeamsTable        Loading multiple beams from BEAMS table
24-Aug-2026 20:11:44 2026-08-24 20:11:44        INFO        ImagePolarimetry::sigma         Determined noise from V image to be 1.0119
24-Aug-2026 20:11:44 2026-08-24 20:11:44        INFO        imagepol::sigmaFracTotPol        Creating image 'g' of shape [10, 10, 10, 1]
24-Aug-2026 20:11:44 2026-08-24 20:11:44        INFO        ImageFITSConverter::readBeamsTable        Loading multiple beams from BEAMS table
24-Aug-2026 20:11:44 2026-08-24 20:11:44        WARN        ImagePolarimetry::_setDoLinDoCirc (file /source/casa6/casatools/src/code/imageanalysis/ImageAnalysis/ImagePolarimetry.cc, line 272)        I, Q, and U beams are not the same, cannot do linear portion
24-Aug-2026 20:11:44 2026-08-24 20:11:44        WARN        ImagePolarimetry::_setDoLinDoCirc (file /source/casa6/casatools/src/code/imageanalysis/ImageAnalysis/ImagePolarimetry.cc, line 272)        I and V beams are not the same, cannot do circular portion
24-Aug-2026 20:11:44 2026-08-24 20:11:44        SEVERE        imagepol::sigmafractotpol        Exception Reported: Exception: Can do neither linear nor circular portions.
24-Aug-2026 20:11:44 2026-08-24 20:11:44        SEVERE        imagepol::sigmafractotpol+        ... thrown by void casa::ImagePolarimetry::_setDoLinDoCirc(casacore::Bool&, casacore::Bool&) const at File: /source/casa6/casatools/src/code/imageanalysis/ImageAnalysis/ImagePolarimetry.cc, line: 292
24-Aug-2026 20:11:44 test_tool_imagepol.py::po_sigmafractotpol_test::test_multibeam
24-Aug-2026 20:11:44 Test multibeam images for correct behavior
24-Aug-2026 20:11:44 PASSED
24-Aug-2026 20:11:44
24-Aug-2026 20:11:44 2026-08-24 20:11:44        INFO        ImageFITSConverter::readBeamsTable        Loading multiple beams from BEAMS table
24-Aug-2026 20:11:44 2026-08-24 20:11:44        INFO        ImagePolarimetry::sigmaLinPolInt         Determined noise from Q&U images to be
24-Aug-2026 20:11:44 2026-08-24 20:11:44        INFO        ImageFITSConverter::readBeamsTable        Loading multiple beams from BEAMS table
24-Aug-2026 20:11:44 2026-08-24 20:11:44        SEVERE        imagepol::sigmalinpolint        Exception Reported: Exception: Input image has multiple beams and the corresponding beams for the stokes planes necessary for this computation are not equal..
24-Aug-2026 20:11:44 2026-08-24 20:11:44        SEVERE        imagepol::sigmalinpolint+        ... thrown by casacore::Bool casa::ImagePolarimetry::_checkBeams(const std::vector<casa::ImagePolarimetry::StokesTypes>&, casacore::Bool, casacore::Bool) const at File: /source/casa6/casatools/src/code/imageanalysis/ImageAnalysis/ImagePolarimetry.cc, line: 1626
24-Aug-2026 20:11:44 test_tool_imagepol.py::po_sigmalinpolint_test::test_multibeam
24-Aug-2026 20:11:44 Test multibeam images for correct behavior
24-Aug-2026 20:11:44 PASSED
24-Aug-2026 20:11:44
24-Aug-2026 20:11:44 2026-08-24 20:11:44        INFO        ImageFITSConverter::readBeamsTable        Loading multiple beams from BEAMS table
24-Aug-2026 20:11:44 2026-08-24 20:11:44        INFO        ImagePolarimetry::sigma         Determined noise from V image to be 1.0119
24-Aug-2026 20:11:44 2026-08-24 20:11:44        INFO        imagepol::sigmaLinPolPosAng        Creating image 'g' of shape [10, 10, 10, 1]
24-Aug-2026 20:11:44 2026-08-24 20:11:44        INFO        ImageFITSConverter::readBeamsTable        Loading multiple beams from BEAMS table
24-Aug-2026 20:11:44 2026-08-24 20:11:44        SEVERE        imagepol::sigmalinpolposang        Exception Reported: Exception: Input image has multiple beams and the corresponding beams for the stokes planes necessary for this computation are not equal..
24-Aug-2026 20:11:44 2026-08-24 20:11:44        SEVERE        imagepol::sigmalinpolposang+        ... thrown by casacore::Bool casa::ImagePolarimetry::_checkBeams(const std::vector<casa::ImagePolarimetry::StokesTypes>&, casacore::Bool, casacore::Bool) const at File: /source/casa6/casatools/src/code/imageanalysis/ImageAnalysis/ImagePolarimetry.cc, line: 1626
24-Aug-2026 20:11:44 test_tool_imagepol.py::po_sigmalinpolposang_test::test_multibeam
24-Aug-2026 20:11:44 Test multibeam images for correct behavior
24-Aug-2026 20:11:44 PASSED
24-Aug-2026 20:11:44
24-Aug-2026 20:11:44 2026-08-24 20:11:44        INFO        ImageFITSConverter::readBeamsTable        Loading multiple beams from BEAMS table
24-Aug-2026 20:11:44 2026-08-24 20:11:44        INFO        ImagePolTask::_sigma         Determined noise from V image to be 1.0119
24-Aug-2026 20:11:44 2026-08-24 20:11:44        INFO        ImagePolTask::_sigma         Debiasing with sigma = 1.0119
24-Aug-2026 20:11:44 2026-08-24 20:11:44        INFO        ImageFITSConverter::readBeamsTable        Loading multiple beams from BEAMS table
24-Aug-2026 20:11:44 test_tool_imagepol.py::po_totpolint_test::test_multibeam
24-Aug-2026 20:11:44 Test multibeam images for correct behavior
24-Aug-2026 20:11:44 PASSED
24-Aug-2026 20:11:44
24-Aug-2026 20:11:44 - generated xml file: /home/casatest/casa6/casatestutils/nosedir/xml/test_tool_imagepol/nose.xml -
24-Aug-2026 20:11:44 ======================== 17 passed, 1 warning in 1.43s =========================
24-Aug-2026 20:11:44 ============================= test session starts ==============================
24-Aug-2026 20:11:44 platform linux -- Python 3.10.16, pytest-8.3.4, pluggy-1.5.0 -- /home/casatest/venv/bin/python3.10
24-Aug-2026 20:11:44 cachedir: .pytest_cache
24-Aug-2026 20:11:44 rootdir: /home/casatest/casa6/casatestutils/nosedir/test_tool_msmetadata
24-Aug-2026 20:11:44 configfile: pytest.ini
24-Aug-2026 20:11:44 collecting ... collected 85 items
24-Aug-2026 20:11:44
24-Aug-2026 20:11:44
24-Aug-2026 20:11:45 2026-08-24 20:11:45        INFO        msmetadata_cmpt.cc::open        Performing internal consistency checks on /opt/casa/data/casatestdata/unittest/msmetadata/MSMetaData.ms...
24-Aug-2026 20:11:45 2026-08-24 20:11:45        SEVERE        msmetadata_cmpt.cc::chanwidths        Exception Reported: From/to units not consistent. Cannot convert Hz to km/s at File: /source/casainstall/include/casacore/casa/Quanta/Quantum.tcc, line: 256
24-Aug-2026 20:11:45 test_tool_msmetadata.py::msmetadata_test::test_CAS7463
24-Aug-2026 20:11:45 PASSED
24-Aug-2026 20:11:45
24-Aug-2026 20:11:45 2026-08-24 20:11:45        INFO        msmetadata_cmpt.cc::open        Performing internal consistency checks on /opt/casa/data/casatestdata/unittest/msmetadata/MSMetaData.ms...
24-Aug-2026 20:11:45 2026-08-24 20:11:45        INFO        MSFitsInput::MSFitsInput        Converting FITS file '/opt/casa/data/casatestdata/unittest/msmetadata/W3OH_MC.UVFITS' to MeasurementSet 'lala.ms'
24-Aug-2026 20:11:45 2026-08-24 20:11:45        INFO        MSFitsInput::setupMeasurementSet        Using tile shape [1, 38, 3449] for VLA with obstype=0
24-Aug-2026 20:11:45 2026-08-24 20:11:46        INFO        MSFitsInput::fillMSMainTableColWise        SOURCE not found in UU---SIN VV---SIN WW---SIN BASELINE DATE DATE
24-Aug-2026 20:11:45 2026-08-24 20:11:46        INFO        MSFitsInput::fillMSMainTableColWise        FREQSEL not found in UU---SIN VV---SIN WW---SIN BASELINE DATE DATE
24-Aug-2026 20:11:45 2026-08-24 20:11:46        INFO        MSFitsInput::fillMSMainTableColWise        Reading and writing 16311 visibility groups
24-Aug-2026 20:11:46 2026-08-24 20:11:46        INFO        MSFitsInput::readRandomGroupUVFits        extname=AIPS NX  nrows=1 ncols=7 rowsize=28 pcount=0 gcount=1
24-Aug-2026 20:11:46 2026-08-24 20:11:46        INFO        MSFitsInput::readRandomGroupUVFits        Skipping table, duplicate or unrecognized type: AIPS NX
24-Aug-2026 20:11:46 2026-08-24 20:11:46        INFO        MSFitsInput::readRandomGroupUVFits        extname=AIPS FQ  nrows=1 ncols=5 rowsize=24 pcount=0 gcount=1
24-Aug-2026 20:11:46 2026-08-24 20:11:46        INFO        MSFitsInput::readRandomGroupUVFits        extname=AIPS WX  nrows=155 ncols=11 rowsize=48 pcount=0 gcount=1
24-Aug-2026 20:11:46 2026-08-24 20:11:46        INFO        MSFitsInput::readRandomGroupUVFits        Skipping table, duplicate or unrecognized type: AIPS WX
24-Aug-2026 20:11:46 2026-08-24 20:11:46        INFO        MSFitsInput::readRandomGroupUVFits        extname=AIPS OF  nrows=100 ncols=7 rowsize=28 pcount=0 gcount=1
24-Aug-2026 20:11:46 2026-08-24 20:11:46        INFO        MSFitsInput::readRandomGroupUVFits        Skipping table, duplicate or unrecognized type: AIPS OF
24-Aug-2026 20:11:46 2026-08-24 20:11:46        INFO        MSFitsInput::readRandomGroupUVFits        extname=AIPS AN  nrows=29 ncols=14 rowsize=78 pcount=0 gcount=1
24-Aug-2026 20:11:46 2026-08-24 20:11:46        INFO        MSFitsInput::fillAntennaTable        This looks like an old VLA archive UVFITS file
24-Aug-2026 20:11:46 2026-08-24 20:11:46        INFO        MSFitsInput::fillAntennaTable        UVFITS file telescope position is 2.13393e-09 meters from CASA Observatories table VLA position
24-Aug-2026 20:11:46 2026-08-24 20:11:46        INFO        MSFitsInput::fillAntennaTable        Performing transformation of antenna positions from coordinate frame used by MODCOMPs to ITRF
24-Aug-2026 20:11:46 2026-08-24 20:11:46        INFO        MSFitsInput::fillExtraTables        Filling SOURCE table (this may take some time).
24-Aug-2026 20:11:46 2026-08-24 20:11:46        WARN        MSFitsInput::fillExtraTable        No systemic velocity for field 0
24-Aug-2026 20:11:46 2026-08-24 20:11:46        WARN        MSFitsInput::fillExtraTable        No rest frequency for field 0
24-Aug-2026 20:11:46 2026-08-24 20:11:46        INFO        msmetadata_cmpt.cc::open        Performing internal consistency checks on lala.ms...
24-Aug-2026 20:11:46 test_tool_msmetadata.py::msmetadata_test::test_CAS7837
24-Aug-2026 20:11:46 Test corner case with no intents to make sure it doesn't segfault
24-Aug-2026 20:11:46 PASSED
24-Aug-2026 20:11:46
24-Aug-2026 20:11:46 2026-08-24 20:11:46        INFO        msmetadata_cmpt.cc::open        Performing internal consistency checks on /opt/casa/data/casatestdata/unittest/msmetadata/MSMetaData.ms...
24-Aug-2026 20:11:46 2026-08-24 20:11:47        INFO        msmetadata_cmpt.cc::open        Performing internal consistency checks on cas7986.ms...
24-Aug-2026 20:11:46 2026-08-24 20:11:47        SEVERE        ms::close        Exception Reported: Exception: Illegal ANTENNA1 value 9 found in main table. /home/casatest/casa6/casatestutils/nosedir/test_tool_msmetadata/cas7986.ms/ANTENNA only has 8 rows (IDs).
24-Aug-2026 20:11:46 2026-08-24 20:11:47        SEVERE        ms::close+        ... thrown by void casa::MSChecker::checkReferentialIntegrity() const at File: /source/casa6/casatools/src/code/msvis/MSVis/MSChecker.cc, line: 73
24-Aug-2026 20:11:46 2026-08-24 20:11:47        INFO        msmetadata_cmpt.cc::open        Performing internal consistency checks on cas7986.ms...
24-Aug-2026 20:11:46 2026-08-24 20:11:47        SEVERE        msmetadata_cmpt.cc::open        Exception Reported: Exception: Illegal ANTENNA1 value 9 found in main table. /home/casatest/casa6/casatestutils/nosedir/test_tool_msmetadata/cas7986.ms/ANTENNA only has 8 rows (IDs).
24-Aug-2026 20:11:46 2026-08-24 20:11:47        SEVERE        msmetadata_cmpt.cc::open+        ... thrown by void casa::MSChecker::checkReferentialIntegrity() const at File: /source/casa6/casatools/src/code/msvis/MSVis/MSChecker.cc, line: 73
24-Aug-2026 20:11:46 2026-08-24 20:11:47        INFO        msmetadata_cmpt.cc::open        Performing internal consistency checks on cas7986.ms...
24-Aug-2026 20:11:46 2026-08-24 20:11:47        SEVERE        ms::close        Exception Reported: Exception: Illegal ANTENNA2 value 9 found in main table. /home/casatest/casa6/casatestutils/nosedir/test_tool_msmetadata/cas7986.ms/ANTENNA only has 8 rows (IDs).
24-Aug-2026 20:11:46 2026-08-24 20:11:47        SEVERE        ms::close+        ... thrown by void casa::MSChecker::checkReferentialIntegrity() const at File: /source/casa6/casatools/src/code/msvis/MSVis/MSChecker.cc, line: 73
24-Aug-2026 20:11:46 2026-08-24 20:11:47        INFO        msmetadata_cmpt.cc::open        Performing internal consistency checks on cas7986.ms...
24-Aug-2026 20:11:46 2026-08-24 20:11:47        SEVERE        msmetadata_cmpt.cc::open        Exception Reported: Exception: Illegal ANTENNA2 value 9 found in main table. /home/casatest/casa6/casatestutils/nosedir/test_tool_msmetadata/cas7986.ms/ANTENNA only has 8 rows (IDs).
24-Aug-2026 20:11:46 2026-08-24 20:11:47        SEVERE        msmetadata_cmpt.cc::open+        ... thrown by void casa::MSChecker::checkReferentialIntegrity() const at File: /source/casa6/casatools/src/code/msvis/MSVis/MSChecker.cc, line: 73
24-Aug-2026 20:11:46 2026-08-24 20:11:47        INFO        msmetadata_cmpt.cc::open        Performing internal consistency checks on cas7986.ms...
24-Aug-2026 20:11:46 2026-08-24 20:11:47        SEVERE        ms::close        Exception Reported: Exception: Illegal DATA_DESC_ID value 9 found in main table. /home/casatest/casa6/casatestutils/nosedir/test_tool_msmetadata/cas7986.ms/DATA_DESCRIPTION only has 3 rows (IDs).
24-Aug-2026 20:11:46 2026-08-24 20:11:47        SEVERE        ms::close+        ... thrown by void casa::MSChecker::checkReferentialIntegrity() const at File: /source/casa6/casatools/src/code/msvis/MSVis/MSChecker.cc, line: 73
24-Aug-2026 20:11:46 2026-08-24 20:11:47        INFO        msmetadata_cmpt.cc::open        Performing internal consistency checks on cas7986.ms...
24-Aug-2026 20:11:46 2026-08-24 20:11:47        SEVERE        msmetadata_cmpt.cc::open        Exception Reported: Exception: Illegal DATA_DESC_ID value 9 found in main table. /home/casatest/casa6/casatestutils/nosedir/test_tool_msmetadata/cas7986.ms/DATA_DESCRIPTION only has 3 rows (IDs).
24-Aug-2026 20:11:46 2026-08-24 20:11:47        SEVERE        msmetadata_cmpt.cc::open+        ... thrown by void casa::MSChecker::checkReferentialIntegrity() const at File: /source/casa6/casatools/src/code/msvis/MSVis/MSChecker.cc, line: 73
24-Aug-2026 20:11:46 2026-08-24 20:11:47        INFO        msmetadata_cmpt.cc::open        Performing internal consistency checks on cas7986.ms...
24-Aug-2026 20:11:46 2026-08-24 20:11:47        SEVERE        ms::close        Exception Reported: Exception: Illegal FIELD_ID value 9 found in main table. /home/casatest/casa6/casatestutils/nosedir/test_tool_msmetadata/cas7986.ms/FIELD only has 1 rows (IDs).
24-Aug-2026 20:11:46 2026-08-24 20:11:47        SEVERE        ms::close+        ... thrown by void casa::MSChecker::checkReferentialIntegrity() const at File: /source/casa6/casatools/src/code/msvis/MSVis/MSChecker.cc, line: 73
24-Aug-2026 20:11:46 2026-08-24 20:11:47        INFO        msmetadata_cmpt.cc::open        Performing internal consistency checks on cas7986.ms...
24-Aug-2026 20:11:46 2026-08-24 20:11:47        SEVERE        msmetadata_cmpt.cc::open        Exception Reported: Exception: Illegal FIELD_ID value 9 found in main table. /home/casatest/casa6/casatestutils/nosedir/test_tool_msmetadata/cas7986.ms/FIELD only has 1 rows (IDs).
24-Aug-2026 20:11:46 2026-08-24 20:11:47        SEVERE        msmetadata_cmpt.cc::open+        ... thrown by void casa::MSChecker::checkReferentialIntegrity() const at File: /source/casa6/casatools/src/code/msvis/MSVis/MSChecker.cc, line: 73
24-Aug-2026 20:11:46 test_tool_msmetadata.py::msmetadata_test::test_CAS7986
24-Aug-2026 20:11:46 Verify datasets with referential integrity issues cause errors
24-Aug-2026 20:11:46 PASSED
24-Aug-2026 20:11:46
24-Aug-2026 20:11:46 2026-08-24 20:11:47        INFO        msmetadata_cmpt.cc::open        Performing internal consistency checks on /opt/casa/data/casatestdata/unittest/msmetadata/MSMetaData.ms...
24-Aug-2026 20:11:47 2026-08-24 20:11:47        INFO        msmetadata_cmpt.cc::open        Performing internal consistency checks on /opt/casa/data/casatestdata/unittest/msmetadata/fdmtdm.ms...
24-Aug-2026 20:11:47 test_tool_msmetadata.py::msmetadata_test::test_alma_fdmtdm_heavy_online_averaging
24-Aug-2026 20:11:47 CAS-14435 proper fdm/tdm identification in cases
24-Aug-2026 20:11:47 of heavy online averaging
24-Aug-2026 20:11:47 PASSED
24-Aug-2026 20:11:47
24-Aug-2026 20:11:47 2026-08-24 20:11:47        INFO        msmetadata_cmpt.cc::open        Performing internal consistency checks on /opt/casa/data/casatestdata/unittest/msmetadata/MSMetaData.ms...
24-Aug-2026 20:11:47 test_tool_msmetadata.py::msmetadata_test::test_almaspws
24-Aug-2026 20:11:47 Test almaspws()
24-Aug-2026 20:11:47 PASSED
24-Aug-2026 20:11:47
24-Aug-2026 20:11:47 2026-08-24 20:11:47        INFO        msmetadata_cmpt.cc::open        Performing internal consistency checks on /opt/casa/data/casatestdata/unittest/msmetadata/MSMetaData.ms...
24-Aug-2026 20:11:47 test_tool_msmetadata.py::msmetadata_test::test_antennadiamter
24-Aug-2026 20:11:47 Test msmetadata.antennadiameter
24-Aug-2026 20:11:47 PASSED
24-Aug-2026 20:11:47
24-Aug-2026 20:11:47 2026-08-24 20:11:47        INFO        msmetadata_cmpt.cc::open        Performing internal consistency checks on /opt/casa/data/casatestdata/unittest/msmetadata/MSMetaData.ms...
24-Aug-2026 20:11:47 test_tool_msmetadata.py::msmetadata_test::test_antennanames_and_antennaids
24-Aug-2026 20:11:47 Test antennanames() and antennaids()
24-Aug-2026 20:11:47 PASSED
24-Aug-2026 20:11:47
24-Aug-2026 20:11:47 2026-08-24 20:11:47        INFO        msmetadata_cmpt.cc::open        Performing internal consistency checks on /opt/casa/data/casatestdata/unittest/msmetadata/MSMetaData.ms...
24-Aug-2026 20:11:47 2026-08-24 20:11:47        INFO        MSMetaData::_computeScanAndSubScanProperties         Computing scan and subscan properties...
24-Aug-2026 20:11:47 2026-08-24 20:11:47        SEVERE        msmetadata_cmpt.cc::antennasforscan        Exception Reported: Exception: No matching scans found.
24-Aug-2026 20:11:47 2026-08-24 20:11:47        SEVERE        msmetadata_cmpt.cc::antennasforscan+        ... thrown by std::set<casacore::ScanKey> casac::msmetadata::_getScanKeys(long int, long int, long int) const at File: src/tools/msmetadata/msmetadata_cmpt.cc, line: 2485
24-Aug-2026 20:11:47 2026-08-24 20:11:47        SEVERE        msmetadata_cmpt.cc::antennasforscan        Exception Reported: Exception: No matching scans found.
24-Aug-2026 20:11:47 2026-08-24 20:11:47        SEVERE        msmetadata_cmpt.cc::antennasforscan+        ... thrown by std::set<casacore::ScanKey> casac::msmetadata::_getScanKeys(long int, long int, long int) const at File: src/tools/msmetadata/msmetadata_cmpt.cc, line: 2485
24-Aug-2026 20:11:47 test_tool_msmetadata.py::msmetadata_test::test_antennasforscan
24-Aug-2026 20:11:47 Test msmetadata.antennasforscan()
24-Aug-2026 20:11:47 PASSED
24-Aug-2026 20:11:47
24-Aug-2026 20:11:47 2026-08-24 20:11:47        INFO        msmetadata_cmpt.cc::open        Performing internal consistency checks on /opt/casa/data/casatestdata/unittest/msmetadata/MSMetaData.ms...
24-Aug-2026 20:11:47 2026-08-24 20:11:47        SEVERE        msmetadata_cmpt.cc::antennastations        Exception Reported: No antenna ID may be less than zero when multiple IDs specified.
24-Aug-2026 20:11:47 2026-08-24 20:11:47        SEVERE        msmetadata_cmpt.cc::antennastations        Exception Reported: Exception: MSMetaData::_hasAntennaID: Requested antenna ID 20 is greater than or equal to the number of records (15) in this MS's ANTENNA table.
24-Aug-2026 20:11:47 2026-08-24 20:11:47        SEVERE        msmetadata_cmpt.cc::antennastations+        ... thrown by void casacore::MSMetaData::_hasAntennaID(casacore::Int) at File: /source/casa6/casatools/casacore/ms/MSOper/MSMetaData.cc, line: 4928
24-Aug-2026 20:11:47 2026-08-24 20:11:47        SEVERE        msmetadata_cmpt.cc::antennastations        Exception Reported: Exception: MSMetaData::_hasAntennaID: Requested antenna ID 20 is greater than or equal to the number of records (15) in this MS's ANTENNA table.
24-Aug-2026 20:11:47 2026-08-24 20:11:47        SEVERE        msmetadata_cmpt.cc::antennastations+        ... thrown by void casacore::MSMetaData::_hasAntennaID(casacore::Int) at File: /source/casa6/casatools/casacore/ms/MSOper/MSMetaData.cc, line: 4928
24-Aug-2026 20:11:47 test_tool_msmetadata.py::msmetadata_test::test_antennastations
24-Aug-2026 20:11:47 Test antennastations()
24-Aug-2026 20:11:47 PASSED
24-Aug-2026 20:11:47
24-Aug-2026 20:11:47 2026-08-24 20:11:47        INFO        msmetadata_cmpt.cc::open        Performing internal consistency checks on /opt/casa/data/casatestdata/unittest/msmetadata/MSMetaData.ms...
24-Aug-2026 20:11:47 2026-08-24 20:11:47        SEVERE        msmetadata_cmpt.cc::bandwidths        Exception Reported: Exception: Spectral window ID 50 out of range, must be less than or equal to 39.
24-Aug-2026 20:11:47 2026-08-24 20:11:47        SEVERE        msmetadata_cmpt.cc::bandwidths+        ... thrown by void casac::msmetadata::_checkSpwId(int, bool) const at File: src/tools/msmetadata/msmetadata_cmpt.cc, line: 2443
24-Aug-2026 20:11:47 2026-08-24 20:11:47        SEVERE        msmetadata_cmpt.cc::bandwidths        Exception Reported: Exception: Spectral window ID 50 out of range, must be less than or equal to 39.
24-Aug-2026 20:11:47 2026-08-24 20:11:47        SEVERE        msmetadata_cmpt.cc::bandwidths+        ... thrown by void casac::msmetadata::_checkSpwId(int, bool) const at File: src/tools/msmetadata/msmetadata_cmpt.cc, line: 2443
24-Aug-2026 20:11:47 2026-08-24 20:11:47        SEVERE        msmetadata_cmpt.cc::bandwidths        Exception Reported: Exception: When specified as an array, no element of spws may be < 0.
24-Aug-2026 20:11:47 2026-08-24 20:11:47        SEVERE        msmetadata_cmpt.cc::bandwidths+        ... thrown by casac::variant* casac::msmetadata::bandwidths(const casac::variant&) at File: src/tools/msmetadata/msmetadata_cmpt.cc, line: 575
24-Aug-2026 20:11:47 test_tool_msmetadata.py::msmetadata_test::test_bandwidths
24-Aug-2026 20:11:47 Test bandwidths()
24-Aug-2026 20:11:47 PASSED
24-Aug-2026 20:11:47
24-Aug-2026 20:11:47 2026-08-24 20:11:47        INFO        msmetadata_cmpt.cc::open        Performing internal consistency checks on /opt/casa/data/casatestdata/unittest/msmetadata/MSMetaData.ms...
24-Aug-2026 20:11:47 test_tool_msmetadata.py::msmetadata_test::test_chanavgspws
24-Aug-2026 20:11:47 Test chanavgspws()
24-Aug-2026 20:11:47 PASSED
24-Aug-2026 20:11:47
24-Aug-2026 20:11:47 2026-08-24 20:11:47        INFO        msmetadata_cmpt.cc::open        Performing internal consistency checks on /opt/casa/data/casatestdata/unittest/msmetadata/MSMetaData.ms...
24-Aug-2026 20:11:47 test_tool_msmetadata.py::msmetadata_test::test_chaneffbws
24-Aug-2026 20:11:47 Test chaneffbws()
24-Aug-2026 20:11:47 PASSED
24-Aug-2026 20:11:47
24-Aug-2026 20:11:47 2026-08-24 20:11:47        INFO        msmetadata_cmpt.cc::open        Performing internal consistency checks on /opt/casa/data/casatestdata/unittest/msmetadata/MSMetaData.ms...
24-Aug-2026 20:11:47 test_tool_msmetadata.py::msmetadata_test::test_chanres
24-Aug-2026 20:11:47 Test chanres()
24-Aug-2026 20:11:47 PASSED
24-Aug-2026 20:11:47
24-Aug-2026 20:11:47 2026-08-24 20:11:47        INFO        msmetadata_cmpt.cc::open        Performing internal consistency checks on /opt/casa/data/casatestdata/unittest/msmetadata/MSMetaData.ms...
24-Aug-2026 20:11:47 2026-08-24 20:11:47        SEVERE        msmetadata_cmpt.cc::chanwidths        Exception Reported: Exception: Spectral window ID 50 out of range, must be nonnegative and less than or equal to 39.
24-Aug-2026 20:11:47 2026-08-24 20:11:47        SEVERE        msmetadata_cmpt.cc::chanwidths+        ... thrown by void casac::msmetadata::_checkSpwId(int, bool) const at File: src/tools/msmetadata/msmetadata_cmpt.cc, line: 2443
24-Aug-2026 20:11:47 2026-08-24 20:11:47        SEVERE        msmetadata_cmpt.cc::chanwidths        Exception Reported: Exception: Spectral window ID -2 out of range, must be nonnegative and less than or equal to 39.
24-Aug-2026 20:11:47 2026-08-24 20:11:47        SEVERE        msmetadata_cmpt.cc::chanwidths+        ... thrown by void casac::msmetadata::_checkSpwId(int, bool) const at File: src/tools/msmetadata/msmetadata_cmpt.cc, line: 2443
24-Aug-2026 20:11:47 2026-08-24 20:11:47        SEVERE        msmetadata_cmpt.cc::chanwidths        Exception Reported: Tool is not attached to an MS. Use open()
24-Aug-2026 20:11:47 2026-08-24 20:11:47        SEVERE        msmetadata_cmpt.cc::chanfreqs        Exception Reported: Tool is not attached to an MS. Use open()
24-Aug-2026 20:11:47 2026-08-24 20:11:47        SEVERE        msmetadata_cmpt.cc::meanfreq        Exception Reported: Tool is not attached to an MS. Use open()
24-Aug-2026 20:11:47 2026-08-24 20:11:47        SEVERE        msmetadata_cmpt.cc::sideband        Exception Reported: Tool is not attached to an MS. Use open()
24-Aug-2026 20:11:47 2026-08-24 20:11:47        SEVERE        msmetadata_cmpt.cc::effexposuretime        Exception Reported: Tool is not attached to an MS. Use open()
24-Aug-2026 20:11:47 test_tool_msmetadata.py::msmetadata_test::test_chanwidths
24-Aug-2026 20:11:47 Test chanwidths()
24-Aug-2026 20:11:47 PASSED
24-Aug-2026 20:11:47
24-Aug-2026 20:11:47 2026-08-24 20:11:47        INFO        msmetadata_cmpt.cc::open        Performing internal consistency checks on /opt/casa/data/casatestdata/unittest/msmetadata/MSMetaData.ms...
24-Aug-2026 20:11:47 test_tool_msmetadata.py::msmetadata_test::test_corrbit
24-Aug-2026 20:11:47 Test corrbit()
24-Aug-2026 20:11:47 PASSED
24-Aug-2026 20:11:47
24-Aug-2026 20:11:47 2026-08-24 20:11:47        INFO        msmetadata_cmpt.cc::open        Performing internal consistency checks on /opt/casa/data/casatestdata/unittest/msmetadata/MSMetaData.ms...
24-Aug-2026 20:11:47 2026-08-24 20:11:47        SEVERE        msmetadata_cmpt.cc::corrprodsforpol        Exception Reported: Exception: Polarization ID cannot be negative.
24-Aug-2026 20:11:47 2026-08-24 20:11:47        SEVERE        msmetadata_cmpt.cc::corrprodsforpol+        ... thrown by void casac::msmetadata::_checkPolId(int, bool) const at File: src/tools/msmetadata/msmetadata_cmpt.cc, line: 2459
24-Aug-2026 20:11:47 2026-08-24 20:11:47        SEVERE        msmetadata_cmpt.cc::corrprodsforpol        Exception Reported: Exception: Polarization ID 2 out of range, must be less than 2.
24-Aug-2026 20:11:47 2026-08-24 20:11:47        SEVERE        msmetadata_cmpt.cc::corrprodsforpol+        ... thrown by void casac::msmetadata::_checkPolId(int, bool) const at File: src/tools/msmetadata/msmetadata_cmpt.cc, line: 2453
24-Aug-2026 20:11:47 test_tool_msmetadata.py::msmetadata_test::test_corrprodsforpol
24-Aug-2026 20:11:47 Test msmetadata.corrprodssforpol()
24-Aug-2026 20:11:47 PASSED
24-Aug-2026 20:11:47
24-Aug-2026 20:11:47 2026-08-24 20:11:47        INFO        msmetadata_cmpt.cc::open        Performing internal consistency checks on /opt/casa/data/casatestdata/unittest/msmetadata/MSMetaData.ms...
24-Aug-2026 20:11:47 2026-08-24 20:11:47        SEVERE        msmetadata_cmpt.cc::corrtypesforpol        Exception Reported: Exception: Polarization ID cannot be negative.
24-Aug-2026 20:11:47 2026-08-24 20:11:47        SEVERE        msmetadata_cmpt.cc::corrtypesforpol+        ... thrown by void casac::msmetadata::_checkPolId(int, bool) const at File: src/tools/msmetadata/msmetadata_cmpt.cc, line: 2459
24-Aug-2026 20:11:47 2026-08-24 20:11:47        SEVERE        msmetadata_cmpt.cc::corrtypesforpol        Exception Reported: Exception: Polarization ID 2 out of range, must be less than 2.
24-Aug-2026 20:11:47 2026-08-24 20:11:47        SEVERE        msmetadata_cmpt.cc::corrtypesforpol+        ... thrown by void casac::msmetadata::_checkPolId(int, bool) const at File: src/tools/msmetadata/msmetadata_cmpt.cc, line: 2453
24-Aug-2026 20:11:47 test_tool_msmetadata.py::msmetadata_test::test_corrtypesforpol
24-Aug-2026 20:11:47 Test msmetadata.corrtypesforpol()
24-Aug-2026 20:11:47 PASSED
24-Aug-2026 20:11:47
24-Aug-2026 20:11:47 2026-08-24 20:11:47        INFO        msmetadata_cmpt.cc::open        Performing internal consistency checks on /opt/casa/data/casatestdata/unittest/msmetadata/MSMetaData.ms...
24-Aug-2026 20:11:47 test_tool_msmetadata.py::msmetadata_test::test_datadescids
24-Aug-2026 20:11:47 Test datadescids()
24-Aug-2026 20:11:47 PASSED
24-Aug-2026 20:11:47
24-Aug-2026 20:11:47 2026-08-24 20:11:47        INFO        msmetadata_cmpt.cc::open        Performing internal consistency checks on /opt/casa/data/casatestdata/unittest/msmetadata/MSMetaData.ms...
24-Aug-2026 20:11:47 2026-08-24 20:11:47        SEVERE        msmetadata_cmpt.cc::exposuretime        Exception Reported: Exception: MS has no data description ID for spectral window ID 0 and polarization ID 0.
24-Aug-2026 20:11:47 2026-08-24 20:11:47        SEVERE        msmetadata_cmpt.cc::exposuretime+        ... thrown by casac::record* casac::msmetadata::exposuretime(long int, long int, long int, long int, long int) at File: src/tools/msmetadata/msmetadata_cmpt.cc, line: 816
24-Aug-2026 20:11:47 2026-08-24 20:11:47        INFO        MSMetaData::_computeScanAndSubScanProperties         Computing scan and subscan properties...
24-Aug-2026 20:11:47 test_tool_msmetadata.py::msmetadata_test::test_exposuretime
24-Aug-2026 20:11:47 Test exposuretime()
24-Aug-2026 20:11:47 PASSED
24-Aug-2026 20:11:47
24-Aug-2026 20:11:47 2026-08-24 20:11:47        INFO        msmetadata_cmpt.cc::open        Performing internal consistency checks on /opt/casa/data/casatestdata/unittest/msmetadata/MSMetaData.ms...
24-Aug-2026 20:11:47 test_tool_msmetadata.py::msmetadata_test::test_fdmspws
24-Aug-2026 20:11:47 Test fdmspws()
24-Aug-2026 20:11:47 PASSED
24-Aug-2026 20:11:47
24-Aug-2026 20:11:47 2026-08-24 20:11:47        INFO        msmetadata_cmpt.cc::open        Performing internal consistency checks on /opt/casa/data/casatestdata/unittest/msmetadata/MSMetaData.ms...
24-Aug-2026 20:11:47 test_tool_msmetadata.py::msmetadata_test::test_fieldnames
24-Aug-2026 20:11:47 PASSED
24-Aug-2026 20:11:47
24-Aug-2026 20:11:47 2026-08-24 20:11:47        INFO        msmetadata_cmpt.cc::open        Performing internal consistency checks on /opt/casa/data/casatestdata/unittest/msmetadata/MSMetaData.ms...
24-Aug-2026 20:11:47 test_tool_msmetadata.py::msmetadata_test::test_fieldsforintent
24-Aug-2026 20:11:47 Test fieldsforintent()
24-Aug-2026 20:11:47 PASSED
24-Aug-2026 20:11:47
24-Aug-2026 20:11:47 2026-08-24 20:11:47        INFO        msmetadata_cmpt.cc::open        Performing internal consistency checks on /opt/casa/data/casatestdata/unittest/msmetadata/MSMetaData.ms...
24-Aug-2026 20:11:47 test_tool_msmetadata.py::msmetadata_test::test_fieldsforname
24-Aug-2026 20:11:47 Test fieldforname()
24-Aug-2026 20:11:47 PASSED
24-Aug-2026 20:11:47
24-Aug-2026 20:11:47 2026-08-24 20:11:47        INFO        msmetadata_cmpt.cc::open        Performing internal consistency checks on /opt/casa/data/casatestdata/unittest/msmetadata/MSMetaData.ms...
24-Aug-2026 20:11:47 2026-08-24 20:11:47        INFO        MSMetaData::_computeScanAndSubScanProperties         Computing scan and subscan properties...
24-Aug-2026 20:11:47 2026-08-24 20:11:47        SEVERE        msmetadata_cmpt.cc::fieldsforscans        Exception Reported: Exception: When asmap is true, both obsid and arrayid must be nonnegative.
24-Aug-2026 20:11:47 2026-08-24 20:11:47        SEVERE        msmetadata_cmpt.cc::fieldsforscans+        ... thrown by casac::variant* casac::msmetadata::fieldsforscans(const std::vector<long int>&, bool, long int, long int, bool) at File: src/tools/msmetadata/msmetadata_cmpt.cc, line: 944
24-Aug-2026 20:11:47 test_tool_msmetadata.py::msmetadata_test::test_fieldsforscan
24-Aug-2026 20:11:47 Test fieldsforscan() and fieldsforscans()
24-Aug-2026 20:11:47 PASSED
24-Aug-2026 20:11:47
24-Aug-2026 20:11:47 2026-08-24 20:11:47        INFO        msmetadata_cmpt.cc::open        Performing internal consistency checks on /opt/casa/data/casatestdata/unittest/msmetadata/MSMetaData.ms...
24-Aug-2026 20:11:47 test_tool_msmetadata.py::msmetadata_test::test_fieldsforsource
24-Aug-2026 20:11:47 Test fieldsforsource() and fieldsforsources()
24-Aug-2026 20:11:47 PASSED
24-Aug-2026 20:11:47
24-Aug-2026 20:11:47 2026-08-24 20:11:47        INFO        msmetadata_cmpt.cc::open        Performing internal consistency checks on /opt/casa/data/casatestdata/unittest/msmetadata/MSMetaData.ms...
24-Aug-2026 20:11:47 2026-08-24 20:11:47        INFO        MSMetaData::_computeScanAndSubScanProperties         Computing scan and subscan properties...
24-Aug-2026 20:11:47 test_tool_msmetadata.py::msmetadata_test::test_fieldsforspw
24-Aug-2026 20:11:47 Test fieldsforspw()
24-Aug-2026 20:11:47 PASSED
24-Aug-2026 20:11:47
24-Aug-2026 20:11:47 2026-08-24 20:11:48        INFO        msmetadata_cmpt.cc::open        Performing internal consistency checks on /opt/casa/data/casatestdata/unittest/msmetadata/MSMetaData.ms...
24-Aug-2026 20:11:47 test_tool_msmetadata.py::msmetadata_test::test_fieldsfortimes
24-Aug-2026 20:11:47 Test fieldsfortimes()
24-Aug-2026 20:11:47 PASSED
24-Aug-2026 20:11:47
24-Aug-2026 20:11:47 2026-08-24 20:11:48        INFO        msmetadata_cmpt.cc::open        Performing internal consistency checks on /opt/casa/data/casatestdata/unittest/msmetadata/MSMetaData.ms...
24-Aug-2026 20:11:47 test_tool_msmetadata.py::msmetadata_test::test_intents
24-Aug-2026 20:11:47 Test intents()
24-Aug-2026 20:11:47 PASSED
24-Aug-2026 20:11:47
24-Aug-2026 20:11:47 2026-08-24 20:11:48        INFO        msmetadata_cmpt.cc::open        Performing internal consistency checks on /opt/casa/data/casatestdata/unittest/msmetadata/MSMetaData.ms...
24-Aug-2026 20:11:47 test_tool_msmetadata.py::msmetadata_test::test_intentsforfield
24-Aug-2026 20:11:47 Test intentsforfield()
24-Aug-2026 20:11:47 PASSED
24-Aug-2026 20:11:47
24-Aug-2026 20:11:47 2026-08-24 20:11:48        INFO        msmetadata_cmpt.cc::open        Performing internal consistency checks on /opt/casa/data/casatestdata/unittest/msmetadata/MSMetaData.ms...
24-Aug-2026 20:11:47 2026-08-24 20:11:48        INFO        MSMetaData::_computeScanAndSubScanProperties         Computing scan and subscan properties...
24-Aug-2026 20:11:47 test_tool_msmetadata.py::msmetadata_test::test_intentsforscan
24-Aug-2026 20:11:47 Test intentsforscan()
24-Aug-2026 20:11:47 PASSED
24-Aug-2026 20:11:47
24-Aug-2026 20:11:47 2026-08-24 20:11:48        INFO        msmetadata_cmpt.cc::open        Performing internal consistency checks on /opt/casa/data/casatestdata/unittest/msmetadata/MSMetaData.ms...
24-Aug-2026 20:11:47 test_tool_msmetadata.py::msmetadata_test::test_intentsforspw
24-Aug-2026 20:11:47 Test intentsforspw()
24-Aug-2026 20:11:47 PASSED
24-Aug-2026 20:11:47
24-Aug-2026 20:11:47 2026-08-24 20:11:48        INFO        msmetadata_cmpt.cc::open        Performing internal consistency checks on /opt/casa/data/casatestdata/unittest/msmetadata/MSMetaData.ms...
24-Aug-2026 20:11:47 test_tool_msmetadata.py::msmetadata_test::test_name
24-Aug-2026 20:11:47 Test name(), CAS-6817
24-Aug-2026 20:11:47 PASSED
24-Aug-2026 20:11:47
24-Aug-2026 20:11:47 2026-08-24 20:11:48        INFO        msmetadata_cmpt.cc::open        Performing internal consistency checks on /opt/casa/data/casatestdata/unittest/msmetadata/MSMetaData.ms...
24-Aug-2026 20:11:47 test_tool_msmetadata.py::msmetadata_test::test_namesforfields
24-Aug-2026 20:11:47 Test namesforfields()
24-Aug-2026 20:11:47 PASSED
24-Aug-2026 20:11:47
24-Aug-2026 20:11:47 2026-08-24 20:11:48        INFO        msmetadata_cmpt.cc::open        Performing internal consistency checks on /opt/casa/data/casatestdata/unittest/msmetadata/MSMetaData.ms...
24-Aug-2026 20:11:47 2026-08-24 20:11:48        SEVERE        msmetadata_cmpt.cc::namesforspws        Exception Reported: Exception: Spectral window ID must be nonnegative..
24-Aug-2026 20:11:47 2026-08-24 20:11:48        SEVERE        msmetadata_cmpt.cc::namesforspws+        ... thrown by std::vector<std::__cxx11::basic_string<char> > casac::msmetadata::namesforspws(const casac::variant&) at File: src/tools/msmetadata/msmetadata_cmpt.cc, line: 1171
24-Aug-2026 20:11:47 2026-08-24 20:11:48        SEVERE        msmetadata_cmpt.cc::namesforspws        Exception Reported: Exception: All spectral window IDs must be nonnegative..
24-Aug-2026 20:11:47 2026-08-24 20:11:48        SEVERE        msmetadata_cmpt.cc::namesforspws+        ... thrown by std::vector<std::__cxx11::basic_string<char> > casac::msmetadata::namesforspws(const casac::variant&) at File: src/tools/msmetadata/msmetadata_cmpt.cc, line: 1181
24-Aug-2026 20:11:47 2026-08-24 20:11:48        SEVERE        msmetadata_cmpt.cc::namesforspws        Exception Reported: Exception: Spectral window ID must be less than total number of spws.
24-Aug-2026 20:11:47 2026-08-24 20:11:48        SEVERE        msmetadata_cmpt.cc::namesforspws+        ... thrown by std::vector<std::__cxx11::basic_string<char> > casac::msmetadata::namesforspws(const casac::variant&) at File: src/tools/msmetadata/msmetadata_cmpt.cc, line: 1172
24-Aug-2026 20:11:47 2026-08-24 20:11:48        SEVERE        msmetadata_cmpt.cc::namesforspws        Exception Reported: Exception: All spectral window IDs must be less than the total number of spws.
24-Aug-2026 20:11:47 2026-08-24 20:11:48        SEVERE        msmetadata_cmpt.cc::namesforspws+        ... thrown by std::vector<std::__cxx11::basic_string<char> > casac::msmetadata::namesforspws(const casac::variant&) at File: src/tools/msmetadata/msmetadata_cmpt.cc, line: 1185
24-Aug-2026 20:11:47 test_tool_msmetadata.py::msmetadata_test::test_namesforspws
24-Aug-2026 20:11:47 Test namesforspws()
24-Aug-2026 20:11:47 PASSED
24-Aug-2026 20:11:47
24-Aug-2026 20:11:47 2026-08-24 20:11:48        INFO        msmetadata_cmpt.cc::open        Performing internal consistency checks on /opt/casa/data/casatestdata/unittest/msmetadata/MSMetaData.ms...
24-Aug-2026 20:11:47 test_tool_msmetadata.py::msmetadata_test::test_nantennas
24-Aug-2026 20:11:47 Test nantennas()
24-Aug-2026 20:11:47 PASSED
24-Aug-2026 20:11:47
24-Aug-2026 20:11:47 2026-08-24 20:11:48        INFO        msmetadata_cmpt.cc::open        Performing internal consistency checks on /opt/casa/data/casatestdata/unittest/msmetadata/MSMetaData.ms...
24-Aug-2026 20:11:47 test_tool_msmetadata.py::msmetadata_test::test_narrays
24-Aug-2026 20:11:47 Test narrays()
24-Aug-2026 20:11:47 PASSED
24-Aug-2026 20:11:47
24-Aug-2026 20:11:47 2026-08-24 20:11:48        INFO        msmetadata_cmpt.cc::open        Performing internal consistency checks on /opt/casa/data/casatestdata/unittest/msmetadata/MSMetaData.ms...
24-Aug-2026 20:11:47 test_tool_msmetadata.py::msmetadata_test::test_nbaselines
24-Aug-2026 20:11:47 Verify nbaselines()
24-Aug-2026 20:11:47 PASSED
24-Aug-2026 20:11:47
24-Aug-2026 20:11:47 2026-08-24 20:11:48        INFO        msmetadata_cmpt.cc::open        Performing internal consistency checks on /opt/casa/data/casatestdata/unittest/msmetadata/MSMetaData.ms...
24-Aug-2026 20:11:47 test_tool_msmetadata.py::msmetadata_test::test_ncorrforpol
24-Aug-2026 20:11:47 Test msmetadata.ncorrforpol()
24-Aug-2026 20:11:47 PASSED
24-Aug-2026 20:11:47
24-Aug-2026 20:11:47 2026-08-24 20:11:48        INFO        msmetadata_cmpt.cc::open        Performing internal consistency checks on /opt/casa/data/casatestdata/unittest/msmetadata/MSMetaData.ms...
24-Aug-2026 20:11:47 test_tool_msmetadata.py::msmetadata_test::test_nfields
24-Aug-2026 20:11:47 Test nfields()
24-Aug-2026 20:11:47 PASSED
24-Aug-2026 20:11:47
24-Aug-2026 20:11:47 2026-08-24 20:11:48        INFO        msmetadata_cmpt.cc::open        Performing internal consistency checks on /opt/casa/data/casatestdata/unittest/msmetadata/MSMetaData.ms...
24-Aug-2026 20:11:47 test_tool_msmetadata.py::msmetadata_test::test_nobservations
24-Aug-2026 20:11:47 Test nobservations()
24-Aug-2026 20:11:47 PASSED
24-Aug-2026 20:11:47
24-Aug-2026 20:11:47 2026-08-24 20:11:48        INFO        msmetadata_cmpt.cc::open        Performing internal consistency checks on /opt/casa/data/casatestdata/unittest/msmetadata/MSMetaData.ms...
24-Aug-2026 20:11:47 2026-08-24 20:11:48        INFO        MSMetaData::_computeScanAndSubScanProperties         Computing scan and subscan properties...
24-Aug-2026 20:11:47 test_tool_msmetadata.py::msmetadata_test::test_nscans
24-Aug-2026 20:11:47 Test nscans()
24-Aug-2026 20:11:47 PASSED
24-Aug-2026 20:11:47
24-Aug-2026 20:11:47 2026-08-24 20:11:48        INFO        msmetadata_cmpt.cc::open        Performing internal consistency checks on /opt/casa/data/casatestdata/unittest/msmetadata/MSMetaData.ms...
24-Aug-2026 20:11:47 test_tool_msmetadata.py::msmetadata_test::test_nsources
24-Aug-2026 20:11:47 PASSED
24-Aug-2026 20:11:47
24-Aug-2026 20:11:47 2026-08-24 20:11:48        INFO        msmetadata_cmpt.cc::open        Performing internal consistency checks on /opt/casa/data/casatestdata/unittest/msmetadata/MSMetaData.ms...
24-Aug-2026 20:11:47 test_tool_msmetadata.py::msmetadata_test::test_nspw
24-Aug-2026 20:11:47 Test nspw()
24-Aug-2026 20:11:47 PASSED
24-Aug-2026 20:11:47
24-Aug-2026 20:11:47 2026-08-24 20:11:48        INFO        msmetadata_cmpt.cc::open        Performing internal consistency checks on /opt/casa/data/casatestdata/unittest/msmetadata/MSMetaData.ms...
24-Aug-2026 20:11:47 test_tool_msmetadata.py::msmetadata_test::test_nstates
24-Aug-2026 20:11:47 Test nstates()
24-Aug-2026 20:11:47 PASSED
24-Aug-2026 20:11:47
24-Aug-2026 20:11:47 2026-08-24 20:11:48        INFO        msmetadata_cmpt.cc::open        Performing internal consistency checks on /opt/casa/data/casatestdata/unittest/msmetadata/MSMetaData.ms...
24-Aug-2026 20:11:47 test_tool_msmetadata.py::msmetadata_test::test_nvis
24-Aug-2026 20:11:47 Test nvis()
24-Aug-2026 20:11:47 PASSED
24-Aug-2026 20:11:47
24-Aug-2026 20:11:47 2026-08-24 20:11:48        INFO        msmetadata_cmpt.cc::open        Performing internal consistency checks on /opt/casa/data/casatestdata/unittest/msmetadata/MSMetaData.ms...
24-Aug-2026 20:11:47 test_tool_msmetadata.py::msmetadata_test::test_observers
24-Aug-2026 20:11:47 Test msmetadata.observers()
24-Aug-2026 20:11:47 PASSED
24-Aug-2026 20:11:47
24-Aug-2026 20:11:47 2026-08-24 20:11:48        INFO        msmetadata_cmpt.cc::open        Performing internal consistency checks on /opt/casa/data/casatestdata/unittest/msmetadata/MSMetaData.ms...
24-Aug-2026 20:11:48 test_tool_msmetadata.py::msmetadata_test::test_pointingdirection
24-Aug-2026 20:11:48 Test pointingdirection(), CAS-5878
24-Aug-2026 20:11:48 PASSED
24-Aug-2026 20:11:48
24-Aug-2026 20:11:48 2026-08-24 20:11:48        INFO        msmetadata_cmpt.cc::open        Performing internal consistency checks on /opt/casa/data/casatestdata/unittest/msmetadata/MSMetaData.ms...
24-Aug-2026 20:11:48 test_tool_msmetadata.py::msmetadata_test::test_polidfordatadesc
24-Aug-2026 20:11:48 Test msmetadata.polidfordatadesc()
24-Aug-2026 20:11:48 PASSED
24-Aug-2026 20:11:48
24-Aug-2026 20:11:48 2026-08-24 20:11:48        INFO        msmetadata_cmpt.cc::open        Performing internal consistency checks on /opt/casa/data/casatestdata/unittest/msmetadata/MSMetaData.ms...
24-Aug-2026 20:11:48 test_tool_msmetadata.py::msmetadata_test::test_projects
24-Aug-2026 20:11:48 Test msmetadata.projects()
24-Aug-2026 20:11:48 PASSED
24-Aug-2026 20:11:48
24-Aug-2026 20:11:48 2026-08-24 20:11:48        INFO        msmetadata_cmpt.cc::open        Performing internal consistency checks on /opt/casa/data/casatestdata/unittest/msmetadata/MSMetaData.ms...
24-Aug-2026 20:11:48 test_tool_msmetadata.py::msmetadata_test::test_propermotions
24-Aug-2026 20:11:48 Test msmetadata.propermotions()
24-Aug-2026 20:11:48 PASSED
24-Aug-2026 20:11:48
24-Aug-2026 20:11:48 2026-08-24 20:11:48        INFO        msmetadata_cmpt.cc::open        Performing internal consistency checks on /opt/casa/data/casatestdata/unittest/msmetadata/MSMetaData.ms...
24-Aug-2026 20:11:48 test_tool_msmetadata.py::msmetadata_test::test_refdir
24-Aug-2026 20:11:48 Test msmetadata.refdir()
24-Aug-2026 20:11:48 PASSED
24-Aug-2026 20:11:48
24-Aug-2026 20:11:48 2026-08-24 20:11:48        INFO        msmetadata_cmpt.cc::open        Performing internal consistency checks on /opt/casa/data/casatestdata/unittest/msmetadata/MSMetaData.ms...
24-Aug-2026 20:11:48 test_tool_msmetadata.py::msmetadata_test::test_reffreq
24-Aug-2026 20:11:48 Test msmetadata.reffreq
24-Aug-2026 20:11:48 PASSED
24-Aug-2026 20:11:48
24-Aug-2026 20:11:48 2026-08-24 20:11:48        INFO        msmetadata_cmpt.cc::open        Performing internal consistency checks on /opt/casa/data/casatestdata/unittest/msmetadata/MSMetaData.ms...
24-Aug-2026 20:11:48 2026-08-24 20:11:48        SEVERE        msmetadata_cmpt.cc::restfreqs        Exception Reported: Exception: sourceid cannot be negative.
24-Aug-2026 20:11:48 2026-08-24 20:11:48        SEVERE        msmetadata_cmpt.cc::restfreqs+        ... thrown by casac::variant* casac::msmetadata::restfreqs(long int, long int) at File: src/tools/msmetadata/msmetadata_cmpt.cc, line: 1519
24-Aug-2026 20:11:48 2026-08-24 20:11:48        SEVERE        msmetadata_cmpt.cc::restfreqs        Exception Reported: Exception: Spectral window ID -1 out of range, must be nonnegative and less than or equal to 39.
24-Aug-2026 20:11:48 2026-08-24 20:11:48        SEVERE        msmetadata_cmpt.cc::restfreqs+        ... thrown by void casac::msmetadata::_checkSpwId(int, bool) const at File: src/tools/msmetadata/msmetadata_cmpt.cc, line: 2443
24-Aug-2026 20:11:48 2026-08-24 20:11:48        SEVERE        msmetadata_cmpt.cc::restfreqs        Exception Reported: Exception: SOURCE table does not contain a row with SOURCE_ID=50 and SPECTRAL_WINDOW_ID=0.
24-Aug-2026 20:11:48 2026-08-24 20:11:48        SEVERE        msmetadata_cmpt.cc::restfreqs+        ... thrown by casac::variant* casac::msmetadata::restfreqs(long int, long int) at File: src/tools/msmetadata/msmetadata_cmpt.cc, line: 1526
24-Aug-2026 20:11:48 2026-08-24 20:11:48        SEVERE        msmetadata_cmpt.cc::restfreqs        Exception Reported: Exception: Spectral window ID 50 out of range, must be nonnegative and less than or equal to 39.
24-Aug-2026 20:11:48 2026-08-24 20:11:48        SEVERE        msmetadata_cmpt.cc::restfreqs+        ... thrown by void casac::msmetadata::_checkSpwId(int, bool) const at File: src/tools/msmetadata/msmetadata_cmpt.cc, line: 2443
24-Aug-2026 20:11:48 test_tool_msmetadata.py::msmetadata_test::test_restfreqs
24-Aug-2026 20:11:48 Test restfreqs()
24-Aug-2026 20:11:48 PASSED
24-Aug-2026 20:11:48
24-Aug-2026 20:11:48 2026-08-24 20:11:48        INFO        msmetadata_cmpt.cc::open        Performing internal consistency checks on /opt/casa/data/casatestdata/unittest/msmetadata/MSMetaData.ms...
24-Aug-2026 20:11:48 2026-08-24 20:11:49        INFO        msmetadata_cmpt.cc::open        Performing internal consistency checks on /opt/casa/data/casatestdata/unittest/msmetadata/uid___A002_Xa1f062_X37e3.ms...
24-Aug-2026 20:11:48 2026-08-24 20:11:49        INFO        msmetadata_cmpt.cc::open        Performing internal consistency checks on /opt/casa/data/casatestdata/unittest/msmetadata/uid___A002_X7b13df_X68f.ms...
24-Aug-2026 20:11:48 test_tool_msmetadata.py::msmetadata_test::test_rxbands
24-Aug-2026 20:11:48 CAS-13973 test rxbands() method
24-Aug-2026 20:11:48 PASSED
24-Aug-2026 20:11:48
24-Aug-2026 20:11:48 2026-08-24 20:11:49        INFO        msmetadata_cmpt.cc::open        Performing internal consistency checks on /opt/casa/data/casatestdata/unittest/msmetadata/MSMetaData.ms...
24-Aug-2026 20:11:48 2026-08-24 20:11:49        INFO        MSMetaData::_computeScanAndSubScanProperties         Computing scan and subscan properties...
24-Aug-2026 20:11:48 test_tool_msmetadata.py::msmetadata_test::test_scannumbers
24-Aug-2026 20:11:48 Test scannumbers()
24-Aug-2026 20:11:48 PASSED
24-Aug-2026 20:11:48
24-Aug-2026 20:11:48 2026-08-24 20:11:49        INFO        msmetadata_cmpt.cc::open        Performing internal consistency checks on /opt/casa/data/casatestdata/unittest/msmetadata/MSMetaData.ms...
24-Aug-2026 20:11:48 2026-08-24 20:11:49        INFO        MSMetaData::_computeScanAndSubScanProperties         Computing scan and subscan properties...
24-Aug-2026 20:11:48 test_tool_msmetadata.py::msmetadata_test::test_scansforfield
24-Aug-2026 20:11:48 Test scansforfield() and scansforfields()
24-Aug-2026 20:11:48 PASSED
24-Aug-2026 20:11:48
24-Aug-2026 20:11:48 2026-08-24 20:11:49        INFO        msmetadata_cmpt.cc::open        Performing internal consistency checks on /opt/casa/data/casatestdata/unittest/msmetadata/MSMetaData.ms...
24-Aug-2026 20:11:48 2026-08-24 20:11:49        INFO        MSMetaData::_computeScanAndSubScanProperties         Computing scan and subscan properties...
24-Aug-2026 20:11:48 test_tool_msmetadata.py::msmetadata_test::test_scansforintent
24-Aug-2026 20:11:48 Test scansforintent()
24-Aug-2026 20:11:48 PASSED
24-Aug-2026 20:11:48
24-Aug-2026 20:11:48 2026-08-24 20:11:49        INFO        msmetadata_cmpt.cc::open        Performing internal consistency checks on /opt/casa/data/casatestdata/unittest/msmetadata/MSMetaData.ms...
24-Aug-2026 20:11:48 2026-08-24 20:11:49        INFO        MSMetaData::_computeScanAndSubScanProperties         Computing scan and subscan properties...
24-Aug-2026 20:11:48 test_tool_msmetadata.py::msmetadata_test::test_scansforspw
24-Aug-2026 20:11:48 Test scansforspw() and scansforspws()
24-Aug-2026 20:11:48 PASSED
24-Aug-2026 20:11:48
24-Aug-2026 20:11:48 2026-08-24 20:11:49        INFO        msmetadata_cmpt.cc::open        Performing internal consistency checks on /opt/casa/data/casatestdata/unittest/msmetadata/MSMetaData.ms...
24-Aug-2026 20:11:48 2026-08-24 20:11:49        INFO        MSMetaData::_computeScanAndSubScanProperties         Computing scan and subscan properties...
24-Aug-2026 20:11:48 test_tool_msmetadata.py::msmetadata_test::test_scansforstate
24-Aug-2026 20:11:48 Test scansforstate()
24-Aug-2026 20:11:48 PASSED
24-Aug-2026 20:11:48
24-Aug-2026 20:11:48 2026-08-24 20:11:49        INFO        msmetadata_cmpt.cc::open        Performing internal consistency checks on /opt/casa/data/casatestdata/unittest/msmetadata/MSMetaData.ms...
24-Aug-2026 20:11:48 2026-08-24 20:11:49        INFO        MSMetaData::_computeScanAndSubScanProperties         Computing scan and subscan properties...
24-Aug-2026 20:11:48 test_tool_msmetadata.py::msmetadata_test::test_scansfortimes
24-Aug-2026 20:11:48 Test scansfortimes()
24-Aug-2026 20:11:48 PASSED
24-Aug-2026 20:11:48
24-Aug-2026 20:11:48 2026-08-24 20:11:49        INFO        msmetadata_cmpt.cc::open        Performing internal consistency checks on /opt/casa/data/casatestdata/unittest/msmetadata/MSMetaData.ms...
24-Aug-2026 20:11:48 test_tool_msmetadata.py::msmetadata_test::test_schedule
24-Aug-2026 20:11:48 Test msmetadata.schedule()
24-Aug-2026 20:11:48 PASSED
24-Aug-2026 20:11:48
24-Aug-2026 20:11:48 2026-08-24 20:11:49        INFO        msmetadata_cmpt.cc::open        Performing internal consistency checks on /opt/casa/data/casatestdata/unittest/msmetadata/MSMetaData.ms...
24-Aug-2026 20:11:48 test_tool_msmetadata.py::msmetadata_test::test_sideband
24-Aug-2026 20:11:48 PASSED
24-Aug-2026 20:11:48
24-Aug-2026 20:11:48 2026-08-24 20:11:49        INFO        msmetadata_cmpt.cc::open        Performing internal consistency checks on /opt/casa/data/casatestdata/unittest/msmetadata/MSMetaData.ms...
24-Aug-2026 20:11:48 test_tool_msmetadata.py::msmetadata_test::test_sourcedirs
24-Aug-2026 20:11:48 Test msmetadata.sourcedirs()
24-Aug-2026 20:11:48 PASSED
24-Aug-2026 20:11:48
24-Aug-2026 20:11:48 2026-08-24 20:11:49        INFO        msmetadata_cmpt.cc::open        Performing internal consistency checks on /opt/casa/data/casatestdata/unittest/msmetadata/MSMetaData.ms...
24-Aug-2026 20:11:48 2026-08-24 20:11:49        SEVERE        msmetadata_cmpt.cc::sourceidforfield        Exception Reported: Exception: Antenna ID -1 out of range, must be less than 6.
24-Aug-2026 20:11:48 2026-08-24 20:11:49        SEVERE        msmetadata_cmpt.cc::sourceidforfield+        ... thrown by void casac::msmetadata::_checkFieldId(int, bool) const at File: src/tools/msmetadata/msmetadata_cmpt.cc, line: 2425
24-Aug-2026 20:11:48 2026-08-24 20:11:49        SEVERE        msmetadata_cmpt.cc::sourceidforfield        Exception Reported: Exception: Antenna ID 6 out of range, must be less than 6.
24-Aug-2026 20:11:48 2026-08-24 20:11:49        SEVERE        msmetadata_cmpt.cc::sourceidforfield+        ... thrown by void casac::msmetadata::_checkFieldId(int, bool) const at File: src/tools/msmetadata/msmetadata_cmpt.cc, line: 2425
24-Aug-2026 20:11:48 test_tool_msmetadata.py::msmetadata_test::test_sourceidforfield
24-Aug-2026 20:11:48 Test msmetadata.sourceidforfield()
24-Aug-2026 20:11:48 PASSED
24-Aug-2026 20:11:48
24-Aug-2026 20:11:48 2026-08-24 20:11:49        INFO        msmetadata_cmpt.cc::open        Performing internal consistency checks on /opt/casa/data/casatestdata/unittest/msmetadata/MSMetaData.ms...
24-Aug-2026 20:11:48 test_tool_msmetadata.py::msmetadata_test::test_sourceidsfromsourcetable
24-Aug-2026 20:11:48 Test msmetadata.sourceidsfromsourcetable()
24-Aug-2026 20:11:48 PASSED
24-Aug-2026 20:11:48
24-Aug-2026 20:11:48 2026-08-24 20:11:49        INFO        msmetadata_cmpt.cc::open        Performing internal consistency checks on /opt/casa/data/casatestdata/unittest/msmetadata/MSMetaData.ms...
24-Aug-2026 20:11:48 test_tool_msmetadata.py::msmetadata_test::test_sourcenames
24-Aug-2026 20:11:48 Test msmetadata.sourcenames()
24-Aug-2026 20:11:48 PASSED
24-Aug-2026 20:11:48
24-Aug-2026 20:11:48 2026-08-24 20:11:49        INFO        msmetadata_cmpt.cc::open        Performing internal consistency checks on /opt/casa/data/casatestdata/unittest/msmetadata/MSMetaData.ms...
24-Aug-2026 20:11:48 test_tool_msmetadata.py::msmetadata_test::test_spwfordatadesc
24-Aug-2026 20:11:48 Test msmetadata.spwfordatadesc()
24-Aug-2026 20:11:48 PASSED
24-Aug-2026 20:11:48
24-Aug-2026 20:11:48 2026-08-24 20:11:49        INFO        msmetadata_cmpt.cc::open        Performing internal consistency checks on /opt/casa/data/casatestdata/unittest/msmetadata/MSMetaData.ms...
24-Aug-2026 20:11:48 test_tool_msmetadata.py::msmetadata_test::test_spwsforbasebands
24-Aug-2026 20:11:48 Test spwsforbasebands()
24-Aug-2026 20:11:48 PASSED
24-Aug-2026 20:11:48
24-Aug-2026 20:11:48 2026-08-24 20:11:49        INFO        msmetadata_cmpt.cc::open        Performing internal consistency checks on /opt/casa/data/casatestdata/unittest/msmetadata/MSMetaData.ms...
24-Aug-2026 20:11:48 2026-08-24 20:11:49        INFO        MSMetaData::_computeScanAndSubScanProperties         Computing scan and subscan properties...
24-Aug-2026 20:11:48 test_tool_msmetadata.py::msmetadata_test::test_spwsforfield
24-Aug-2026 20:11:48 Test spwsforfield() and spwsforfields()
24-Aug-2026 20:11:48 PASSED
24-Aug-2026 20:11:48
24-Aug-2026 20:11:48 2026-08-24 20:11:49        INFO        msmetadata_cmpt.cc::open        Performing internal consistency checks on /opt/casa/data/casatestdata/unittest/msmetadata/MSMetaData.ms...
24-Aug-2026 20:11:48 test_tool_msmetadata.py::msmetadata_test::test_spwsforintent
24-Aug-2026 20:11:48 Test spwsforintent()
24-Aug-2026 20:11:48 PASSED
24-Aug-2026 20:11:48
24-Aug-2026 20:11:48 2026-08-24 20:11:49        INFO        msmetadata_cmpt.cc::open        Performing internal consistency checks on /opt/casa/data/casatestdata/unittest/msmetadata/MSMetaData.ms...
24-Aug-2026 20:11:48 2026-08-24 20:11:49        WARN        msmetadata_cmpt.cc::spwsfornames        Specified spw named blah is not present in MS
24-Aug-2026 20:11:48 test_tool_msmetadata.py::msmetadata_test::test_spwsfornames
24-Aug-2026 20:11:48 Test spwsfornames()
24-Aug-2026 20:11:48 PASSED
24-Aug-2026 20:11:48
24-Aug-2026 20:11:48 2026-08-24 20:11:49        INFO        msmetadata_cmpt.cc::open        Performing internal consistency checks on /opt/casa/data/casatestdata/unittest/msmetadata/MSMetaData.ms...
24-Aug-2026 20:11:48 2026-08-24 20:11:49        INFO        MSMetaData::_computeScanAndSubScanProperties         Computing scan and subscan properties...
24-Aug-2026 20:11:49 test_tool_msmetadata.py::msmetadata_test::test_spwsforscan
24-Aug-2026 20:11:49 Test spwsforscan() and spwsforscans()
24-Aug-2026 20:11:49 PASSED
24-Aug-2026 20:11:49
24-Aug-2026 20:11:49 2026-08-24 20:11:49        INFO        msmetadata_cmpt.cc::open        Performing internal consistency checks on /opt/casa/data/casatestdata/unittest/msmetadata/MSMetaData.ms...
24-Aug-2026 20:11:49 2026-08-24 20:11:49        INFO        MSMetaData::_computeScanAndSubScanProperties         Computing scan and subscan properties...
24-Aug-2026 20:11:49 test_tool_msmetadata.py::msmetadata_test::test_statesforscan
24-Aug-2026 20:11:49 Test statesforscan() and statesforscans()
24-Aug-2026 20:11:49 PASSED
24-Aug-2026 20:11:49
24-Aug-2026 20:11:49 2026-08-24 20:11:49        INFO        msmetadata_cmpt.cc::open        Performing internal consistency checks on /opt/casa/data/casatestdata/unittest/msmetadata/MSMetaData.ms...
24-Aug-2026 20:11:49 2026-08-24 20:11:49        INFO        msmetadata_cmpt.cc::open        Performing internal consistency checks on /opt/casa/data/casatestdata/unittest/msmetadata/uid___A002_Xa1f062_X37e3.ms...
24-Aug-2026 20:11:49 test_tool_msmetadata.py::msmetadata_test::test_subwindows
24-Aug-2026 20:11:49 CAS-13973 test subwindows() method
24-Aug-2026 20:11:49 PASSED
24-Aug-2026 20:11:49
24-Aug-2026 20:11:49 2026-08-24 20:11:49        INFO        msmetadata_cmpt.cc::open        Performing internal consistency checks on /opt/casa/data/casatestdata/unittest/msmetadata/MSMetaData.ms...
24-Aug-2026 20:11:49 2026-08-24 20:11:49        INFO        msmetadata_cmpt.cc::open        Performing internal consistency checks on /opt/casa/data/casatestdata/unittest/msmetadata/uid___A002_Xd7be9d_X4838-spw16-18-20-22.ms...
24-Aug-2026 20:11:49 test_tool_msmetadata.py::msmetadata_test::test_tdm_fdm
24-Aug-2026 20:11:49 Verify change to algorithm used for FDM and TDM windows CAS-13362
24-Aug-2026 20:11:49 PASSED
24-Aug-2026 20:11:49
24-Aug-2026 20:11:49 2026-08-24 20:11:49        INFO        msmetadata_cmpt.cc::open        Performing internal consistency checks on /opt/casa/data/casatestdata/unittest/msmetadata/MSMetaData.ms...
24-Aug-2026 20:11:49 test_tool_msmetadata.py::msmetadata_test::test_tdmspws
24-Aug-2026 20:11:49 Test tdmspws()
24-Aug-2026 20:11:49 PASSED
24-Aug-2026 20:11:49
24-Aug-2026 20:11:49 2026-08-24 20:11:49        INFO        msmetadata_cmpt.cc::open        Performing internal consistency checks on /opt/casa/data/casatestdata/unittest/msmetadata/MSMetaData.ms...
24-Aug-2026 20:11:49 test_tool_msmetadata.py::msmetadata_test::test_telescopenames
24-Aug-2026 20:11:49 Test observatorynames()
24-Aug-2026 20:11:49 PASSED
24-Aug-2026 20:11:49
24-Aug-2026 20:11:49 2026-08-24 20:11:49        INFO        msmetadata_cmpt.cc::open        Performing internal consistency checks on /opt/casa/data/casatestdata/unittest/msmetadata/MSMetaData.ms...
24-Aug-2026 20:11:49 test_tool_msmetadata.py::msmetadata_test::test_timerforobs
24-Aug-2026 20:11:49 Test msmetadata.timerforobs()
24-Aug-2026 20:11:49 PASSED
24-Aug-2026 20:11:49
24-Aug-2026 20:11:49 2026-08-24 20:11:49        INFO        msmetadata_cmpt.cc::open        Performing internal consistency checks on /opt/casa/data/casatestdata/unittest/msmetadata/MSMetaData.ms...
24-Aug-2026 20:11:49 test_tool_msmetadata.py::msmetadata_test::test_timesforfield
24-Aug-2026 20:11:49 Test timesforfield()
24-Aug-2026 20:11:49 PASSED
24-Aug-2026 20:11:49
24-Aug-2026 20:11:49 2026-08-24 20:11:49        INFO        msmetadata_cmpt.cc::open        Performing internal consistency checks on /opt/casa/data/casatestdata/unittest/msmetadata/MSMetaData.ms...
24-Aug-2026 20:11:49 test_tool_msmetadata.py::msmetadata_test::test_timesforintent
24-Aug-2026 20:11:49 Test timesforintent(), CAS-6919
24-Aug-2026 20:11:49 PASSED
24-Aug-2026 20:11:49
24-Aug-2026 20:11:49 2026-08-24 20:11:49        INFO        msmetadata_cmpt.cc::open        Performing internal consistency checks on /opt/casa/data/casatestdata/unittest/msmetadata/MSMetaData.ms...
24-Aug-2026 20:11:49 2026-08-24 20:11:49        INFO        MSMetaData::_computeScanAndSubScanProperties         Computing scan and subscan properties...
24-Aug-2026 20:11:49 test_tool_msmetadata.py::msmetadata_test::test_timesforscan
24-Aug-2026 20:11:49 Test timesforscan()
24-Aug-2026 20:11:49 PASSED
24-Aug-2026 20:11:49
24-Aug-2026 20:11:49 2026-08-24 20:11:49        INFO        msmetadata_cmpt.cc::open        Performing internal consistency checks on /opt/casa/data/casatestdata/unittest/msmetadata/MSMetaData.ms...
24-Aug-2026 20:11:49 2026-08-24 20:11:49        INFO        MSMetaData::_computeScanAndSubScanProperties         Computing scan and subscan properties...
24-Aug-2026 20:11:49 test_tool_msmetadata.py::msmetadata_test::test_timesforscans
24-Aug-2026 20:11:49 Test timesforscans()
24-Aug-2026 20:11:49 PASSED
24-Aug-2026 20:11:49
24-Aug-2026 20:11:49 2026-08-24 20:11:50        INFO        msmetadata_cmpt.cc::open        Performing internal consistency checks on /opt/casa/data/casatestdata/unittest/msmetadata/MSMetaData.ms...
24-Aug-2026 20:11:49 2026-08-24 20:11:50        INFO        MSMetaData::_computeScanAndSubScanProperties         Computing scan and subscan properties...
24-Aug-2026 20:11:49 test_tool_msmetadata.py::msmetadata_test::test_timesforspws
24-Aug-2026 20:11:49 Verify timesforspws()
24-Aug-2026 20:11:49 PASSED
24-Aug-2026 20:11:49
24-Aug-2026 20:11:49 2026-08-24 20:11:50        INFO        msmetadata_cmpt.cc::open        Performing internal consistency checks on /opt/casa/data/casatestdata/unittest/msmetadata/MSMetaData.ms...
24-Aug-2026 20:11:49 2026-08-24 20:11:50        SEVERE        msmetadata_cmpt.cc::transitions        Exception Reported: Exception: sourceid cannot be negative.
24-Aug-2026 20:11:49 2026-08-24 20:11:50        SEVERE        msmetadata_cmpt.cc::transitions+        ... thrown by casac::variant* casac::msmetadata::transitions(long int, long int) at File: src/tools/msmetadata/msmetadata_cmpt.cc, line: 2270
24-Aug-2026 20:11:49 2026-08-24 20:11:50        SEVERE        msmetadata_cmpt.cc::transitions        Exception Reported: Exception: Spectral window ID -1 out of range, must be nonnegative and less than or equal to 39.
24-Aug-2026 20:11:49 2026-08-24 20:11:50        SEVERE        msmetadata_cmpt.cc::transitions+        ... thrown by void casac::msmetadata::_checkSpwId(int, bool) const at File: src/tools/msmetadata/msmetadata_cmpt.cc, line: 2443
24-Aug-2026 20:11:49 2026-08-24 20:11:50        SEVERE        msmetadata_cmpt.cc::transitions        Exception Reported: Exception: SOURCE table does not contain a row with SOURCE_ID=50 and SPECTRAL_WINDOW_ID=0.
24-Aug-2026 20:11:49 2026-08-24 20:11:50        SEVERE        msmetadata_cmpt.cc::transitions+        ... thrown by casac::variant* casac::msmetadata::transitions(long int, long int) at File: src/tools/msmetadata/msmetadata_cmpt.cc, line: 2277
24-Aug-2026 20:11:49 2026-08-24 20:11:50        SEVERE        msmetadata_cmpt.cc::transitions        Exception Reported: Exception: Spectral window ID 50 out of range, must be nonnegative and less than or equal to 39.
24-Aug-2026 20:11:49 2026-08-24 20:11:50        SEVERE        msmetadata_cmpt.cc::transitions+        ... thrown by void casac::msmetadata::_checkSpwId(int, bool) const at File: src/tools/msmetadata/msmetadata_cmpt.cc, line: 2443
24-Aug-2026 20:11:49 test_tool_msmetadata.py::msmetadata_test::test_transitions
24-Aug-2026 20:11:49 Test transitions()
24-Aug-2026 20:11:49 PASSED
24-Aug-2026 20:11:49
24-Aug-2026 20:11:49 2026-08-24 20:11:50        INFO        msmetadata_cmpt.cc::open        Performing internal consistency checks on /opt/casa/data/casatestdata/unittest/msmetadata/MSMetaData.ms...
24-Aug-2026 20:11:49 test_tool_msmetadata.py::msmetadata_test::test_wvrspws
24-Aug-2026 20:11:49 Test wvrspws()
24-Aug-2026 20:11:49 PASSED
24-Aug-2026 20:11:49
24-Aug-2026 20:11:49 - generated xml file: /home/casatest/casa6/casatestutils/nosedir/xml/test_tool_msmetadata/nose.xml -
24-Aug-2026 20:11:49 ======================== 85 passed, 1 warning in 5.06s =========================
24-Aug-2026 20:11:49 Running Command: pytest --junitxml=/home/casatest/casa6/casatestutils/nosedir/xml/test_tool_regionmanager/nose.xml -s --disable-pytest-warnings --verbose -ra --tb=short /home/casatest/casa6/casatestutils/nosedir/test_tool_regionmanager/
24-Aug-2026 20:11:49
24-Aug-2026 20:11:49 Setting Working Directory: /home/casatest/casa6/casatestutils/nosedir/test_tool_image_transpose/
24-Aug-2026 20:11:49 Test Directory: /home/casatest/casa6/casatestutils/nosedir/test_tool_image_transpose
24-Aug-2026 20:11:49
24-Aug-2026 20:11:49 Running Command: pytest --junitxml=/home/casatest/casa6/casatestutils/nosedir/xml/test_tool_image_transpose/nose.xml -s --disable-pytest-warnings --verbose -ra --tb=short /home/casatest/casa6/casatestutils/nosedir/test_tool_image_transpose/
24-Aug-2026 20:11:49
24-Aug-2026 20:11:49 Setting Working Directory: /home/casatest/casa6/casatestutils/nosedir/test_tool_sdm_toms/
24-Aug-2026 20:11:49 Test Directory: /home/casatest/casa6/casatestutils/nosedir/test_tool_sdm_toms
24-Aug-2026 20:11:49
24-Aug-2026 20:11:49 Running Command: pytest --junitxml=/home/casatest/casa6/casatestutils/nosedir/xml/test_tool_sdm_toms/nose.xml -s --disable-pytest-warnings --verbose -ra --tb=short /home/casatest/casa6/casatestutils/nosedir/test_tool_sdm_toms/
24-Aug-2026 20:11:49
24-Aug-2026 20:11:49 Setting Working Directory: /home/casatest/casa6/casatestutils/nosedir/test_tool_quanta/
24-Aug-2026 20:11:49 Test Directory: /home/casatest/casa6/casatestutils/nosedir/test_tool_quanta
24-Aug-2026 20:11:49
24-Aug-2026 20:11:49 Running Command: pytest --junitxml=/home/casatest/casa6/casatestutils/nosedir/xml/test_tool_quanta/nose.xml -s --disable-pytest-warnings --verbose -ra --tb=short /home/casatest/casa6/casatestutils/nosedir/test_tool_quanta/
24-Aug-2026 20:11:49
24-Aug-2026 20:11:49 Setting Working Directory: /home/casatest/casa6/casatestutils/nosedir/test_tool_table/
24-Aug-2026 20:11:49 Test Directory: /home/casatest/casa6/casatestutils/nosedir/test_tool_table
24-Aug-2026 20:11:49
24-Aug-2026 20:11:49 Running Command: pytest --junitxml=/home/casatest/casa6/casatestutils/nosedir/xml/test_tool_table/nose.xml -s --disable-pytest-warnings --verbose -ra --tb=short /home/casatest/casa6/casatestutils/nosedir/test_tool_table/
24-Aug-2026 20:11:49
24-Aug-2026 20:11:49 Setting Working Directory: /home/casatest/casa6/casatestutils/nosedir/test_tool_synthesisutils/
24-Aug-2026 20:11:49 Test Directory: /home/casatest/casa6/casatestutils/nosedir/test_tool_synthesisutils
24-Aug-2026 20:11:49
24-Aug-2026 20:11:49 Running Command: pytest --junitxml=/home/casatest/casa6/casatestutils/nosedir/xml/test_tool_synthesisutils/nose.xml -s --disable-pytest-warnings --verbose -ra --tb=short /home/casatest/casa6/casatestutils/nosedir/test_tool_synthesisutils/
24-Aug-2026 20:11:49
24-Aug-2026 20:11:49 Setting Working Directory: /home/casatest/casa6/casatestutils/nosedir/test_tool_image_pv/
24-Aug-2026 20:11:49 Test Directory: /home/casatest/casa6/casatestutils/nosedir/test_tool_image_pv
24-Aug-2026 20:11:49
24-Aug-2026 20:11:49 Running Command: pytest --junitxml=/home/casatest/casa6/casatestutils/nosedir/xml/test_tool_image_pv/nose.xml -s --disable-pytest-warnings --verbose -ra --tb=short /home/casatest/casa6/casatestutils/nosedir/test_tool_image_pv/
24-Aug-2026 20:11:49
24-Aug-2026 20:11:49 Setting Working Directory: /home/casatest/casa6/casatestutils/nosedir/test_tool_measures/
24-Aug-2026 20:11:49 Test Directory: /home/casatest/casa6/casatestutils/nosedir/test_tool_measures
24-Aug-2026 20:11:49
24-Aug-2026 20:11:49 Running Command: pytest --junitxml=/home/casatest/casa6/casatestutils/nosedir/xml/test_tool_measures/nose.xml -s --disable-pytest-warnings --verbose -ra --tb=short /home/casatest/casa6/casatestutils/nosedir/test_tool_measures/
24-Aug-2026 20:11:49
24-Aug-2026 20:11:49 Setting Working Directory: /home/casatest/casa6/casatestutils/nosedir/test_tool_image_regrid/
24-Aug-2026 20:11:49 Test Directory: /home/casatest/casa6/casatestutils/nosedir/test_tool_image_regrid
24-Aug-2026 20:11:49
24-Aug-2026 20:11:49 Running Command: pytest --junitxml=/home/casatest/casa6/casatestutils/nosedir/xml/test_tool_image_regrid/nose.xml -s --disable-pytest-warnings --verbose -ra --tb=short /home/casatest/casa6/casatestutils/nosedir/test_tool_image_regrid/
24-Aug-2026 20:11:49
24-Aug-2026 20:11:49 Setting Working Directory: /home/casatest/casa6/casatestutils/nosedir/test_tool_image_collapse/
24-Aug-2026 20:11:49 Test Directory: /home/casatest/casa6/casatestutils/nosedir/test_tool_image_collapse
24-Aug-2026 20:11:49
24-Aug-2026 20:11:49 Running Command: pytest --junitxml=/home/casatest/casa6/casatestutils/nosedir/xml/test_tool_image_collapse/nose.xml -s --disable-pytest-warnings --verbose -ra --tb=short /home/casatest/casa6/casatestutils/nosedir/test_tool_image_collapse/
24-Aug-2026 20:11:49
24-Aug-2026 20:11:49 Setting Working Directory: /home/casatest/casa6/casatestutils/nosedir/test_tool_image_statistics/
24-Aug-2026 20:11:49 Test Directory: /home/casatest/casa6/casatestutils/nosedir/test_tool_image_statistics
24-Aug-2026 20:11:49
24-Aug-2026 20:11:49 Running Command: pytest --junitxml=/home/casatest/casa6/casatestutils/nosedir/xml/test_tool_image_statistics/nose.xml -s --disable-pytest-warnings --verbose -ra --tb=short /home/casatest/casa6/casatestutils/nosedir/test_tool_image_statistics/
24-Aug-2026 20:11:49
24-Aug-2026 20:11:49 Setting Working Directory: /home/casatest/casa6/casatestutils/nosedir/test_tool_msuvbinner/
24-Aug-2026 20:11:49 Test Directory: /home/casatest/casa6/casatestutils/nosedir/test_tool_msuvbinner
24-Aug-2026 20:11:49
24-Aug-2026 20:11:49 Running Command: pytest --junitxml=/home/casatest/casa6/casatestutils/nosedir/xml/test_tool_msuvbinner/nose.xml -s --disable-pytest-warnings --verbose -ra --tb=short /home/casatest/casa6/casatestutils/nosedir/test_tool_msuvbinner/
24-Aug-2026 20:11:49
24-Aug-2026 20:11:49 Setting Working Directory: /home/casatest/casa6/casatestutils/nosedir/test_tool_logsink/
24-Aug-2026 20:11:49 Test Directory: /home/casatest/casa6/casatestutils/nosedir/test_tool_logsink
24-Aug-2026 20:11:49
24-Aug-2026 20:11:49 Running Command: pytest --junitxml=/home/casatest/casa6/casatestutils/nosedir/xml/test_tool_logsink/nose.xml -s --disable-pytest-warnings --verbose -ra --tb=short /home/casatest/casa6/casatestutils/nosedir/test_tool_logsink/
24-Aug-2026 20:11:49
24-Aug-2026 20:11:49 Setting Working Directory: /home/casatest/casa6/casatestutils/nosedir/test_tool_image_deviation/
24-Aug-2026 20:11:49 Test Directory: /home/casatest/casa6/casatestutils/nosedir/test_tool_image_deviation
24-Aug-2026 20:11:49
24-Aug-2026 20:11:49 Running Command: pytest --junitxml=/home/casatest/casa6/casatestutils/nosedir/xml/test_tool_image_deviation/nose.xml -s --disable-pytest-warnings --verbose -ra --tb=short /home/casatest/casa6/casatestutils/nosedir/test_tool_image_deviation/
24-Aug-2026 20:11:49
24-Aug-2026 20:11:49 Setting Working Directory: /home/casatest/casa6/casatestutils/nosedir/test_tool_ms/
24-Aug-2026 20:11:49 Test Directory: /home/casatest/casa6/casatestutils/nosedir/test_tool_ms
24-Aug-2026 20:11:49
24-Aug-2026 20:11:49 Running Command: pytest --junitxml=/home/casatest/casa6/casatestutils/nosedir/xml/test_tool_ms/nose.xml -s --disable-pytest-warnings --verbose -ra --tb=short /home/casatest/casa6/casatestutils/nosedir/test_tool_ms/
24-Aug-2026 20:11:49
24-Aug-2026 20:11:49 Setting Working Directory: /home/casatest/casa6/casatestutils/nosedir/test_tool_calibrater/
24-Aug-2026 20:11:49 Test Directory: /home/casatest/casa6/casatestutils/nosedir/test_tool_calibrater
24-Aug-2026 20:11:49
24-Aug-2026 20:11:49 Running Command: pytest --junitxml=/home/casatest/casa6/casatestutils/nosedir/xml/test_tool_calibrater/nose.xml -s --disable-pytest-warnings --verbose -ra --tb=short /home/casatest/casa6/casatestutils/nosedir/test_tool_calibrater/
24-Aug-2026 20:11:49
24-Aug-2026 20:11:49 Setting Working Directory: /home/casatest/casa6/casatestutils/nosedir/test_tool_linearmosaic/
24-Aug-2026 20:11:49 Test Directory: /home/casatest/casa6/casatestutils/nosedir/test_tool_linearmosaic
24-Aug-2026 20:11:49
24-Aug-2026 20:11:49 Running Command: pytest --junitxml=/home/casatest/casa6/casatestutils/nosedir/xml/test_tool_linearmosaic/nose.xml -s --disable-pytest-warnings --verbose -ra --tb=short /home/casatest/casa6/casatestutils/nosedir/test_tool_linearmosaic/
24-Aug-2026 20:11:49
24-Aug-2026 20:11:49 Setting Working Directory: /home/casatest/casa6/casatestutils/nosedir/test_tool_imagepol/
24-Aug-2026 20:11:49 Test Directory: /home/casatest/casa6/casatestutils/nosedir/test_tool_imagepol
24-Aug-2026 20:11:49
24-Aug-2026 20:11:49 Running Command: pytest --junitxml=/home/casatest/casa6/casatestutils/nosedir/xml/test_tool_imagepol/nose.xml -s --disable-pytest-warnings --verbose -ra --tb=short /home/casatest/casa6/casatestutils/nosedir/test_tool_imagepol/
24-Aug-2026 20:11:49
24-Aug-2026 20:11:49 Setting Working Directory: /home/casatest/casa6/casatestutils/nosedir/test_tool_msmetadata/
24-Aug-2026 20:11:49 Test Directory: /home/casatest/casa6/casatestutils/nosedir/test_tool_msmetadata
24-Aug-2026 20:11:49
24-Aug-2026 20:11:49 Running Command: pytest --junitxml=/home/casatest/casa6/casatestutils/nosedir/xml/test_tool_msmetadata/nose.xml -s --disable-pytest-warnings --verbose -ra --tb=short /home/casatest/casa6/casatestutils/nosedir/test_tool_msmetadata/
24-Aug-2026 20:11:50 total 391400
24-Aug-2026 20:11:50 -rw-r--r-- 1 casaci 15001    135265 Aug 24 19:59 casatestutils-6.7.1.12a14708.dev7-py3-none-any.whl
24-Aug-2026 20:11:50 -rw-r--r-- 1 casaci 15001 400485148 Aug 24 19:59 casatools-6.7.1.12a14708.dev7-cp310-cp310-manylinux_2_28_x86_64.whl
24-Aug-2026 20:11:50 -rw-r--r-- 1 casaci root       4320 Aug 24 20:11 test_tool_agentflagger.xml
24-Aug-2026 20:11:50 -rw-r--r-- 1 casaci root        986 Aug 24 20:11 test_tool_calanalysis.xml
24-Aug-2026 20:11:50 -rw-r--r-- 1 casaci root       2636 Aug 24 20:11 test_tool_calibrater.xml
24-Aug-2026 20:11:50 -rw-r--r-- 1 casaci root        667 Aug 24 20:11 test_tool_componentlist.xml
24-Aug-2026 20:11:50 -rw-r--r-- 1 casaci root       7447 Aug 24 20:11 test_tool_coordsys.xml
24-Aug-2026 20:11:50 -rw-r--r-- 1 casaci root      12915 Aug 24 20:11 test_tool_image.xml
24-Aug-2026 20:11:50 -rw-r--r-- 1 casaci root       2200 Aug 24 20:11 test_tool_image_collapse.xml
24-Aug-2026 20:11:50 -rw-r--r-- 1 casaci root       1028 Aug 24 20:11 test_tool_image_deviation.xml
24-Aug-2026 20:11:50 -rw-r--r-- 1 casaci root       2555 Aug 24 20:11 test_tool_image_fitprofile.xml
24-Aug-2026 20:11:50 -rw-r--r-- 1 casaci root       1158 Aug 24 20:11 test_tool_image_pbcor.xml
24-Aug-2026 20:11:50 -rw-r--r-- 1 casaci root        863 Aug 24 20:11 test_tool_image_pv.xml
24-Aug-2026 20:11:50 -rw-r--r-- 1 casaci root        986 Aug 24 20:11 test_tool_image_rebin.xml
24-Aug-2026 20:11:50 -rw-r--r-- 1 casaci root       1316 Aug 24 20:11 test_tool_image_regrid.xml
24-Aug-2026 20:11:50 -rw-r--r-- 1 casaci root       1512 Aug 24 20:11 test_tool_image_statistics.xml
24-Aug-2026 20:11:50 -rw-r--r-- 1 casaci root        745 Aug 24 20:11 test_tool_image_subimage.xml
24-Aug-2026 20:11:50 -rw-r--r-- 1 casaci root        870 Aug 24 20:11 test_tool_image_transpose.xml
24-Aug-2026 20:11:50 -rw-r--r-- 1 casaci root       1946 Aug 24 20:11 test_tool_imagepol.xml
24-Aug-2026 20:11:50 -rw-r--r-- 1 casaci root        819 Aug 24 20:11 test_tool_linearmosaic.xml
24-Aug-2026 20:11:50 -rw-r--r-- 1 casaci root        648 Aug 24 20:11 test_tool_logsink.xml
24-Aug-2026 20:11:50 -rw-r--r-- 1 casaci root        529 Aug 24 20:11 test_tool_measures.xml
24-Aug-2026 20:11:50 -rw-r--r-- 1 casaci root       5204 Aug 24 20:11 test_tool_ms.xml
24-Aug-2026 20:11:50 -rw-r--r-- 1 casaci root        347 Aug 24 20:11 test_tool_ms_createmultims.xml
24-Aug-2026 20:11:50 -rw-r--r-- 1 casaci root       2075 Aug 24 20:11 test_tool_ms_statwt.xml
24-Aug-2026 20:11:50 -rw-r--r-- 1 casaci root       8613 Aug 24 20:11 test_tool_msmetadata.xml
24-Aug-2026 20:11:50 -rw-r--r-- 1 casaci root        339 Aug 24 20:11 test_tool_msuvbinner.xml
24-Aug-2026 20:11:50 -rw-r--r-- 1 casaci root       1151 Aug 24 20:11 test_tool_quanta.xml
24-Aug-2026 20:11:50 -rw-r--r-- 1 casaci root       3956 Aug 24 20:11 test_tool_regionmanager.xml
24-Aug-2026 20:11:50 -rw-r--r-- 1 casaci root       2052 Aug 24 20:11 test_tool_sdm.xml
24-Aug-2026 20:11:50 -rw-r--r-- 1 casaci root       2076 Aug 24 20:11 test_tool_sdm_toms.xml
24-Aug-2026 20:11:50 -rw-r--r-- 1 casaci root        428 Aug 24 20:11 test_tool_simulator.xml
24-Aug-2026 20:11:50 -rw-r--r-- 1 casaci root       1696 Aug 24 20:11 test_tool_synthesisutils.xml
24-Aug-2026 20:11:50 -rw-r--r-- 1 casaci root       1442 Aug 24 20:11 test_tool_table.xml
24-Aug-2026 20:11:50 -rw-r--r-- 1 casaci root       1697 Aug 24 20:11 test_tool_vpmanager.xml
24-Aug-2026 20:11:50 Finished task 'Test wheel' with result: Success
24-Aug-2026 20:11:50 Starting task 'Tar work directory' of type 'com.atlassian.bamboo.plugins.scripttask:task.builder.script'
24-Aug-2026 20:11:50
Beginning to execute external process for build 'CASASPECS - Dev Test GPU 3.10 L4 - CAS-14708 - Test Tools Many Linux 2.28 Python 3.10 L4 #4 (CASASPECS-DEVTESTGPUPY3103-TTOMLPY310-4)'
... running command line:
/export/cvpost135-nvme/casa/bamboohome/temp/CASASPECS-DEVTESTGPUPY3103-TTOMLPY310-4-ScriptBuildTask-3528849058760397261.sh
... in: /export/cvpost135-nvme/casa/bamboohome/xml-data/build-dir/CASASPECS-DEVTESTGPUPY3103-TTOMLPY310
24-Aug-2026 20:11:50 Package working directory
24-Aug-2026 20:11:50 tar: work: Cannot stat: No such file or directory
24-Aug-2026 20:11:50 tar: Exiting with failure status due to previous errors
24-Aug-2026 20:11:50 total 391404
24-Aug-2026 20:11:50 -rw-r--r-- 1 casaci 15001    135265 Aug 24 19:59 casatestutils-6.7.1.12a14708.dev7-py3-none-any.whl
24-Aug-2026 20:11:50 -rw-r--r-- 1 casaci 15001 400485148 Aug 24 19:59 casatools-6.7.1.12a14708.dev7-cp310-cp310-manylinux_2_28_x86_64.whl
24-Aug-2026 20:11:50 -rw-r--r-- 1 casaci root       4320 Aug 24 20:11 test_tool_agentflagger.xml
24-Aug-2026 20:11:50 -rw-r--r-- 1 casaci root        986 Aug 24 20:11 test_tool_calanalysis.xml
24-Aug-2026 20:11:50 -rw-r--r-- 1 casaci root       2636 Aug 24 20:11 test_tool_calibrater.xml
24-Aug-2026 20:11:50 -rw-r--r-- 1 casaci root        667 Aug 24 20:11 test_tool_componentlist.xml
24-Aug-2026 20:11:50 -rw-r--r-- 1 casaci root       7447 Aug 24 20:11 test_tool_coordsys.xml
24-Aug-2026 20:11:50 -rw-r--r-- 1 casaci root      12915 Aug 24 20:11 test_tool_image.xml
24-Aug-2026 20:11:50 -rw-r--r-- 1 casaci root       2200 Aug 24 20:11 test_tool_image_collapse.xml
24-Aug-2026 20:11:50 -rw-r--r-- 1 casaci root       1028 Aug 24 20:11 test_tool_image_deviation.xml
24-Aug-2026 20:11:50 -rw-r--r-- 1 casaci root       2555 Aug 24 20:11 test_tool_image_fitprofile.xml
24-Aug-2026 20:11:50 -rw-r--r-- 1 casaci root       1158 Aug 24 20:11 test_tool_image_pbcor.xml
24-Aug-2026 20:11:50 -rw-r--r-- 1 casaci root        863 Aug 24 20:11 test_tool_image_pv.xml
24-Aug-2026 20:11:50 -rw-r--r-- 1 casaci root        986 Aug 24 20:11 test_tool_image_rebin.xml
24-Aug-2026 20:11:50 -rw-r--r-- 1 casaci root       1316 Aug 24 20:11 test_tool_image_regrid.xml
24-Aug-2026 20:11:50 -rw-r--r-- 1 casaci root       1512 Aug 24 20:11 test_tool_image_statistics.xml
24-Aug-2026 20:11:50 -rw-r--r-- 1 casaci root        745 Aug 24 20:11 test_tool_image_subimage.xml
24-Aug-2026 20:11:50 -rw-r--r-- 1 casaci root        870 Aug 24 20:11 test_tool_image_transpose.xml
24-Aug-2026 20:11:50 -rw-r--r-- 1 casaci root       1946 Aug 24 20:11 test_tool_imagepol.xml
24-Aug-2026 20:11:50 -rw-r--r-- 1 casaci root        819 Aug 24 20:11 test_tool_linearmosaic.xml
24-Aug-2026 20:11:50 -rw-r--r-- 1 casaci root        648 Aug 24 20:11 test_tool_logsink.xml
24-Aug-2026 20:11:50 -rw-r--r-- 1 casaci root        529 Aug 24 20:11 test_tool_measures.xml
24-Aug-2026 20:11:50 -rw-r--r-- 1 casaci root       5204 Aug 24 20:11 test_tool_ms.xml
24-Aug-2026 20:11:50 -rw-r--r-- 1 casaci root        347 Aug 24 20:11 test_tool_ms_createmultims.xml
24-Aug-2026 20:11:50 -rw-r--r-- 1 casaci root       2075 Aug 24 20:11 test_tool_ms_statwt.xml
24-Aug-2026 20:11:50 -rw-r--r-- 1 casaci root       8613 Aug 24 20:11 test_tool_msmetadata.xml
24-Aug-2026 20:11:50 -rw-r--r-- 1 casaci root        339 Aug 24 20:11 test_tool_msuvbinner.xml
24-Aug-2026 20:11:50 -rw-r--r-- 1 casaci root       1151 Aug 24 20:11 test_tool_quanta.xml
24-Aug-2026 20:11:50 -rw-r--r-- 1 casaci root       3956 Aug 24 20:11 test_tool_regionmanager.xml
24-Aug-2026 20:11:50 -rw-r--r-- 1 casaci root       2052 Aug 24 20:11 test_tool_sdm.xml
24-Aug-2026 20:11:50 -rw-r--r-- 1 casaci root       2076 Aug 24 20:11 test_tool_sdm_toms.xml
24-Aug-2026 20:11:50 -rw-r--r-- 1 casaci root        428 Aug 24 20:11 test_tool_simulator.xml
24-Aug-2026 20:11:50 -rw-r--r-- 1 casaci root       1696 Aug 24 20:11 test_tool_synthesisutils.xml
24-Aug-2026 20:11:50 -rw-r--r-- 1 casaci root       1442 Aug 24 20:11 test_tool_table.xml
24-Aug-2026 20:11:50 -rw-r--r-- 1 casaci root       1697 Aug 24 20:11 test_tool_vpmanager.xml
24-Aug-2026 20:11:50 -rw-r--r-- 1 casaci root         45 Aug 24 20:11 work-manylinux_228_casatools-3.10.tar.gz
24-Aug-2026 20:11:50 Done packaging working directory
24-Aug-2026 20:11:50 Finished task 'Tar work directory' with result: Success
24-Aug-2026 20:11:50 Starting task 'Parse tests' of type 'com.atlassian.bamboo.plugins.testresultparser:task.testresultparser.junit'
24-Aug-2026 20:11:50 Parsing test results under /export/cvpost135-nvme/casa/bamboohome/xml-data/build-dir/CASASPECS-DEVTESTGPUPY3103-TTOMLPY310...
24-Aug-2026 20:11:50 Finished task 'Parse tests' with result: Success
24-Aug-2026 20:11:50 Starting task 'Cleanup' of type 'com.atlassian.bamboo.plugins.scripttask:task.builder.script'
24-Aug-2026 20:11:50
Beginning to execute external process for build 'CASASPECS - Dev Test GPU 3.10 L4 - CAS-14708 - Test Tools Many Linux 2.28 Python 3.10 L4 #4 (CASASPECS-DEVTESTGPUPY3103-TTOMLPY310-4)'
... running command line:
/export/cvpost135-nvme/casa/bamboohome/temp/CASASPECS-DEVTESTGPUPY3103-TTOMLPY310-4-ScriptBuildTask-2511302581828526536.sh
... in: /export/cvpost135-nvme/casa/bamboohome/xml-data/build-dir/CASASPECS-DEVTESTGPUPY3103-TTOMLPY310
24-Aug-2026 20:11:50 Starting cleanup
24-Aug-2026 20:12:00 wheel-container-test
24-Aug-2026 20:12:05 wheel-container-test
24-Aug-2026 20:12:05 Cleanup complete
24-Aug-2026 20:12:05 Finished task 'Cleanup' with result: Success
24-Aug-2026 20:12:05 Running post build plugin 'Docker Container Cleanup'
24-Aug-2026 20:12:05 Running post build plugin 'NCover Results Collector'
24-Aug-2026 20:12:05 Running post build plugin 'Build Results Label Collector'
24-Aug-2026 20:12:05 Running post build plugin 'Clover Results Collector'
24-Aug-2026 20:12:05 Running post build plugin 'npm Cache Cleanup'
24-Aug-2026 20:12:05 Running post build plugin 'Artifact Copier'
24-Aug-2026 20:12:05 Publishing an artifact: Workdir
24-Aug-2026 20:12:05 Finished publishing of artifact Non required job artifact Http Compression On : [Workdir], patterns: [work*.tar.gz] anchored at: [wheeldirectory/] in 46.75 ms
24-Aug-2026 20:12:05 Publishing an artifact: Tests
24-Aug-2026 20:12:05 Finished publishing of artifact Non required job artifact Http Compression On : [Tests], patterns: [*.xml] anchored at: [wheeldirectory/] in 224.5 ms
24-Aug-2026 20:12:05 Publishing an artifact: xml Directories
24-Aug-2026 20:12:05 Finished publishing of artifact Non required job artifact Http Compression On : [xml Directories], patterns: [**/*.xml] anchored at: [wheeldirectory/] in 147.7 ms
24-Aug-2026 20:12:05 Finalising the build...
24-Aug-2026 20:12:05 Stopping timer.
24-Aug-2026 20:12:05 Build CASASPECS-DEVTESTGPUPY3103-TTOMLPY310-4 completed.
24-Aug-2026 16:12:06 Running on server: post build plugin 'Build Hanging Detection Configuration'
24-Aug-2026 16:12:06 Running on server: post build plugin 'NCover Results Collector'
24-Aug-2026 16:12:06 Running on server: post build plugin 'Build Labeller'
24-Aug-2026 16:12:06 Running on server: post build plugin 'Clover Delta Calculator'
24-Aug-2026 16:12:06 Running on server: post build plugin 'Maven Dependencies Postprocessor'
24-Aug-2026 16:12:06 All post build plugins have finished
24-Aug-2026 16:12:06 Generating build results summary...
24-Aug-2026 16:12:06 Saving build results to disk...
24-Aug-2026 16:12:06 Store variable context...
24-Aug-2026 16:12:06 Finished building CASASPECS-DEVTESTGPUPY3103-TTOMLPY310-4.