Build: #4 failed

Job: Test Tasks Many Linux 2.28 Python 3.10 L4 failed

Build log

The build generated 66,200 lines of output.   The output is too long and has been truncated to the last 1,000 lines. Download or view full build log.

25-Aug-2026 01:45:06
25-Aug-2026 01:45:06
25-Aug-2026 01:45:06 test_task_importfitsidi.py::test_importfitsidi::test1 2026-08-25 01:45:07        WARN        FitsIDItoMS::fillAntennaTable        ARRAY_GEOMETRY input table does not contain dish DIAMETER column.
25-Aug-2026 01:45:06 2026-08-25 01:45:07        WARN        FitsIDItoMS::fillAntennaTable+         Will assume default diameter for TELESCOPE EVN which is 0 m.
25-Aug-2026 01:45:08
25-Aug-2026 01:45:08 fitsidi-import: Test good input
25-Aug-2026 01:45:08 importfitsidi-unit-test : Success! Now checking output ...
25-Aug-2026 01:45:08 importfitsidi-unit-test :  STATE/table.f0 present.
25-Aug-2026 01:45:08 importfitsidi-unit-test :  table.dat present.
25-Aug-2026 01:45:08 importfitsidi-unit-test :  FLAG_CMD/table.dat present.
25-Aug-2026 01:45:08 importfitsidi-unit-test :  FIELD/table.dat present.
25-Aug-2026 01:45:08 importfitsidi-unit-test :  table.f8 present.
25-Aug-2026 01:45:08 importfitsidi-unit-test :  table.f7 present.
25-Aug-2026 01:45:08 importfitsidi-unit-test :  FEED/table.f0 present.
25-Aug-2026 01:45:08 importfitsidi-unit-test :  table.f2 present.
25-Aug-2026 01:45:08 importfitsidi-unit-test :  FIELD/table.f0 present.
25-Aug-2026 01:45:08 importfitsidi-unit-test :  OBSERVATION/table.f0 present.
25-Aug-2026 01:45:08 importfitsidi-unit-test :  POINTING/table.f0 present.
25-Aug-2026 01:45:08 importfitsidi-unit-test :  FLAG_CMD/table.f0 present.
25-Aug-2026 01:45:08 importfitsidi-unit-test :  POLARIZATION/table.f0 present.
25-Aug-2026 01:45:08 importfitsidi-unit-test :  SPECTRAL_WINDOW/table.dat present.
25-Aug-2026 01:45:08 importfitsidi-unit-test :  SPECTRAL_WINDOW/table.f0 present.
25-Aug-2026 01:45:08 importfitsidi-unit-test :  POLARIZATION/table.dat present.
25-Aug-2026 01:45:08 importfitsidi-unit-test :  ANTENNA/table.dat present.
25-Aug-2026 01:45:08 importfitsidi-unit-test :  POINTING/table.dat present.
25-Aug-2026 01:45:08 importfitsidi-unit-test :  ANTENNA/table.f0 present.
25-Aug-2026 01:45:08 importfitsidi-unit-test :  table.f5 present.
25-Aug-2026 01:45:08 importfitsidi-unit-test :  table.f6 present.
25-Aug-2026 01:45:08 importfitsidi-unit-test :  STATE/table.dat present.
25-Aug-2026 01:45:08 importfitsidi-unit-test :  HISTORY/table.dat present.
25-Aug-2026 01:45:08 importfitsidi-unit-test :  table.f1 present.
25-Aug-2026 01:45:08 importfitsidi-unit-test :  table.f3 present.
25-Aug-2026 01:45:08 importfitsidi-unit-test :  HISTORY/table.f0 present.
25-Aug-2026 01:45:08 importfitsidi-unit-test :  DATA_DESCRIPTION/table.f0 present.
25-Aug-2026 01:45:08 importfitsidi-unit-test :  DATA_DESCRIPTION/table.dat present.
25-Aug-2026 01:45:08 importfitsidi-unit-test :  FEED/table.dat present.
25-Aug-2026 01:45:08 importfitsidi-unit-test :  OBSERVATION/table.dat present.
25-Aug-2026 01:45:08 importfitsidi-unit-test :  PROCESSOR/table.f0 present.
25-Aug-2026 01:45:08 importfitsidi-unit-test :  PROCESSOR/table.dat present.
25-Aug-2026 01:45:08 importfitsidi-unit-test :  table.f4 present.
25-Aug-2026 01:45:08 importfitsidi-unit-test : MS exists. All tables present. Try opening as MS ...
25-Aug-2026 01:45:08 importfitsidi-unit-test : OK. Checking tables in detail ...
25-Aug-2026 01:45:08 importfitsidi-unit-test : comparing  ['UVW', 42, [0.0, 0.0, 0.0], 1e-08]
25-Aug-2026 01:45:08 importfitsidi-unit-test : comparing  ['EXPOSURE', 42, 2.0, 1e-08]
25-Aug-2026 01:45:08 importfitsidi-unit-test : comparing  ['DATA', 42, [[(1.06945515+7.91624188e-09j), (0.98315531+9.31322575e-10j), (1.0524447+5.77396486e-09j), (0.90496856+0j), (0.93005872-6.71682887e-09j), (0.80769897+0j), (0.93059886-6.97121116e-09j), (0.77081358+0j), (0.93020338-7.4505806e-09j), (0.83353537+0j), (0.91982168-5.54113422e-09j), (0.88411278-4.65661287e-10j), (1.02857709+5.7855063e-09j), (0.93398595+0j), (1.1388402+1.01289768e-08j), (2.49237108+0j)]], 1e-08]
25-Aug-2026 01:45:08 importfitsidi-unit-test : table  MAIN  as expected.
25-Aug-2026 01:45:08 importfitsidi-unit-test : comparing  ['UVW', 638, [171529.37575288, -786712.70341456, 210321.20978818], 1e-08]
25-Aug-2026 01:45:08 importfitsidi-unit-test : comparing  ['EXPOSURE', 638, 2.0, 1e-08]
25-Aug-2026 01:45:08 importfitsidi-unit-test : comparing  ['DATA', 638, [[(-0.00224198+0.00067056j), (-0.00475123+0.0024323j), (-0.00416393+0.00212671j), (-0.0056535+0.00340364j), (-0.00527357+0.00011977j), (-0.00292699+0.00131954j), (-0.00429945+0.00035823j), (-0.00545671-0.00033945j), (-0.00646004+0.00037293j), (-0.00419376-0.00115011j), (-0.00508117+0.00045939j), (-0.0050166-0.00047975j), (-0.00444734-0.00101535j), (-0.00384988-0.00102731j), (-0.00551326+0.00101364j), (-0.00337701+0.00080481j)]], 1e-08]
25-Aug-2026 01:45:08 importfitsidi-unit-test : table  MAIN  as expected.
25-Aug-2026 01:45:08 importfitsidi-unit-test : comparing  ['OFFSET', 1, [0.0, 0.0, 0.0], 0]
25-Aug-2026 01:45:08 importfitsidi-unit-test : comparing  ['POSITION', 1, [3370605.8469, 711917.6732, 5349830.8438], 0.0001]
25-Aug-2026 01:45:08 importfitsidi-unit-test : comparing  ['DISH_DIAMETER', 1, 0.0, 0.0]
25-Aug-2026 01:45:08 importfitsidi-unit-test : table  ANTENNA  as expected.
25-Aug-2026 01:45:08 importfitsidi-unit-test : comparing  ['NUM_CHAN', 7, 16, 0]
25-Aug-2026 01:45:08 importfitsidi-unit-test : comparing  ['TOTAL_BANDWIDTH', 7, 8000000.0, 0]
25-Aug-2026 01:45:08 importfitsidi-unit-test : comparing  ['CHAN_WIDTH', 7, [500000.0, 500000.0, 500000.0, 500000.0, 500000.0, 500000.0, 500000.0, 500000.0, 500000.0, 500000.0, 500000.0, 500000.0, 500000.0, 500000.0, 500000.0, 500000.0], 1e-08]
25-Aug-2026 01:45:08 importfitsidi-unit-test : comparing  ['CHAN_FREQ', 7, [43218490000.0, 43218990000.0, 43219490000.0, 43219990000.0, 43220490000.0, 43220990000.0, 43221490000.0, 43221990000.0, 43222490000.0, 43222990000.0, 43223490000.0, 43223990000.0, 43224490000.0, 43224990000.0, 43225490000.0, 43225990000.0], 1e-08]
25-Aug-2026 01:45:08 importfitsidi-unit-test : table  SPECTRAL_WINDOW  as expected.
25-Aug-2026 01:45:08 PASSED
25-Aug-2026 01:45:08
25-Aug-2026 01:45:08 test_task_importfitsidi.py::test_importfitsidi::test2 2026-08-25 01:45:09        WARN        FitsIDItoMS::fillAntennaTable        ARRAY_GEOMETRY input table does not contain dish DIAMETER column.
25-Aug-2026 01:45:08 2026-08-25 01:45:09        WARN        FitsIDItoMS::fillAntennaTable+         Will assume default diameter for TELESCOPE EVN which is 0 m.
25-Aug-2026 01:45:10 2026-08-25 01:45:10        WARN        FitsIDItoMS::fillAntennaTable        ARRAY_GEOMETRY input table does not contain dish DIAMETER column.
25-Aug-2026 01:45:10 2026-08-25 01:45:10        WARN        FitsIDItoMS::fillAntennaTable+         Will assume default diameter for TELESCOPE EVN which is 0 m.
25-Aug-2026 01:45:11 2026-08-25 01:45:12        WARN        MSConcat::concatenate (file /source/casa6/casatools/casacore/ms/MSOper/MSConcat.cc, line 1000)        Zero or negative scan numbers in MS. May lead to duplicate scan numbers in concatenated MS.
25-Aug-2026 01:45:11
25-Aug-2026 01:45:11 fitsidi-import: Test good input, list of two input files
25-Aug-2026 01:45:11 importfitsidi-unit-test : Success! Now checking output ...
25-Aug-2026 01:45:11 importfitsidi-unit-test :  STATE/table.f0 present.
25-Aug-2026 01:45:11 importfitsidi-unit-test :  table.dat present.
25-Aug-2026 01:45:11 importfitsidi-unit-test :  FLAG_CMD/table.dat present.
25-Aug-2026 01:45:11 importfitsidi-unit-test :  FIELD/table.dat present.
25-Aug-2026 01:45:11 importfitsidi-unit-test :  table.f8 present.
25-Aug-2026 01:45:11 importfitsidi-unit-test :  table.f7 present.
25-Aug-2026 01:45:11 importfitsidi-unit-test :  FEED/table.f0 present.
25-Aug-2026 01:45:11 importfitsidi-unit-test :  table.f2 present.
25-Aug-2026 01:45:11 importfitsidi-unit-test :  FIELD/table.f0 present.
25-Aug-2026 01:45:11 importfitsidi-unit-test :  OBSERVATION/table.f0 present.
25-Aug-2026 01:45:11 importfitsidi-unit-test :  POINTING/table.f0 present.
25-Aug-2026 01:45:11 importfitsidi-unit-test :  FLAG_CMD/table.f0 present.
25-Aug-2026 01:45:11 importfitsidi-unit-test :  POLARIZATION/table.f0 present.
25-Aug-2026 01:45:11 importfitsidi-unit-test :  SPECTRAL_WINDOW/table.dat present.
25-Aug-2026 01:45:11 importfitsidi-unit-test :  SPECTRAL_WINDOW/table.f0 present.
25-Aug-2026 01:45:11 importfitsidi-unit-test :  POLARIZATION/table.dat present.
25-Aug-2026 01:45:11 importfitsidi-unit-test :  ANTENNA/table.dat present.
25-Aug-2026 01:45:11 importfitsidi-unit-test :  POINTING/table.dat present.
25-Aug-2026 01:45:11 importfitsidi-unit-test :  ANTENNA/table.f0 present.
25-Aug-2026 01:45:11 importfitsidi-unit-test :  table.f5 present.
25-Aug-2026 01:45:11 importfitsidi-unit-test :  table.f6 present.
25-Aug-2026 01:45:11 importfitsidi-unit-test :  STATE/table.dat present.
25-Aug-2026 01:45:11 importfitsidi-unit-test :  HISTORY/table.dat present.
25-Aug-2026 01:45:11 importfitsidi-unit-test :  table.f1 present.
25-Aug-2026 01:45:11 importfitsidi-unit-test :  table.f3 present.
25-Aug-2026 01:45:11 importfitsidi-unit-test :  HISTORY/table.f0 present.
25-Aug-2026 01:45:11 importfitsidi-unit-test :  DATA_DESCRIPTION/table.f0 present.
25-Aug-2026 01:45:11 importfitsidi-unit-test :  DATA_DESCRIPTION/table.dat present.
25-Aug-2026 01:45:11 importfitsidi-unit-test :  FEED/table.dat present.
25-Aug-2026 01:45:11 importfitsidi-unit-test :  OBSERVATION/table.dat present.
25-Aug-2026 01:45:11 importfitsidi-unit-test :  PROCESSOR/table.f0 present.
25-Aug-2026 01:45:11 importfitsidi-unit-test :  PROCESSOR/table.dat present.
25-Aug-2026 01:45:11 importfitsidi-unit-test :  table.f4 present.
25-Aug-2026 01:45:11 importfitsidi-unit-test : MS exists. All tables present. Try opening as MS ...
25-Aug-2026 01:45:11 importfitsidi-unit-test : OK. Checking tables in detail ...
25-Aug-2026 01:45:11 importfitsidi-unit-test : comparing  ['UVW', 42, [0.0, 0.0, 0.0], 1e-08]
25-Aug-2026 01:45:11 importfitsidi-unit-test : comparing  ['EXPOSURE', 42, 2.0, 1e-08]
25-Aug-2026 01:45:11 importfitsidi-unit-test : comparing  ['DATA', 42, [[(1.06945515+7.91624188e-09j), (0.98315531+9.31322575e-10j), (1.0524447+5.77396486e-09j), (0.90496856+0j), (0.93005872-6.71682887e-09j), (0.80769897+0j), (0.93059886-6.97121116e-09j), (0.77081358+0j), (0.93020338-7.4505806e-09j), (0.83353537+0j), (0.91982168-5.54113422e-09j), (0.88411278-4.65661287e-10j), (1.02857709+5.7855063e-09j), (0.93398595+0j), (1.1388402+1.01289768e-08j), (2.49237108+0j)]], 1e-08]
25-Aug-2026 01:45:11 importfitsidi-unit-test : table  MAIN  as expected.
25-Aug-2026 01:45:11 importfitsidi-unit-test : comparing  ['UVW', 638, [171529.37575288, -786712.70341456, 210321.20978818], 1e-08]
25-Aug-2026 01:45:11 importfitsidi-unit-test : comparing  ['EXPOSURE', 638, 2.0, 1e-08]
25-Aug-2026 01:45:11 importfitsidi-unit-test : comparing  ['DATA', 638, [[(-0.00224198+0.00067056j), (-0.00475123+0.0024323j), (-0.00416393+0.00212671j), (-0.0056535+0.00340364j), (-0.00527357+0.00011977j), (-0.00292699+0.00131954j), (-0.00429945+0.00035823j), (-0.00545671-0.00033945j), (-0.00646004+0.00037293j), (-0.00419376-0.00115011j), (-0.00508117+0.00045939j), (-0.0050166-0.00047975j), (-0.00444734-0.00101535j), (-0.00384988-0.00102731j), (-0.00551326+0.00101364j), (-0.00337701+0.00080481j)]], 1e-08]
25-Aug-2026 01:45:11 importfitsidi-unit-test : table  MAIN  as expected.
25-Aug-2026 01:45:11 importfitsidi-unit-test : comparing  ['OFFSET', 1, [0.0, 0.0, 0.0], 0]
25-Aug-2026 01:45:11 importfitsidi-unit-test : comparing  ['POSITION', 1, [3370605.8469, 711917.6732, 5349830.8438], 0.0001]
25-Aug-2026 01:45:11 importfitsidi-unit-test : comparing  ['DISH_DIAMETER', 1, 0.0, 0.0]
25-Aug-2026 01:45:11 importfitsidi-unit-test : table  ANTENNA  as expected.
25-Aug-2026 01:45:11 importfitsidi-unit-test : comparing  ['NUM_CHAN', 7, 16, 0]
25-Aug-2026 01:45:11 importfitsidi-unit-test : comparing  ['TOTAL_BANDWIDTH', 7, 8000000.0, 0]
25-Aug-2026 01:45:11 importfitsidi-unit-test : comparing  ['CHAN_WIDTH', 7, [500000.0, 500000.0, 500000.0, 500000.0, 500000.0, 500000.0, 500000.0, 500000.0, 500000.0, 500000.0, 500000.0, 500000.0, 500000.0, 500000.0, 500000.0, 500000.0], 1e-08]
25-Aug-2026 01:45:11 importfitsidi-unit-test : comparing  ['CHAN_FREQ', 7, [43218490000.0, 43218990000.0, 43219490000.0, 43219990000.0, 43220490000.0, 43220990000.0, 43221490000.0, 43221990000.0, 43222490000.0, 43222990000.0, 43223490000.0, 43223990000.0, 43224490000.0, 43224990000.0, 43225490000.0, 43225990000.0], 1e-08]
25-Aug-2026 01:45:11 importfitsidi-unit-test : table  SPECTRAL_WINDOW  as expected.
25-Aug-2026 01:45:11 importfitsidi-unit-test : comparing  ['TIME_RANGE', 0, [4764708361.0, 4764708369.0], 1e-08]
25-Aug-2026 01:45:11 importfitsidi-unit-test : comparing  ['TIME_RANGE', 1, [4764708369.0, 4764708715.0], 1e-08]
25-Aug-2026 01:45:11 importfitsidi-unit-test : table  OBSERVATION  as expected.
25-Aug-2026 01:45:11 PASSED
25-Aug-2026 01:45:11
25-Aug-2026 01:45:13 test_task_importfitsidi.py::test_importfitsidi::test3
25-Aug-2026 01:45:13 fitsidi-import: Test antenna name and multi uvtable
25-Aug-2026 01:45:13 importfitsidi-unit-test : Success! Now checking output ...
25-Aug-2026 01:45:13 importfitsidi-unit-test :  STATE/table.f0 present.
25-Aug-2026 01:45:13 importfitsidi-unit-test :  table.dat present.
25-Aug-2026 01:45:13 importfitsidi-unit-test :  FLAG_CMD/table.dat present.
25-Aug-2026 01:45:13 importfitsidi-unit-test :  FIELD/table.dat present.
25-Aug-2026 01:45:13 importfitsidi-unit-test :  table.f8 present.
25-Aug-2026 01:45:13 importfitsidi-unit-test :  table.f7 present.
25-Aug-2026 01:45:13 importfitsidi-unit-test :  FEED/table.f0 present.
25-Aug-2026 01:45:13 importfitsidi-unit-test :  table.f2 present.
25-Aug-2026 01:45:13 importfitsidi-unit-test :  FIELD/table.f0 present.
25-Aug-2026 01:45:13 importfitsidi-unit-test :  OBSERVATION/table.f0 present.
25-Aug-2026 01:45:13 importfitsidi-unit-test :  POINTING/table.f0 present.
25-Aug-2026 01:45:13 importfitsidi-unit-test :  FLAG_CMD/table.f0 present.
25-Aug-2026 01:45:13 importfitsidi-unit-test :  POLARIZATION/table.f0 present.
25-Aug-2026 01:45:13 importfitsidi-unit-test :  SPECTRAL_WINDOW/table.dat present.
25-Aug-2026 01:45:13 importfitsidi-unit-test :  SPECTRAL_WINDOW/table.f0 present.
25-Aug-2026 01:45:13 importfitsidi-unit-test :  POLARIZATION/table.dat present.
25-Aug-2026 01:45:13 importfitsidi-unit-test :  ANTENNA/table.dat present.
25-Aug-2026 01:45:13 importfitsidi-unit-test :  POINTING/table.dat present.
25-Aug-2026 01:45:13 importfitsidi-unit-test :  ANTENNA/table.f0 present.
25-Aug-2026 01:45:13 importfitsidi-unit-test :  table.f5 present.
25-Aug-2026 01:45:13 importfitsidi-unit-test :  table.f6 present.
25-Aug-2026 01:45:13 importfitsidi-unit-test :  STATE/table.dat present.
25-Aug-2026 01:45:13 importfitsidi-unit-test :  HISTORY/table.dat present.
25-Aug-2026 01:45:13 importfitsidi-unit-test :  table.f1 present.
25-Aug-2026 01:45:13 importfitsidi-unit-test :  table.f3 present.
25-Aug-2026 01:45:13 importfitsidi-unit-test :  HISTORY/table.f0 present.
25-Aug-2026 01:45:13 importfitsidi-unit-test :  DATA_DESCRIPTION/table.f0 present.
25-Aug-2026 01:45:13 importfitsidi-unit-test :  DATA_DESCRIPTION/table.dat present.
25-Aug-2026 01:45:13 importfitsidi-unit-test :  FEED/table.dat present.
25-Aug-2026 01:45:13 importfitsidi-unit-test :  OBSERVATION/table.dat present.
25-Aug-2026 01:45:13 importfitsidi-unit-test :  PROCESSOR/table.f0 present.
25-Aug-2026 01:45:13 importfitsidi-unit-test :  PROCESSOR/table.dat present.
25-Aug-2026 01:45:13 importfitsidi-unit-test :  table.f4 present.
25-Aug-2026 01:45:13 importfitsidi-unit-test : MS exists. All tables present. Try opening as MS ...
25-Aug-2026 01:45:13 importfitsidi-unit-test : OK. Checking tables in detail ...
25-Aug-2026 01:45:13 importfitsidi-unit-test : comparing  ['UVW', 253, [-209524.112917, 52443.4688607, 25501.833085], 1e-06]
25-Aug-2026 01:45:13 importfitsidi-unit-test : comparing  ['EXPOSURE', 253, 1.0, 1e-08]
25-Aug-2026 01:45:13 importfitsidi-unit-test : comparing  ['WEIGHT', 253, 500000.0, 1e-08]
25-Aug-2026 01:45:13 importfitsidi-unit-test : table  MAIN  as expected.
25-Aug-2026 01:45:13 importfitsidi-unit-test : comparing  ['OFFSET', 1, [0.0, 0.0, 0.0], 0]
25-Aug-2026 01:45:13 importfitsidi-unit-test : comparing  ['POSITION', 1, [3859711.503, -201995.077, 5056134.251], 0.001]
25-Aug-2026 01:45:13 importfitsidi-unit-test : comparing  ['DISH_DIAMETER', 1, 15.0, 0.001]
25-Aug-2026 01:45:13 importfitsidi-unit-test : comparing  ['NAME', 1, 'Kn', 0]
25-Aug-2026 01:45:13 importfitsidi-unit-test : table  ANTENNA  as expected.
25-Aug-2026 01:45:13 importfitsidi-unit-test : comparing  ['NUM_CHAN', 3, 512, 0]
25-Aug-2026 01:45:13 importfitsidi-unit-test : comparing  ['TOTAL_BANDWIDTH', 3, 128000000.0, 0]
25-Aug-2026 01:45:13 importfitsidi-unit-test : comparing  ['CHAN_WIDTH', 3, [250000.0, 250000.0, 250000.0, 250000.0, 250000.0, 250000.0, 250000.0, 250000.0, 250000.0, 250000.0, 250000.0, 250000.0, 250000.0, 250000.0, 250000.0, 250000.0, 250000.0, 250000.0, 250000.0, 250000.0, 250000.0, 250000.0, 250000.0, 250000.0, 250000.0, 250000.0, 250000.0, 250000.0, 250000.0, 250000.0, 250000.0, 250000.0, 250000.0, 250000.0, 250000.0, 250000.0, 250000.0, 250000.0, 250000.0, 250000.0, 250000.0, 250000.0, 250000.0, 250000.0, 250000.0, 250000.0, 250000.0, 250000.0, 250000.0, 250000.0, 250000.0, 250000.0, 250000.0, 250000.0, 250000.0, 250000.0, 250000.0, 250000.0, 250000.0, 250000.0, 250000.0, 250000.0, 250000.0, 250000.0, 250000.0, 250000.0, 250000.0, 250000.0, 250000.0, 250000.0, 250000.0, 250000.0, 250000.0, 250000.0, 250000.0, 250000.0, 250000.0, 250000.0, 250000.0, 250000.0, 250000.0, 250000.0, 250000.0, 250000.0, 250000.0, 250000.0, 250000.0, 250000.0, 250000.0, 250000.0, 250000.0, 250000.0, 250000.0, 250000.0, 250000.0, 250000.0, 250000.0, 250000.0, 250000.0, 250000.0, 250000.0, 250000.0, 250000.0, 250000.0, 250000.0, 250000.0, 250000.0, 250000.0, 250000.0, 250000.0, 250000.0, 250000.0, 250000.0, 250000.0, 250000.0, 250000.0, 250000.0, 250000.0, 250000.0, 250000.0, 250000.0, 250000.0, 250000.0, 250000.0, 250000.0, 250000.0, 250000.0, 250000.0, 250000.0, 250000.0, 250000.0, 250000.0, 250000.0, 250000.0, 250000.0, 250000.0, 250000.0, 250000.0, 250000.0, 250000.0, 250000.0, 250000.0, 250000.0, 250000.0, 250000.0, 250000.0, 250000.0, 250000.0, 250000.0, 250000.0, 250000.0, 250000.0, 250000.0, 250000.0, 250000.0, 250000.0, 250000.0, 250000.0, 250000.0, 250000.0, 250000.0, 250000.0, 250000.0, 250000.0, 250000.0, 250000.0, 250000.0, 250000.0, 250000.0, 250000.0, 250000.0, 250000.0, 250000.0, 250000.0, 250000.0, 250000.0, 250000.0, 250000.0, 250000.0, 250000.0, 250000.0, 250000.0, 250000.0, 250000.0, 250000.0, 250000.0, 250000.0, 250000.0, 250000.0, 250000.0, 250000.0, 250000.0, 250000.0, 250000.0, 250000.0, 250000.0, 250000.0, 250000.0, 250000.0, 250000.0, 250000.0, 250000.0, 250000.0, 250000.0, 250000.0, 250000.0, 250000.0, 250000.0, 250000.0, 250000.0, 250000.0, 250000.0, 250000.0, 250000.0, 250000.0, 250000.0, 250000.0, 250000.0, 250000.0, 250000.0, 250000.0, 250000.0, 250000.0, 250000.0, 250000.0, 250000.0, 250000.0, 250000.0, 250000.0, 250000.0, 250000.0, 250000.0, 250000.0, 250000.0, 250000.0, 250000.0, 250000.0, 250000.0, 250000.0, 250000.0, 250000.0, 250000.0, 250000.0, 250000.0, 250000.0, 250000.0, 250000.0, 250000.0, 250000.0, 250000.0, 250000.0, 250000.0, 250000.0, 250000.0, 250000.0, 250000.0, 250000.0, 250000.0, 250000.0, 250000.0, 250000.0, 250000.0, 250000.0, 250000.0, 250000.0, 250000.0, 250000.0, 250000.0, 250000.0, 250000.0, 250000.0, 250000.0, 250000.0, 250000.0, 250000.0, 250000.0, 250000.0, 250000.0, 250000.0, 250000.0, 250000.0, 250000.0, 250000.0, 250000.0, 250000.0, 250000.0, 250000.0, 250000.0, 250000.0, 250000.0, 250000.0, 250000.0, 250000.0, 250000.0, 250000.0, 250000.0, 250000.0, 250000.0, 250000.0, 250000.0, 250000.0, 250000.0, 250000.0, 250000.0, 250000.0, 250000.0, 250000.0, 250000.0, 250000.0, 250000.0, 250000.0, 250000.0, 250000.0, 250000.0, 250000.0, 250000.0, 250000.0, 250000.0, 250000.0, 250000.0, 250000.0, 250000.0, 250000.0, 250000.0, 250000.0, 250000.0, 250000.0, 250000.0, 250000.0, 250000.0, 250000.0, 250000.0, 250000.0, 250000.0, 250000.0, 250000.0, 250000.0, 250000.0, 250000.0, 250000.0, 250000.0, 250000.0, 250000.0, 250000.0, 250000.0, 250000.0, 250000.0, 250000.0, 250000.0, 250000.0, 250000.0, 250000.0, 250000.0, 250000.0, 250000.0, 250000.0, 250000.0, 250000.0, 250000.0, 250000.0, 250000.0, 250000.0, 250000.0, 250000.0, 250000.0, 250000.0, 250000.0, 250000.0, 250000.0, 250000.0, 250000.0, 250000.0, 250000.0, 250000.0, 250000.0, 250000.0, 250000.0, 250000.0, 250000.0, 250000.0, 250000.0, 250000.0, 250000.0, 250000.0, 250000.0, 250000.0, 250000.0, 250000.0, 250000.0, 250000.0, 250000.0, 250000.0, 250000.0, 250000.0, 250000.0, 250000.0, 250000.0, 250000.0, 250000.0, 250000.0, 250000.0, 250000.0, 250000.0, 250000.0, 250000.0, 250000.0, 250000.0, 250000.0, 250000.0, 250000.0, 250000.0, 250000.0, 250000.0, 250000.0, 250000.0, 250000.0, 250000.0, 250000.0, 250000.0, 250000.0, 250000.0, 250000.0, 250000.0, 250000.0, 250000.0, 250000.0, 250000.0, 250000.0, 250000.0, 250000.0, 250000.0, 250000.0, 250000.0, 250000.0, 250000.0, 250000.0, 250000.0, 250000.0, 250000.0, 250000.0, 250000.0, 250000.0, 250000.0, 250000.0, 250000.0, 250000.0, 250000.0, 250000.0, 250000.0, 250000.0, 250000.0, 250000.0, 250000.0, 250000.0, 250000.0, 250000.0, 250000.0, 250000.0, 250000.0, 250000.0, 250000.0, 250000.0, 250000.0, 250000.0, 250000.0, 250000.0, 250000.0, 250000.0, 250000.0, 250000.0, 250000.0, 250000.0, 250000.0, 250000.0, 250000.0, 250000.0, 250000.0, 250000.0, 250000.0, 250000.0, 250000.0, 250000.0, 250000.0, 250000.0, 250000.0, 250000.0, 250000.0, 250000.0, 250000.0, 250000.0, 250000.0, 250000.0, 250000.0, 250000.0, 250000.0, 250000.0, 250000.0, 250000.0, 250000.0, 250000.0, 250000.0, 250000.0, 250000.0, 250000.0, 250000.0, 250000.0, 250000.0, 250000.0, 250000.0, 250000.0, 250000.0, 250000.0], 1e-08]
25-Aug-2026 01:45:13 importfitsidi-unit-test : comparing  ['CHAN_FREQ', 3, [5872000000.0, 5872250000.0, 5872500000.0, 5872750000.0, 5873000000.0, 5873250000.0, 5873500000.0, 5873750000.0, 5874000000.0, 5874250000.0, 5874500000.0, 5874750000.0, 5875000000.0, 5875250000.0, 5875500000.0, 5875750000.0, 5876000000.0, 5876250000.0, 5876500000.0, 5876750000.0, 5877000000.0, 5877250000.0, 5877500000.0, 5877750000.0, 5878000000.0, 5878250000.0, 5878500000.0, 5878750000.0, 5879000000.0, 5879250000.0, 5879500000.0, 5879750000.0, 5880000000.0, 5880250000.0, 5880500000.0, 5880750000.0, 5881000000.0, 5881250000.0, 5881500000.0, 5881750000.0, 5882000000.0, 5882250000.0, 5882500000.0, 5882750000.0, 5883000000.0, 5883250000.0, 5883500000.0, 5883750000.0, 5884000000.0, 5884250000.0, 5884500000.0, 5884750000.0, 5885000000.0, 5885250000.0, 5885500000.0, 5885750000.0, 5886000000.0, 5886250000.0, 5886500000.0, 5886750000.0, 5887000000.0, 5887250000.0, 5887500000.0, 5887750000.0, 5888000000.0, 5888250000.0, 5888500000.0, 5888750000.0, 5889000000.0, 5889250000.0, 5889500000.0, 5889750000.0, 5890000000.0, 5890250000.0, 5890500000.0, 5890750000.0, 5891000000.0, 5891250000.0, 5891500000.0, 5891750000.0, 5892000000.0, 5892250000.0, 5892500000.0, 5892750000.0, 5893000000.0, 5893250000.0, 5893500000.0, 5893750000.0, 5894000000.0, 5894250000.0, 5894500000.0, 5894750000.0, 5895000000.0, 5895250000.0, 5895500000.0, 5895750000.0, 5896000000.0, 5896250000.0, 5896500000.0, 5896750000.0, 5897000000.0, 5897250000.0, 5897500000.0, 5897750000.0, 5898000000.0, 5898250000.0, 5898500000.0, 5898750000.0, 5899000000.0, 5899250000.0, 5899500000.0, 5899750000.0, 5900000000.0, 5900250000.0, 5900500000.0, 5900750000.0, 5901000000.0, 5901250000.0, 5901500000.0, 5901750000.0, 5902000000.0, 5902250000.0, 5902500000.0, 5902750000.0, 5903000000.0, 5903250000.0, 5903500000.0, 5903750000.0, 5904000000.0, 5904250000.0, 5904500000.0, 5904750000.0, 5905000000.0, 5905250000.0, 5905500000.0, 5905750000.0, 5906000000.0, 5906250000.0, 5906500000.0, 5906750000.0, 5907000000.0, 5907250000.0, 5907500000.0, 5907750000.0, 5908000000.0, 5908250000.0, 5908500000.0, 5908750000.0, 5909000000.0, 5909250000.0, 5909500000.0, 5909750000.0, 5910000000.0, 5910250000.0, 5910500000.0, 5910750000.0, 5911000000.0, 5911250000.0, 5911500000.0, 5911750000.0, 5912000000.0, 5912250000.0, 5912500000.0, 5912750000.0, 5913000000.0, 5913250000.0, 5913500000.0, 5913750000.0, 5914000000.0, 5914250000.0, 5914500000.0, 5914750000.0, 5915000000.0, 5915250000.0, 5915500000.0, 5915750000.0, 5916000000.0, 5916250000.0, 5916500000.0, 5916750000.0, 5917000000.0, 5917250000.0, 5917500000.0, 5917750000.0, 5918000000.0, 5918250000.0, 5918500000.0, 5918750000.0, 5919000000.0, 5919250000.0, 5919500000.0, 5919750000.0, 5920000000.0, 5920250000.0, 5920500000.0, 5920750000.0, 5921000000.0, 5921250000.0, 5921500000.0, 5921750000.0, 5922000000.0, 5922250000.0, 5922500000.0, 5922750000.0, 5923000000.0, 5923250000.0, 5923500000.0, 5923750000.0, 5924000000.0, 5924250000.0, 5924500000.0, 5924750000.0, 5925000000.0, 5925250000.0, 5925500000.0, 5925750000.0, 5926000000.0, 5926250000.0, 5926500000.0, 5926750000.0, 5927000000.0, 5927250000.0, 5927500000.0, 5927750000.0, 5928000000.0, 5928250000.0, 5928500000.0, 5928750000.0, 5929000000.0, 5929250000.0, 5929500000.0, 5929750000.0, 5930000000.0, 5930250000.0, 5930500000.0, 5930750000.0, 5931000000.0, 5931250000.0, 5931500000.0, 5931750000.0, 5932000000.0, 5932250000.0, 5932500000.0, 5932750000.0, 5933000000.0, 5933250000.0, 5933500000.0, 5933750000.0, 5934000000.0, 5934250000.0, 5934500000.0, 5934750000.0, 5935000000.0, 5935250000.0, 5935500000.0, 5935750000.0, 5936000000.0, 5936250000.0, 5936500000.0, 5936750000.0, 5937000000.0, 5937250000.0, 5937500000.0, 5937750000.0, 5938000000.0, 5938250000.0, 5938500000.0, 5938750000.0, 5939000000.0, 5939250000.0, 5939500000.0, 5939750000.0, 5940000000.0, 5940250000.0, 5940500000.0, 5940750000.0, 5941000000.0, 5941250000.0, 5941500000.0, 5941750000.0, 5942000000.0, 5942250000.0, 5942500000.0, 5942750000.0, 5943000000.0, 5943250000.0, 5943500000.0, 5943750000.0, 5944000000.0, 5944250000.0, 5944500000.0, 5944750000.0, 5945000000.0, 5945250000.0, 5945500000.0, 5945750000.0, 5946000000.0, 5946250000.0, 5946500000.0, 5946750000.0, 5947000000.0, 5947250000.0, 5947500000.0, 5947750000.0, 5948000000.0, 5948250000.0, 5948500000.0, 5948750000.0, 5949000000.0, 5949250000.0, 5949500000.0, 5949750000.0, 5950000000.0, 5950250000.0, 5950500000.0, 5950750000.0, 5951000000.0, 5951250000.0, 5951500000.0, 5951750000.0, 5952000000.0, 5952250000.0, 5952500000.0, 5952750000.0, 5953000000.0, 5953250000.0, 5953500000.0, 5953750000.0, 5954000000.0, 5954250000.0, 5954500000.0, 5954750000.0, 5955000000.0, 5955250000.0, 5955500000.0, 5955750000.0, 5956000000.0, 5956250000.0, 5956500000.0, 5956750000.0, 5957000000.0, 5957250000.0, 5957500000.0, 5957750000.0, 5958000000.0, 5958250000.0, 5958500000.0, 5958750000.0, 5959000000.0, 5959250000.0, 5959500000.0, 5959750000.0, 5960000000.0, 5960250000.0, 5960500000.0, 5960750000.0, 5961000000.0, 5961250000.0, 5961500000.0, 5961750000.0, 5962000000.0, 5962250000.0, 5962500000.0, 5962750000.0, 5963000000.0, 5963250000.0, 5963500000.0, 5963750000.0, 5964000000.0, 5964250000.0, 5964500000.0, 5964750000.0, 5965000000.0, 5965250000.0, 5965500000.0, 5965750000.0, 5966000000.0, 5966250000.0, 5966500000.0, 5966750000.0, 5967000000.0, 5967250000.0, 5967500000.0, 5967750000.0, 5968000000.0, 5968250000.0, 5968500000.0, 5968750000.0, 5969000000.0, 5969250000.0, 5969500000.0, 5969750000.0, 5970000000.0, 5970250000.0, 5970500000.0, 5970750000.0, 5971000000.0, 5971250000.0, 5971500000.0, 5971750000.0, 5972000000.0, 5972250000.0, 5972500000.0, 5972750000.0, 5973000000.0, 5973250000.0, 5973500000.0, 5973750000.0, 5974000000.0, 5974250000.0, 5974500000.0, 5974750000.0, 5975000000.0, 5975250000.0, 5975500000.0, 5975750000.0, 5976000000.0, 5976250000.0, 5976500000.0, 5976750000.0, 5977000000.0, 5977250000.0, 5977500000.0, 5977750000.0, 5978000000.0, 5978250000.0, 5978500000.0, 5978750000.0, 5979000000.0, 5979250000.0, 5979500000.0, 5979750000.0, 5980000000.0, 5980250000.0, 5980500000.0, 5980750000.0, 5981000000.0, 5981250000.0, 5981500000.0, 5981750000.0, 5982000000.0, 5982250000.0, 5982500000.0, 5982750000.0, 5983000000.0, 5983250000.0, 5983500000.0, 5983750000.0, 5984000000.0, 5984250000.0, 5984500000.0, 5984750000.0, 5985000000.0, 5985250000.0, 5985500000.0, 5985750000.0, 5986000000.0, 5986250000.0, 5986500000.0, 5986750000.0, 5987000000.0, 5987250000.0, 5987500000.0, 5987750000.0, 5988000000.0, 5988250000.0, 5988500000.0, 5988750000.0, 5989000000.0, 5989250000.0, 5989500000.0, 5989750000.0, 5990000000.0, 5990250000.0, 5990500000.0, 5990750000.0, 5991000000.0, 5991250000.0, 5991500000.0, 5991750000.0, 5992000000.0, 5992250000.0, 5992500000.0, 5992750000.0, 5993000000.0, 5993250000.0, 5993500000.0, 5993750000.0, 5994000000.0, 5994250000.0, 5994500000.0, 5994750000.0, 5995000000.0, 5995250000.0, 5995500000.0, 5995750000.0, 5996000000.0, 5996250000.0, 5996500000.0, 5996750000.0, 5997000000.0, 5997250000.0, 5997500000.0, 5997750000.0, 5998000000.0, 5998250000.0, 5998500000.0, 5998750000.0, 5999000000.0, 5999250000.0, 5999500000.0, 5999750000.0], 1e-08]
25-Aug-2026 01:45:13 importfitsidi-unit-test : table  SPECTRAL_WINDOW  as expected.
25-Aug-2026 01:45:13 PASSED
25-Aug-2026 01:45:13
25-Aug-2026 01:45:14 test_task_importfitsidi.py::test_importfitsidi::test4 2026-08-25 01:45:14        WARN        FitsIDItoMS::fillAntennaTable        ARRAY_GEOMETRY input table does not contain dish DIAMETER column.
25-Aug-2026 01:45:14 2026-08-25 01:45:14        WARN        FitsIDItoMS::fillAntennaTable+         Will assume default diameter for TELESCOPE EVN which is 0 m.
25-Aug-2026 01:45:15 2026-08-25 01:45:16        WARN        FitsIDItoMS::fillAntennaTable        ARRAY_GEOMETRY input table does not contain dish DIAMETER column.
25-Aug-2026 01:45:15 2026-08-25 01:45:16        WARN        FitsIDItoMS::fillAntennaTable+         Will assume default diameter for TELESCOPE EVN which is 0 m.
25-Aug-2026 01:45:17 2026-08-25 01:45:17        WARN        MSConcat::concatenate (file /source/casa6/casatools/casacore/ms/MSOper/MSConcat.cc, line 1000)        Zero or negative scan numbers in MS. May lead to duplicate scan numbers in concatenated MS.
25-Aug-2026 01:45:17
25-Aug-2026 01:45:17 fitsidi-import: Test good input, list of two input files, constobsid and scanreindexing
25-Aug-2026 01:45:17 importfitsidi-unit-test : Success! Now checking output ...
25-Aug-2026 01:45:17 importfitsidi-unit-test :  STATE/table.f0 present.
25-Aug-2026 01:45:17 importfitsidi-unit-test :  table.dat present.
25-Aug-2026 01:45:17 importfitsidi-unit-test :  FLAG_CMD/table.dat present.
25-Aug-2026 01:45:17 importfitsidi-unit-test :  FIELD/table.dat present.
25-Aug-2026 01:45:17 importfitsidi-unit-test :  table.f8 present.
25-Aug-2026 01:45:17 importfitsidi-unit-test :  table.f7 present.
25-Aug-2026 01:45:17 importfitsidi-unit-test :  FEED/table.f0 present.
25-Aug-2026 01:45:17 importfitsidi-unit-test :  table.f2 present.
25-Aug-2026 01:45:17 importfitsidi-unit-test :  FIELD/table.f0 present.
25-Aug-2026 01:45:17 importfitsidi-unit-test :  OBSERVATION/table.f0 present.
25-Aug-2026 01:45:17 importfitsidi-unit-test :  POINTING/table.f0 present.
25-Aug-2026 01:45:17 importfitsidi-unit-test :  FLAG_CMD/table.f0 present.
25-Aug-2026 01:45:17 importfitsidi-unit-test :  POLARIZATION/table.f0 present.
25-Aug-2026 01:45:17 importfitsidi-unit-test :  SPECTRAL_WINDOW/table.dat present.
25-Aug-2026 01:45:17 importfitsidi-unit-test :  SPECTRAL_WINDOW/table.f0 present.
25-Aug-2026 01:45:17 importfitsidi-unit-test :  POLARIZATION/table.dat present.
25-Aug-2026 01:45:17 importfitsidi-unit-test :  ANTENNA/table.dat present.
25-Aug-2026 01:45:17 importfitsidi-unit-test :  POINTING/table.dat present.
25-Aug-2026 01:45:17 importfitsidi-unit-test :  ANTENNA/table.f0 present.
25-Aug-2026 01:45:17 importfitsidi-unit-test :  table.f5 present.
25-Aug-2026 01:45:17 importfitsidi-unit-test :  table.f6 present.
25-Aug-2026 01:45:17 importfitsidi-unit-test :  STATE/table.dat present.
25-Aug-2026 01:45:17 importfitsidi-unit-test :  HISTORY/table.dat present.
25-Aug-2026 01:45:17 importfitsidi-unit-test :  table.f1 present.
25-Aug-2026 01:45:17 importfitsidi-unit-test :  table.f3 present.
25-Aug-2026 01:45:17 importfitsidi-unit-test :  HISTORY/table.f0 present.
25-Aug-2026 01:45:17 importfitsidi-unit-test :  DATA_DESCRIPTION/table.f0 present.
25-Aug-2026 01:45:17 importfitsidi-unit-test :  DATA_DESCRIPTION/table.dat present.
25-Aug-2026 01:45:17 importfitsidi-unit-test :  FEED/table.dat present.
25-Aug-2026 01:45:17 importfitsidi-unit-test :  OBSERVATION/table.dat present.
25-Aug-2026 01:45:17 importfitsidi-unit-test :  PROCESSOR/table.f0 present.
25-Aug-2026 01:45:17 importfitsidi-unit-test :  PROCESSOR/table.dat present.
25-Aug-2026 01:45:17 importfitsidi-unit-test :  table.f4 present.
25-Aug-2026 01:45:17 importfitsidi-unit-test : MS exists. All tables present. Try opening as MS ...
25-Aug-2026 01:45:17 importfitsidi-unit-test : OK. Checking tables in detail ...
25-Aug-2026 01:45:17 importfitsidi-unit-test : comparing  ['UVW', 42, [0.0, 0.0, 0.0], 1e-08]
25-Aug-2026 01:45:17 importfitsidi-unit-test : comparing  ['EXPOSURE', 42, 2.0, 1e-08]
25-Aug-2026 01:45:17 importfitsidi-unit-test : comparing  ['DATA', 42, [[(1.06945515+7.91624188e-09j), (0.98315531+9.31322575e-10j), (1.0524447+5.77396486e-09j), (0.90496856+0j), (0.93005872-6.71682887e-09j), (0.80769897+0j), (0.93059886-6.97121116e-09j), (0.77081358+0j), (0.93020338-7.4505806e-09j), (0.83353537+0j), (0.91982168-5.54113422e-09j), (0.88411278-4.65661287e-10j), (1.02857709+5.7855063e-09j), (0.93398595+0j), (1.1388402+1.01289768e-08j), (2.49237108+0j)]], 1e-08]
25-Aug-2026 01:45:17 importfitsidi-unit-test : comparing  ['OBSERVATION_ID', 42, 0, 0]
25-Aug-2026 01:45:17 importfitsidi-unit-test : comparing  ['SCAN_NUMBER', 42, 1, 0]
25-Aug-2026 01:45:17 importfitsidi-unit-test : table  MAIN  as expected.
25-Aug-2026 01:45:17 importfitsidi-unit-test : comparing  ['UVW', 638, [171529.37575288, -786712.70341456, 210321.20978818], 1e-08]
25-Aug-2026 01:45:17 importfitsidi-unit-test : comparing  ['EXPOSURE', 638, 2.0, 1e-08]
25-Aug-2026 01:45:17 importfitsidi-unit-test : comparing  ['DATA', 638, [[(-0.00224198+0.00067056j), (-0.00475123+0.0024323j), (-0.00416393+0.00212671j), (-0.0056535+0.00340364j), (-0.00527357+0.00011977j), (-0.00292699+0.00131954j), (-0.00429945+0.00035823j), (-0.00545671-0.00033945j), (-0.00646004+0.00037293j), (-0.00419376-0.00115011j), (-0.00508117+0.00045939j), (-0.0050166-0.00047975j), (-0.00444734-0.00101535j), (-0.00384988-0.00102731j), (-0.00551326+0.00101364j), (-0.00337701+0.00080481j)]], 1e-08]
25-Aug-2026 01:45:17 importfitsidi-unit-test : comparing  ['OBSERVATION_ID', 638, 0, 0]
25-Aug-2026 01:45:17 importfitsidi-unit-test : comparing  ['SCAN_NUMBER', 638, 14, 0]
25-Aug-2026 01:45:17 importfitsidi-unit-test : table  MAIN  as expected.
25-Aug-2026 01:45:17 importfitsidi-unit-test : comparing  ['TIME_RANGE', 0, [4764708361.0, 4764708715.0], 1e-08]
25-Aug-2026 01:45:17 importfitsidi-unit-test : table  OBSERVATION  as expected.
25-Aug-2026 01:45:17 PASSED
25-Aug-2026 01:45:17
25-Aug-2026 01:45:19 test_task_importfitsidi.py::test_importfitsidi::test5
25-Aug-2026 01:45:19 fitsidi-import: Test e-MERLIN polarization swapping
25-Aug-2026 01:45:19 importfitsidi-unit-test : Success! Now checking output ...
25-Aug-2026 01:45:19 PASSED
25-Aug-2026 01:45:19
25-Aug-2026 01:45:21 test_task_importfitsidi.py::test_importfitsidi::test6 2026-08-25 01:45:21        WARN        FitsIDItoMS()::fillCorrelatorModelTable        not yet implemented
25-Aug-2026 01:45:21 2026-08-25 01:45:22        WARN                FITS card 46: EQUINOX = 'J2000   '           /                                               
25-Aug-2026 01:45:21 2026-08-25 01:45:22        WARN                Keyword value has wrong data type.
25-Aug-2026 01:45:24
25-Aug-2026 01:45:24 fitsidi-import: Test import of gain curves
25-Aug-2026 01:45:24 importfitsidi-unit-test : Success! Now checking output ...
25-Aug-2026 01:45:24 importfitsidi-unit-test :  STATE/table.f0 present.
25-Aug-2026 01:45:24 importfitsidi-unit-test :  table.dat present.
25-Aug-2026 01:45:24 importfitsidi-unit-test :  FLAG_CMD/table.dat present.
25-Aug-2026 01:45:24 importfitsidi-unit-test :  FIELD/table.dat present.
25-Aug-2026 01:45:24 importfitsidi-unit-test :  table.f8 present.
25-Aug-2026 01:45:24 importfitsidi-unit-test :  table.f7 present.
25-Aug-2026 01:45:24 importfitsidi-unit-test :  FEED/table.f0 present.
25-Aug-2026 01:45:24 importfitsidi-unit-test :  table.f2 present.
25-Aug-2026 01:45:24 importfitsidi-unit-test :  GAIN_CURVE/table.f0 present.
25-Aug-2026 01:45:24 importfitsidi-unit-test :  FIELD/table.f0 present.
25-Aug-2026 01:45:24 importfitsidi-unit-test :  OBSERVATION/table.f0 present.
25-Aug-2026 01:45:24 importfitsidi-unit-test :  POINTING/table.f0 present.
25-Aug-2026 01:45:24 importfitsidi-unit-test :  FLAG_CMD/table.f0 present.
25-Aug-2026 01:45:24 importfitsidi-unit-test :  POLARIZATION/table.f0 present.
25-Aug-2026 01:45:24 importfitsidi-unit-test :  SPECTRAL_WINDOW/table.dat present.
25-Aug-2026 01:45:24 importfitsidi-unit-test :  SPECTRAL_WINDOW/table.f0 present.
25-Aug-2026 01:45:24 importfitsidi-unit-test :  POLARIZATION/table.dat present.
25-Aug-2026 01:45:24 importfitsidi-unit-test :  ANTENNA/table.dat present.
25-Aug-2026 01:45:24 importfitsidi-unit-test :  POINTING/table.dat present.
25-Aug-2026 01:45:24 importfitsidi-unit-test :  ANTENNA/table.f0 present.
25-Aug-2026 01:45:24 importfitsidi-unit-test :  table.f5 present.
25-Aug-2026 01:45:24 importfitsidi-unit-test :  table.f6 present.
25-Aug-2026 01:45:24 importfitsidi-unit-test :  STATE/table.dat present.
25-Aug-2026 01:45:24 importfitsidi-unit-test :  HISTORY/table.dat present.
25-Aug-2026 01:45:24 importfitsidi-unit-test :  table.f1 present.
25-Aug-2026 01:45:24 importfitsidi-unit-test :  table.f3 present.
25-Aug-2026 01:45:24 importfitsidi-unit-test :  HISTORY/table.f0 present.
25-Aug-2026 01:45:24 importfitsidi-unit-test :  DATA_DESCRIPTION/table.f0 present.
25-Aug-2026 01:45:24 importfitsidi-unit-test :  DATA_DESCRIPTION/table.dat present.
25-Aug-2026 01:45:24 importfitsidi-unit-test :  FEED/table.dat present.
25-Aug-2026 01:45:24 importfitsidi-unit-test :  OBSERVATION/table.dat present.
25-Aug-2026 01:45:24 importfitsidi-unit-test :  PROCESSOR/table.f0 present.
25-Aug-2026 01:45:24 importfitsidi-unit-test :  PROCESSOR/table.dat present.
25-Aug-2026 01:45:24 importfitsidi-unit-test :  table.f4 present.
25-Aug-2026 01:45:24 importfitsidi-unit-test : MS exists. All tables present. Try opening as MS ...
25-Aug-2026 01:45:24 importfitsidi-unit-test : OK. Checking tables in detail ...
25-Aug-2026 01:45:24 importfitsidi-unit-test : comparing  ['TYPE', 8, 'POWER(ZA)', 0]
25-Aug-2026 01:45:24 importfitsidi-unit-test : comparing  ['NUM_POLY', 8, 3, 0]
25-Aug-2026 01:45:24 importfitsidi-unit-test : comparing  ['GAIN', 8, [[0.80699998, 0.01596, -0.0002047], [0.80699998, 0.01596, -0.0002047]], 1e-08]
25-Aug-2026 01:45:24 importfitsidi-unit-test : comparing  ['SENSITIVITY', 8, [0.07699999, 0.06499999], 1e-08]
25-Aug-2026 01:45:24 importfitsidi-unit-test : table  GAIN_CURVE  as expected.
25-Aug-2026 01:45:24 PASSED
25-Aug-2026 01:45:24
25-Aug-2026 01:45:24 test_task_importfitsidi.py::test_importfitsidi::test7 2026-08-25 01:45:25        WARN        FitsIDItoMS::fillAntennaTable        ARRAY_GEOMETRY input table does not contain dish DIAMETER column.
25-Aug-2026 01:45:24 2026-08-25 01:45:25        WARN        FitsIDItoMS::fillAntennaTable+         Will assume default diameter for TELESCOPE EVN which is 0 m.
25-Aug-2026 01:45:26 2026-08-25 01:45:27        WARN        FitsIDItoMS::fillAntennaTable        ARRAY_GEOMETRY input table does not contain dish DIAMETER column.
25-Aug-2026 01:45:26 2026-08-25 01:45:27        WARN        FitsIDItoMS::fillAntennaTable+         Will assume default diameter for TELESCOPE EVN which is 0 m.
25-Aug-2026 01:45:27 2026-08-25 01:45:28        WARN        MSConcat::concatenate (file /source/casa6/casatools/casacore/ms/MSOper/MSConcat.cc, line 1000)        Zero or negative scan numbers in MS. May lead to duplicate scan numbers in concatenated MS.
25-Aug-2026 01:45:28 2026-08-25 01:45:28        WARN        FitsIDItoMS::fillAntennaTable        ARRAY_GEOMETRY input table does not contain dish DIAMETER column.
25-Aug-2026 01:45:28 2026-08-25 01:45:28        WARN        FitsIDItoMS::fillAntennaTable+         Will assume default diameter for TELESCOPE EVN which is 0 m.
25-Aug-2026 01:45:29 2026-08-25 01:45:30        WARN        MSConcat::concatenate (file /source/casa6/casatools/casacore/ms/MSOper/MSConcat.cc, line 1000)        Zero or negative scan numbers in MS. May lead to duplicate scan numbers in concatenated MS.
25-Aug-2026 01:45:30
25-Aug-2026 01:45:30 fitsidi-import: Test observation table after import of three input files
25-Aug-2026 01:45:30 importfitsidi-unit-test : Success! Now checking output ...
25-Aug-2026 01:45:30 importfitsidi-unit-test :  STATE/table.f0 present.
25-Aug-2026 01:45:30 importfitsidi-unit-test :  table.dat present.
25-Aug-2026 01:45:30 importfitsidi-unit-test :  FLAG_CMD/table.dat present.
25-Aug-2026 01:45:30 importfitsidi-unit-test :  FIELD/table.dat present.
25-Aug-2026 01:45:30 importfitsidi-unit-test :  table.f8 present.
25-Aug-2026 01:45:30 importfitsidi-unit-test :  table.f7 present.
25-Aug-2026 01:45:30 importfitsidi-unit-test :  FEED/table.f0 present.
25-Aug-2026 01:45:30 importfitsidi-unit-test :  table.f2 present.
25-Aug-2026 01:45:30 importfitsidi-unit-test :  FIELD/table.f0 present.
25-Aug-2026 01:45:30 importfitsidi-unit-test :  OBSERVATION/table.f0 present.
25-Aug-2026 01:45:30 importfitsidi-unit-test :  POINTING/table.f0 present.
25-Aug-2026 01:45:30 importfitsidi-unit-test :  FLAG_CMD/table.f0 present.
25-Aug-2026 01:45:30 importfitsidi-unit-test :  POLARIZATION/table.f0 present.
25-Aug-2026 01:45:30 importfitsidi-unit-test :  SPECTRAL_WINDOW/table.dat present.
25-Aug-2026 01:45:30 importfitsidi-unit-test :  SPECTRAL_WINDOW/table.f0 present.
25-Aug-2026 01:45:30 importfitsidi-unit-test :  POLARIZATION/table.dat present.
25-Aug-2026 01:45:30 importfitsidi-unit-test :  ANTENNA/table.dat present.
25-Aug-2026 01:45:30 importfitsidi-unit-test :  POINTING/table.dat present.
25-Aug-2026 01:45:30 importfitsidi-unit-test :  ANTENNA/table.f0 present.
25-Aug-2026 01:45:30 importfitsidi-unit-test :  table.f5 present.
25-Aug-2026 01:45:30 importfitsidi-unit-test :  table.f6 present.
25-Aug-2026 01:45:30 importfitsidi-unit-test :  STATE/table.dat present.
25-Aug-2026 01:45:30 importfitsidi-unit-test :  HISTORY/table.dat present.
25-Aug-2026 01:45:30 importfitsidi-unit-test :  table.f1 present.
25-Aug-2026 01:45:30 importfitsidi-unit-test :  table.f3 present.
25-Aug-2026 01:45:30 importfitsidi-unit-test :  HISTORY/table.f0 present.
25-Aug-2026 01:45:30 importfitsidi-unit-test :  DATA_DESCRIPTION/table.f0 present.
25-Aug-2026 01:45:30 importfitsidi-unit-test :  DATA_DESCRIPTION/table.dat present.
25-Aug-2026 01:45:30 importfitsidi-unit-test :  FEED/table.dat present.
25-Aug-2026 01:45:30 importfitsidi-unit-test :  OBSERVATION/table.dat present.
25-Aug-2026 01:45:30 importfitsidi-unit-test :  PROCESSOR/table.f0 present.
25-Aug-2026 01:45:30 importfitsidi-unit-test :  PROCESSOR/table.dat present.
25-Aug-2026 01:45:30 importfitsidi-unit-test :  table.f4 present.
25-Aug-2026 01:45:30 importfitsidi-unit-test : MS exists. All tables present. Try opening as MS ...
25-Aug-2026 01:45:30 importfitsidi-unit-test : OK. Checking tables in detail ...
25-Aug-2026 01:45:30 importfitsidi-unit-test : comparing  ['TIME_RANGE', 0, [4764708361.0, 4764708715.0], 1e-08]
25-Aug-2026 01:45:30 importfitsidi-unit-test : table  OBSERVATION  as expected.
25-Aug-2026 01:45:30 PASSED
25-Aug-2026 01:45:30
25-Aug-2026 01:45:31 test_task_importfitsidi.py::test_importfitsidi::test8 2026-08-25 01:45:32        WARN        FitsIDItoMS()::fillCorrelatorModelTable        not yet implemented
25-Aug-2026 01:45:32 2026-08-25 01:45:32        WARN                FITS card 46: EQUINOX = 'J2000   '           /                                               
25-Aug-2026 01:45:32 2026-08-25 01:45:32        WARN                Keyword value has wrong data type.
25-Aug-2026 01:45:34
25-Aug-2026 01:45:34 fitsidi-import: Test import of EOPs
25-Aug-2026 01:45:34 importfitsidi-unit-test : Success! Now checking output ...
25-Aug-2026 01:45:34 importfitsidi-unit-test :  STATE/table.f0 present.
25-Aug-2026 01:45:34 importfitsidi-unit-test :  table.dat present.
25-Aug-2026 01:45:34 importfitsidi-unit-test :  FLAG_CMD/table.dat present.
25-Aug-2026 01:45:34 importfitsidi-unit-test :  FIELD/table.dat present.
25-Aug-2026 01:45:34 importfitsidi-unit-test :  table.f8 present.
25-Aug-2026 01:45:34 importfitsidi-unit-test :  table.f7 present.
25-Aug-2026 01:45:34 importfitsidi-unit-test :  FEED/table.f0 present.
25-Aug-2026 01:45:34 importfitsidi-unit-test :  table.f2 present.
25-Aug-2026 01:45:34 importfitsidi-unit-test :  FIELD/table.f0 present.
25-Aug-2026 01:45:34 importfitsidi-unit-test :  OBSERVATION/table.f0 present.
25-Aug-2026 01:45:34 importfitsidi-unit-test :  POINTING/table.f0 present.
25-Aug-2026 01:45:34 importfitsidi-unit-test :  FLAG_CMD/table.f0 present.
25-Aug-2026 01:45:34 importfitsidi-unit-test :  POLARIZATION/table.f0 present.
25-Aug-2026 01:45:34 importfitsidi-unit-test :  SPECTRAL_WINDOW/table.dat present.
25-Aug-2026 01:45:34 importfitsidi-unit-test :  SPECTRAL_WINDOW/table.f0 present.
25-Aug-2026 01:45:34 importfitsidi-unit-test :  POLARIZATION/table.dat present.
25-Aug-2026 01:45:34 importfitsidi-unit-test :  EARTH_ORIENTATION/table.f0 present.
25-Aug-2026 01:45:34 importfitsidi-unit-test :  ANTENNA/table.dat present.
25-Aug-2026 01:45:34 importfitsidi-unit-test :  POINTING/table.dat present.
25-Aug-2026 01:45:34 importfitsidi-unit-test :  ANTENNA/table.f0 present.
25-Aug-2026 01:45:34 importfitsidi-unit-test :  table.f5 present.
25-Aug-2026 01:45:34 importfitsidi-unit-test :  table.f6 present.
25-Aug-2026 01:45:34 importfitsidi-unit-test :  STATE/table.dat present.
25-Aug-2026 01:45:34 importfitsidi-unit-test :  HISTORY/table.dat present.
25-Aug-2026 01:45:34 importfitsidi-unit-test :  table.f1 present.
25-Aug-2026 01:45:34 importfitsidi-unit-test :  table.f3 present.
25-Aug-2026 01:45:34 importfitsidi-unit-test :  HISTORY/table.f0 present.
25-Aug-2026 01:45:34 importfitsidi-unit-test :  DATA_DESCRIPTION/table.f0 present.
25-Aug-2026 01:45:34 importfitsidi-unit-test :  DATA_DESCRIPTION/table.dat present.
25-Aug-2026 01:45:34 importfitsidi-unit-test :  FEED/table.dat present.
25-Aug-2026 01:45:34 importfitsidi-unit-test :  OBSERVATION/table.dat present.
25-Aug-2026 01:45:34 importfitsidi-unit-test :  PROCESSOR/table.f0 present.
25-Aug-2026 01:45:34 importfitsidi-unit-test :  PROCESSOR/table.dat present.
25-Aug-2026 01:45:34 importfitsidi-unit-test :  table.f4 present.
25-Aug-2026 01:45:34 importfitsidi-unit-test : MS exists. All tables present. Try opening as MS ...
25-Aug-2026 01:45:34 importfitsidi-unit-test : OK. Checking tables in detail ...
25-Aug-2026 01:45:34 importfitsidi-unit-test : comparing  ['TIME', 4, 5108572800, 0]
25-Aug-2026 01:45:34 importfitsidi-unit-test : comparing  ['OBSERVATION_ID', 4, 0, 0]
25-Aug-2026 01:45:34 importfitsidi-unit-test : comparing  ['UT1_UTC', 4, -0.172797, 1e-08]
25-Aug-2026 01:45:34 importfitsidi-unit-test : comparing  ['PM', 4, [9.20370292e-07, 1.55251885e-06], 1e-14]
25-Aug-2026 01:45:34 importfitsidi-unit-test : table  EARTH_ORIENTATION  as expected.
25-Aug-2026 01:45:34 PASSED
25-Aug-2026 01:45:34
25-Aug-2026 01:45:34 - generated xml file: /home/casatest/casa6/casatestutils/nosedir/xml/test_task_importfitsidi/nose.xml -
25-Aug-2026 01:45:34 ======================== 8 passed, 1 warning in 29.70s =========================
25-Aug-2026 01:45:35 ============================= test session starts ==============================
25-Aug-2026 01:45:35 platform linux -- Python 3.10.16, pytest-8.3.4, pluggy-1.5.0 -- /home/casatest/venv/bin/python3.10
25-Aug-2026 01:45:35 cachedir: .pytest_cache
25-Aug-2026 01:45:35 rootdir: /home/casatest/casa6/casatestutils/nosedir/test_task_imsmooth
25-Aug-2026 01:45:35 configfile: pytest.ini
25-Aug-2026 01:45:36 collecting ... collected 13 items
25-Aug-2026 01:45:36
25-Aug-2026 01:45:36
25-Aug-2026 01:45:36 test_task_imsmooth.py::imsmooth_test::test_beam 2026-08-25 01:45:37        WARN        image::open (file src/tools/image/image_cmpt.cc, line 4208)        Another image is already open, closing first
25-Aug-2026 01:45:36
25-Aug-2026 01:45:36 Test the beam parameter
25-Aug-2026 01:45:36 PASSED
25-Aug-2026 01:45:36
25-Aug-2026 01:45:37 test_task_imsmooth.py::imsmooth_test::test_commonbeam 2026-08-25 01:45:37        WARN        imsmooth::image::commonbeam (file src/tools/image/image_cmpt.cc, line 824)        This image only has one beam, so just returning that
25-Aug-2026 01:45:37
25-Aug-2026 01:45:37 Test kernel='commonbeam' in imsmooth
25-Aug-2026 01:45:37 PASSED
25-Aug-2026 01:45:37
25-Aug-2026 01:45:37 test_task_imsmooth.py::imsmooth_test::test_conserve_flux 2026-08-25 01:45:38        WARN        componentlist::fromrecord        componentlist is not empty; overwriting it
25-Aug-2026 01:45:37 2026-08-25 01:45:38        WARN        ImageFitter::_finishConstruction        Unrecognized intensity unit cm-2. Will assume Jy/pixel
25-Aug-2026 01:45:37 2026-08-25 01:45:38        WARN        SkyCompRep::convertToJy        Cannot convert units of brightness to Jy - will assume Jy
25-Aug-2026 01:45:37 2026-08-25 01:45:38        WARN        SkyCompRep::peakToIntegralFlux()        The image units 'cm-2' are not consistent
25-Aug-2026 01:45:37 2026-08-25 01:45:38        WARN        SkyCompRep::peakToIntegralFlux()+        with Jy when integrated over the sky.  Assuming Jy/pixel
25-Aug-2026 01:45:37 2026-08-25 01:45:38        WARN        SkyCompRep::integralToPeakFlux()        The image units 'cm-2' are not consistent
25-Aug-2026 01:45:37 2026-08-25 01:45:38        WARN        SkyCompRep::integralToPeakFlux()+        with Jy when integrated over the sky.  Assuming Jy/pixel
25-Aug-2026 01:45:37 2026-08-25 01:45:38        WARN        ImageFitter::_finishConstruction        Unrecognized intensity unit cm-2. Will assume Jy/pixel
25-Aug-2026 01:45:38 2026-08-25 01:45:38        WARN        SkyCompRep::convertToJy        Cannot convert units of brightness to Jy - will assume Jy
25-Aug-2026 01:45:38 2026-08-25 01:45:38        WARN        SkyCompRep::peakToIntegralFlux()        The image units 'cm-2' are not consistent
25-Aug-2026 01:45:38 2026-08-25 01:45:38        WARN        SkyCompRep::peakToIntegralFlux()+        with Jy when integrated over the sky.  Assuming Jy/pixel
25-Aug-2026 01:45:38 2026-08-25 01:45:38        WARN        SkyCompRep::integralToPeakFlux()        The image units 'cm-2' are not consistent
25-Aug-2026 01:45:38 2026-08-25 01:45:38        WARN        SkyCompRep::integralToPeakFlux()+        with Jy when integrated over the sky.  Assuming Jy/pixel
25-Aug-2026 01:45:38 2026-08-25 01:45:38        WARN        componentlist::fromrecord        componentlist is not empty; overwriting it
25-Aug-2026 01:45:38
25-Aug-2026 01:45:38 Test flux density is conserved for images with units of K or anything without 'beam'
25-Aug-2026 01:45:38 PASSED
25-Aug-2026 01:45:38
25-Aug-2026 01:45:38 test_task_imsmooth.py::imsmooth_test::test_copying_of_input_mask
25-Aug-2026 01:45:38 CAS-12904: copy input mask to output image
25-Aug-2026 01:45:38 PASSED
25-Aug-2026 01:45:38
25-Aug-2026 01:45:38 test_task_imsmooth.py::imsmooth_test::test_history
25-Aug-2026 01:45:38 Test that history is written
25-Aug-2026 01:45:38 PASSED
25-Aug-2026 01:45:38
25-Aug-2026 01:45:38 test_task_imsmooth.py::imsmooth_test::test_image_kernel 2026-08-25 01:45:39        WARN        image::open (file src/tools/image/image_cmpt.cc, line 4208)        Another image is already open, closing first
25-Aug-2026 01:45:38
25-Aug-2026 01:45:38 Test image as kernel, CAS-5844
25-Aug-2026 01:45:38 max 5.418622304137477e-05
25-Aug-2026 01:45:38 PASSED
25-Aug-2026 01:45:38
25-Aug-2026 01:45:38 test_task_imsmooth.py::imsmooth_test::test_input 2026-08-25 01:45:39        WARN        imsmooth::::casa        The IMAGENAME parameter tests will cause errors to occur, do not be alarmed
25-Aug-2026 01:45:39 2026-08-25 01:45:39        WARN        imsmooth::::casa        The OUTFILE parameter tests will cause errors to occur, do not be alarmed
25-Aug-2026 01:45:39 2026-08-25 01:45:39        SEVERE        imsmooth::ImageInputProcessor::_process        Replaceable flag is false and there is already a file or directory named input_test1 so the output image will not be written
25-Aug-2026 01:45:39 2026-08-25 01:45:39        SEVERE        imsmooth::image::_convolve2d (file src/tools/image/image_cmpt.cc, line 1212)        Exception Reported: 2026-08-25 01:45:39        SEVERE        imsmooth::ImageInputProcessor::_process        Replaceable flag is false and there is already a file or directory named input_test1 so the output image will not be written
25-Aug-2026 01:45:39 2026-08-25 01:45:39        SEVERE        imsmooth::::casa        Task imsmooth raised an exception of class RuntimeError with the following message: 2026-08-25 01:45:39        SEVERE        imsmooth::ImageInputProcessor::_process        Replaceable flag is false and there is already a file or directory named input_test1 so the output image will not be written
25-Aug-2026 01:45:39 2026-08-25 01:45:39        WARN        imsmooth::::casa        The KERNEL parameter tests will cause errors to occur, do not be alarmed
25-Aug-2026 01:45:39 2026-08-25 01:45:39        WARN        imsmooth::::casa        The MAJOR parameter tests will cause errors to occur, do not be alarmed
25-Aug-2026 01:45:39 2026-08-25 01:45:39        WARN        imsmooth::Image2DConvolver::_dealWithRestoringBeam        Convolving kernel has minor axis 2.42407e-06 rad which is less than the pixel diagonal length of 3.42815e-06 rad. Thus, the kernel is poorly sampled, and so the output of this application may not be what you expect. You should consider increasing the kernel size or regridding the image to a smaller pixel size
25-Aug-2026 01:45:39 2026-08-25 01:45:40        SEVERE        imsmooth::image::_convolve2d (file src/tools/image/image_cmpt.cc, line 1212)        Exception Reported: Exception: Major axis is less than minor axis.
25-Aug-2026 01:45:39 2026-08-25 01:45:40        SEVERE        imsmooth::image::_convolve2d (file src/tools/image/image_cmpt.cc, line 1212)+        ... thrown by void casa::Image2DConvolver<T>::setKernel(const casacore::String&, const Quantity&, const Quantity&, const Quantity&) [with T = float; casacore::Quantity = casacore::Quantum<double>] at File: /source/casainstall/include/casacpp/imageanalysis/ImageAnalysis/Image2DConvolver.tcc, line: 134
25-Aug-2026 01:45:39 2026-08-25 01:45:40        SEVERE        imsmooth::::casa        Task imsmooth raised an exception of class RuntimeError with the following message: Exception: Major axis is less than minor axis.
25-Aug-2026 01:45:39 2026-08-25 01:45:40        SEVERE        imsmooth::::casa+        ... thrown by void casa::Image2DConvolver<T>::setKernel(const casacore::String&, const Quantity&, const Quantity&, const Quantity&) [with T = float; casacore::Quantity = casacore::Quantum<double>] at File: /source/casainstall/include/casacpp/imageanalysis/ImageAnalysis/Image2DConvolver.tcc, line: 134
25-Aug-2026 01:45:39 2026-08-25 01:45:40        WARN        imsmooth::::casa        The REGION parameter tests will cause errors to occur, do not be alarmed
25-Aug-2026 01:45:39 2026-08-25 01:45:40        WARN        imsmooth::::casa        The outfile paramter is empty, consequently the smoothed image will be
25-Aug-2026 01:45:39 2026-08-25 01:45:40        WARN        imsmooth::::casa+        saved on disk in file, imsmooth_results.im
25-Aug-2026 01:45:39 2026-08-25 01:45:40        SEVERE        regionmanager::frombcs        Exception Reported: Unrecognized type int for region, must be either string or region dictionary at File: src/tools/regionmanager/regionmanager_cmpt.cc, line: 887
25-Aug-2026 01:45:39 2026-08-25 01:45:40        SEVERE        imsmooth::::casa        Task imsmooth raised an exception of class RuntimeError with the following message: Unrecognized type int for region, must be either string or region dictionary at File: src/tools/regionmanager/regionmanager_cmpt.cc, line: 887
25-Aug-2026 01:45:39 2026-08-25 01:45:40        WARN        imsmooth::::casa        The outfile paramter is empty, consequently the smoothed image will be
25-Aug-2026 01:45:39 2026-08-25 01:45:40        WARN        imsmooth::::casa+        saved on disk in file, imsmooth_results.im
25-Aug-2026 01:45:39 2026-08-25 01:45:40        SEVERE        regionmanager::frombcs        Exception Reported: Unable to open region file or region table description garbage.rgn.
25-Aug-2026 01:45:39 2026-08-25 01:45:40        SEVERE        regionmanager::frombcs+        If it is supposed to be a text string its format is incorrect at File: /source/casa6/casatools/src/code/imageanalysis/Regions/CasacRegionManager.cc, line: 497
25-Aug-2026 01:45:39 2026-08-25 01:45:40        SEVERE        imsmooth::::casa        Task imsmooth raised an exception of class RuntimeError with the following message: Unable to open region file or region table description garbage.rgn.
25-Aug-2026 01:45:39 2026-08-25 01:45:40        SEVERE        imsmooth::::casa+        If it is supposed to be a text string its format is incorrect at File: /source/casa6/casatools/src/code/imageanalysis/Regions/CasacRegionManager.cc, line: 497
25-Aug-2026 01:45:39 2026-08-25 01:45:40        WARN        imsmooth::::casa        The outfile paramter is empty, consequently the smoothed image will be
25-Aug-2026 01:45:39 2026-08-25 01:45:40        WARN        imsmooth::::casa+        saved on disk in file, imsmooth_results.im
25-Aug-2026 01:45:39 2026-08-25 01:45:40        SEVERE        regionmanager::frombcs        Exception Reported: /home/casatest/casa6/casatestutils/nosedir/test_task_imsmooth/garbage.rgn is neither a valid binary region file, nor a valid region text file. at File: /source/casa6/casatools/src/code/imageanalysis/Regions/CasacRegionManager.cc, line: 428
25-Aug-2026 01:45:39 2026-08-25 01:45:40        SEVERE        imsmooth::::casa        Task imsmooth raised an exception of class RuntimeError with the following message: /home/casatest/casa6/casatestutils/nosedir/test_task_imsmooth/garbage.rgn is neither a valid binary region file, nor a valid region text file. at File: /source/casa6/casatools/src/code/imageanalysis/Regions/CasacRegionManager.cc, line: 428
25-Aug-2026 01:45:39 2026-08-25 01:45:40        WARN        imsmooth::::casa        The BOX parameter tests will cause errors to occur, do not be alarmed
25-Aug-2026 01:45:39 2026-08-25 01:45:40        WARN        imsmooth::::casa        The outfile paramter is empty, consequently the smoothed image will be
25-Aug-2026 01:45:39 2026-08-25 01:45:40        WARN        imsmooth::::casa+        saved on disk in file, imsmooth_results.im
25-Aug-2026 01:45:39 2026-08-25 01:45:40        SEVERE        CasacRegionManager::_fromBCS        blc in box spec is less than 0
25-Aug-2026 01:45:39 2026-08-25 01:45:40        SEVERE        regionmanager::frombcs        Exception Reported: 2026-08-25 01:45:40        SEVERE        CasacRegionManager::_fromBCS        blc in box spec is less than 0
25-Aug-2026 01:45:39 2026-08-25 01:45:40        SEVERE        imsmooth::::casa        Task imsmooth raised an exception of class RuntimeError with the following message: 2026-08-25 01:45:40        SEVERE        CasacRegionManager::_fromBCS        blc in box spec is less than 0
25-Aug-2026 01:45:39 2026-08-25 01:45:40        WARN        imsmooth::::casa        The CHANS parameter tests will cause errors to occur, do not be alarmed
25-Aug-2026 01:45:39 2026-08-25 01:45:40        WARN        imsmooth::::casa        The outfile paramter is empty, consequently the smoothed image will be
25-Aug-2026 01:45:39 2026-08-25 01:45:40        WARN        imsmooth::::casa+        saved on disk in file, imsmooth_results.im
25-Aug-2026 01:45:39 2026-08-25 01:45:40        SEVERE        regionmanager::frombcs        Exception Reported: Invalid channel specification in -5 of spec -5 at File: /source/casa6/casatools/src/code/imageanalysis/IO/ParameterParser.cc, line: 173
25-Aug-2026 01:45:39 2026-08-25 01:45:40        SEVERE        imsmooth::::casa        Task imsmooth raised an exception of class RuntimeError with the following message: Invalid channel specification in -5 of spec -5 at File: /source/casa6/casatools/src/code/imageanalysis/IO/ParameterParser.cc, line: 173
25-Aug-2026 01:45:39 2026-08-25 01:45:40        WARN        imsmooth::::casa        The outfile paramter is empty, consequently the smoothed image will be
25-Aug-2026 01:45:39 2026-08-25 01:45:40        WARN        imsmooth::::casa+        saved on disk in file, imsmooth_results.im
25-Aug-2026 01:45:39 2026-08-25 01:45:40        SEVERE        regionmanager::frombcs        Exception Reported: Invalid channel specification in -2 of spec -2 at File: /source/casa6/casatools/src/code/imageanalysis/IO/ParameterParser.cc, line: 173
25-Aug-2026 01:45:39 2026-08-25 01:45:40        SEVERE        imsmooth::::casa        Task imsmooth raised an exception of class RuntimeError with the following message: Invalid channel specification in -2 of spec -2 at File: /source/casa6/casatools/src/code/imageanalysis/IO/ParameterParser.cc, line: 173
25-Aug-2026 01:45:39 2026-08-25 01:45:40        WARN        imsmooth::::casa        The outfile paramter is empty, consequently the smoothed image will be
25-Aug-2026 01:45:39 2026-08-25 01:45:40        WARN        imsmooth::::casa+        saved on disk in file, imsmooth_results.im
25-Aug-2026 01:45:39 2026-08-25 01:45:40        SEVERE        regionmanager::frombcs        Exception Reported: Invalid channel specification in -18 of spec -18 at File: /source/casa6/casatools/src/code/imageanalysis/IO/ParameterParser.cc, line: 173
25-Aug-2026 01:45:39 2026-08-25 01:45:40        SEVERE        imsmooth::::casa        Task imsmooth raised an exception of class RuntimeError with the following message: Invalid channel specification in -18 of spec -18 at File: /source/casa6/casatools/src/code/imageanalysis/IO/ParameterParser.cc, line: 173
25-Aug-2026 01:45:39 2026-08-25 01:45:40        WARN        imsmooth::::casa        The outfile paramter is empty, consequently the smoothed image will be
25-Aug-2026 01:45:39 2026-08-25 01:45:40        WARN        imsmooth::::casa+        saved on disk in file, imsmooth_results.im
25-Aug-2026 01:45:39 2026-08-25 01:45:40        SEVERE        regionmanager::frombcs        Exception Reported: Exception: Zero-based max channel 45 must be less than the total number of channels (40) in the channel specification 45.
25-Aug-2026 01:45:39 2026-08-25 01:45:40        SEVERE        regionmanager::frombcs+        ... thrown by static std::vector<unsigned int> casa::ParameterParser::spectralRangesFromChans(casacore::uInt&, const casacore::String&, casacore::uInt) at File: /source/casa6/casatools/src/code/imageanalysis/IO/ParameterParser.cc, line: 183
25-Aug-2026 01:45:39 2026-08-25 01:45:40        SEVERE        imsmooth::::casa        Task imsmooth raised an exception of class RuntimeError with the following message: Exception: Zero-based max channel 45 must be less than the total number of channels (40) in the channel specification 45.
25-Aug-2026 01:45:39 2026-08-25 01:45:40        SEVERE        imsmooth::::casa+        ... thrown by static std::vector<unsigned int> casa::ParameterParser::spectralRangesFromChans(casacore::uInt&, const casacore::String&, casacore::uInt) at File: /source/casa6/casatools/src/code/imageanalysis/IO/ParameterParser.cc, line: 183
25-Aug-2026 01:45:40 2026-08-25 01:45:40        WARN        imsmooth::::casa        The outfile paramter is empty, consequently the smoothed image will be
25-Aug-2026 01:45:40 2026-08-25 01:45:40        WARN        imsmooth::::casa+        saved on disk in file, imsmooth_results.im
25-Aug-2026 01:45:40 2026-08-25 01:45:40        SEVERE        regionmanager::frombcs        Exception Reported: Exception: Zero-based max channel 40 must be less than the total number of channels (40) in the channel specification 40.
25-Aug-2026 01:45:40 2026-08-25 01:45:40        SEVERE        regionmanager::frombcs+        ... thrown by static std::vector<unsigned int> casa::ParameterParser::spectralRangesFromChans(casacore::uInt&, const casacore::String&, casacore::uInt) at File: /source/casa6/casatools/src/code/imageanalysis/IO/ParameterParser.cc, line: 183
25-Aug-2026 01:45:40 2026-08-25 01:45:40        SEVERE        imsmooth::::casa        Task imsmooth raised an exception of class RuntimeError with the following message: Exception: Zero-based max channel 40 must be less than the total number of channels (40) in the channel specification 40.
25-Aug-2026 01:45:40 2026-08-25 01:45:40        SEVERE        imsmooth::::casa+        ... thrown by static std::vector<unsigned int> casa::ParameterParser::spectralRangesFromChans(casacore::uInt&, const casacore::String&, casacore::uInt) at File: /source/casa6/casatools/src/code/imageanalysis/IO/ParameterParser.cc, line: 183
25-Aug-2026 01:45:40 2026-08-25 01:45:41        WARN        imsmooth::::casa        The STOKES parameter tests will cause errors to occur, do not be alarmed
25-Aug-2026 01:45:40 2026-08-25 01:45:41        WARN        imsmooth::::casa        The outfile paramter is empty, consequently the smoothed image will be
25-Aug-2026 01:45:40 2026-08-25 01:45:41        WARN        imsmooth::::casa+        saved on disk in file, imsmooth_results.im
25-Aug-2026 01:45:40 2026-08-25 01:45:41        SEVERE        regionmanager::frombcs        Exception Reported: LCBox::LCBox - blc [0, 0, 0, 0] must be <= trc [511, 511, -2147483648, 39]
25-Aug-2026 01:45:40 2026-08-25 01:45:41        SEVERE        imsmooth::::casa        Task imsmooth raised an exception of class RuntimeError with the following message: LCBox::LCBox - blc [0, 0, 0, 0] must be <= trc [511, 511, -2147483648, 39]
25-Aug-2026 01:45:40 2026-08-25 01:45:41        WARN        imsmooth::::casa        The outfile paramter is empty, consequently the smoothed image will be
25-Aug-2026 01:45:40 2026-08-25 01:45:41        WARN        imsmooth::::casa+        saved on disk in file, imsmooth_results.im
25-Aug-2026 01:45:40 2026-08-25 01:45:41        SEVERE        CasacRegionManager::_setPolarizationRanges        (Sub)String YELLOW in stokes specification part YELLOW does not match a known polarization.
25-Aug-2026 01:45:40 2026-08-25 01:45:41        SEVERE        regionmanager::frombcs        Exception Reported: 2026-08-25 01:45:41        SEVERE        CasacRegionManager::_setPolarizationRanges        (Sub)String YELLOW in stokes specification part YELLOW does not match a known polarization.
25-Aug-2026 01:45:40 2026-08-25 01:45:41        SEVERE        imsmooth::::casa        Task imsmooth raised an exception of class RuntimeError with the following message: 2026-08-25 01:45:41        SEVERE        CasacRegionManager::_setPolarizationRanges        (Sub)String YELLOW in stokes specification part YELLOW does not match a known polarization.
25-Aug-2026 01:45:40
25-Aug-2026 01:45:40 Imsmooth: Testing INPUT/OUTPUT tests
25-Aug-2026 01:45:40 PASSED
25-Aug-2026 01:45:40
25-Aug-2026 01:45:41 test_task_imsmooth.py::imsmooth_test::test_multibeam
25-Aug-2026 01:45:41 Test per plane beams
25-Aug-2026 01:45:41 PASSED
25-Aug-2026 01:45:41
25-Aug-2026 01:45:42 test_task_imsmooth.py::imsmooth_test::test_overwrite 2026-08-25 01:45:42        SEVERE        imsmooth::ImageInputProcessor::_process        Replaceable flag is false and there is already a file or directory named imsmooth_test_overwrite.im so the output image will not be written
25-Aug-2026 01:45:42 2026-08-25 01:45:42        SEVERE        imsmooth::image::_convolve2d (file src/tools/image/image_cmpt.cc, line 1212)        Exception Reported: 2026-08-25 01:45:42        SEVERE        imsmooth::ImageInputProcessor::_process        Replaceable flag is false and there is already a file or directory named imsmooth_test_overwrite.im so the output image will not be written
25-Aug-2026 01:45:42 2026-08-25 01:45:42        SEVERE        imsmooth::::casa        Task imsmooth raised an exception of class RuntimeError with the following message: 2026-08-25 01:45:42        SEVERE        imsmooth::ImageInputProcessor::_process        Replaceable flag is false and there is already a file or directory named imsmooth_test_overwrite.im so the output image will not be written
25-Aug-2026 01:45:42
25-Aug-2026 01:45:42 test overwrite parameter 
25-Aug-2026 01:45:42 PASSED
25-Aug-2026 01:45:42
25-Aug-2026 01:45:43 test_task_imsmooth.py::imsmooth_test::test_region
25-Aug-2026 01:45:43 Imsmooth: Region selection correction test
25-Aug-2026 01:45:43 PASSED
25-Aug-2026 01:45:43
25-Aug-2026 01:45:45 test_task_imsmooth.py::imsmooth_test::test_smooth
25-Aug-2026 01:45:45 Imsmooth: Testing correctness
25-Aug-2026 01:45:45 PASSED
25-Aug-2026 01:45:45
25-Aug-2026 01:45:46 test_task_imsmooth.py::imsmooth_test::test_stretch 2026-08-25 01:45:46        WARN        imsmooth::::casa        The outfile paramter is empty, consequently the smoothed image will be
25-Aug-2026 01:45:46 2026-08-25 01:45:46        WARN        imsmooth::::casa+        saved on disk in file, imsmooth_results.im
25-Aug-2026 01:45:46 2026-08-25 01:45:46        SEVERE        image::_convolve2d (file src/tools/image/image_cmpt.cc, line 1212)        Exception Reported: The input image shape ([200, 200, 1, 20]) and mask shape ([200, 200, 1, 1]) are different, and it was specified that the mask should not be extended, so the mask cannot be applied to the (sub)image. Specifying that the mask should be extended may resolve the issue at File: /source/casainstall/include/casacpp/imageanalysis/ImageAnalysis/SubImageFactory.tcc, line: 306
25-Aug-2026 01:45:46 2026-08-25 01:45:46        SEVERE        imsmooth::::casa        Task imsmooth raised an exception of class RuntimeError with the following message: The input image shape ([200, 200, 1, 20]) and mask shape ([200, 200, 1, 1]) are different, and it was specified that the mask should not be extended, so the mask cannot be applied to the (sub)image. Specifying that the mask should be extended may resolve the issue at File: /source/casainstall/include/casacpp/imageanalysis/ImageAnalysis/SubImageFactory.tcc, line: 306
25-Aug-2026 01:45:46 2026-08-25 01:45:46        WARN        imsmooth::::casa        The outfile paramter is empty, consequently the smoothed image will be
25-Aug-2026 01:45:46 2026-08-25 01:45:46        WARN        imsmooth::::casa+        saved on disk in file, imsmooth_results.im
25-Aug-2026 01:45:46 2026-08-25 01:45:46        WARN        Image2DConvolver::_dealWithRestoringBeam        Convolving kernel has minor axis 2 arcsec which is less than the pixel diagonal length of 84.8528 arcsec. Thus, the kernel is poorly sampled, and so the output of this application may not be what you expect. You should consider increasing the kernel size or regridding the image to a smaller pixel size
25-Aug-2026 01:45:46
25-Aug-2026 01:45:46 imsmooth(): Test stretch parameter
25-Aug-2026 01:45:46 PASSED
25-Aug-2026 01:45:46
25-Aug-2026 01:45:47 test_task_imsmooth.py::imsmooth_test::test_targetres 2026-08-25 01:45:47        WARN        image::open (file src/tools/image/image_cmpt.cc, line 4208)        Another image is already open, closing first
25-Aug-2026 01:45:47 2026-08-25 01:45:48        WARN        image::open (file src/tools/image/image_cmpt.cc, line 4208)        Another image is already open, closing first
25-Aug-2026 01:45:47 2026-08-25 01:45:48        WARN        BeamManipulator::set        This image has per plane beamsbut no plane (channel/polarization) was specified. All beams will be set equal to the specified beam.
25-Aug-2026 01:45:47 2026-08-25 01:45:48        SEVERE        imsmooth::image::_convolve2d (file src/tools/image/image_cmpt.cc, line 1212)        Exception Reported: Unable to reach target resolution of major: 5.99 arcsec, minor: 2.99 arcsec, pa: 0 deg Input image beam major: 6 arcsec, minor: 3 arcsec, pa: 0 deg is (nearly) identical to or larger than the output beam size at File: /source/casainstall/include/casacpp/imageanalysis/ImageAnalysis/Image2DConvolver.tcc, line: 104
25-Aug-2026 01:45:47 2026-08-25 01:45:48        SEVERE        imsmooth::::casa        Task imsmooth raised an exception of class RuntimeError with the following message: Unable to reach target resolution of major: 5.99 arcsec, minor: 2.99 arcsec, pa: 0 deg Input image beam major: 6 arcsec, minor: 3 arcsec, pa: 0 deg is (nearly) identical to or larger than the output beam size at File: /source/casainstall/include/casacpp/imageanalysis/ImageAnalysis/Image2DConvolver.tcc, line: 104
25-Aug-2026 01:45:47 2026-08-25 01:45:48        WARN        imsmooth::Image2DConvolver::_dealWithRestoringBeam        Fitted restoring beam is major: 3.09313 arcsec, minor: 3.03335 arcsec, pa: 80.8725 deg, but putting requested target resolution beam major: 3.2 arcsec, minor: 3.1 arcsec, pa: 60 deg in the image metadata. Both beams may be considered consistent with the convolution result.
25-Aug-2026 01:45:47
25-Aug-2026 01:45:47 Test targetres parameter
25-Aug-2026 01:45:47 PASSED
25-Aug-2026 01:45:47
25-Aug-2026 01:45:47 - generated xml file: /home/casatest/casa6/casatestutils/nosedir/xml/test_task_imsmooth/nose.xml -
25-Aug-2026 01:45:47 ======================== 13 passed, 1 warning in 12.81s ========================
25-Aug-2026 01:45:48 ============================= test session starts ==============================
25-Aug-2026 01:45:48 platform linux -- Python 3.10.16, pytest-8.3.4, pluggy-1.5.0 -- /home/casatest/venv/bin/python3.10
25-Aug-2026 01:45:48 cachedir: .pytest_cache
25-Aug-2026 01:45:48 rootdir: /home/casatest/casa6/casatestutils/nosedir/test_task_feather
25-Aug-2026 01:45:48 configfile: pytest.ini
25-Aug-2026 01:45:49 collecting ... collected 7 items
25-Aug-2026 01:45:49
25-Aug-2026 01:45:49
25-Aug-2026 01:45:49 test_task_feather.py::feather_test::test_combine 2026-08-25 01:45:50        WARN        feather::ImageRegrid::regrid        You are regridding an image whose beam is not well sampled by the pixel size.  Total flux can be lost when regridding such images, especially when the new pixel size is larger than the old pixel size. It is recommended to check the total flux of your input and output image, and if necessary rebin the input to have smaller pixels.
25-Aug-2026 01:45:49
25-Aug-2026 01:45:49 test_combine
25-Aug-2026 01:45:49 --------------
25-Aug-2026 01:45:49
25-Aug-2026 01:45:49 Check that interferometric and Single dish images can be combined
25-Aug-2026 01:45:49 PASSED
25-Aug-2026 01:45:49
25-Aug-2026 01:45:49 test_task_feather.py::feather_test::test_effdishdiam 2026-08-25 01:45:50        WARN        feather::ImageRegrid::regrid        You are regridding an image whose beam is not well sampled by the pixel size.  Total flux can be lost when regridding such images, especially when the new pixel size is larger than the old pixel size. It is recommended to check the total flux of your input and output image, and if necessary rebin the input to have smaller pixels.
25-Aug-2026 01:45:50 2026-08-25 01:45:50        WARN        feather::ImageRegrid::regrid        You are regridding an image whose beam is not well sampled by the pixel size.  Total flux can be lost when regridding such images, especially when the new pixel size is larger than the old pixel size. It is recommended to check the total flux of your input and output image, and if necessary rebin the input to have smaller pixels.
25-Aug-2026 01:45:50 2026-08-25 01:45:50        WARN        feather::ImageRegrid::regrid        You are regridding an image whose beam is not well sampled by the pixel size.  Total flux can be lost when regridding such images, especially when the new pixel size is larger than the old pixel size. It is recommended to check the total flux of your input and output image, and if necessary rebin the input to have smaller pixels.
25-Aug-2026 01:45:50 2026-08-25 01:45:50        SEVERE        feather::imager::feather()        Caught exception: Beam due to new effective diameter may be smaller than the beam of original dish image
25-Aug-2026 01:45:50 2026-08-25 01:45:50        SEVERE        feather::::casa        Task feather raised an exception of class RuntimeError with the following message: 2026-08-25 01:45:50        SEVERE        feather::imager::feather()        Caught exception: Beam due to new effective diameter may be smaller than the beam of original dish image
25-Aug-2026 01:45:50
25-Aug-2026 01:45:50 test_effdishdiam
25-Aug-2026 01:45:50 ------------------
25-Aug-2026 01:45:50
25-Aug-2026 01:45:50 Check that chaging the effective dish diameter results in differing image files
25-Aug-2026 01:45:50 PASSED
25-Aug-2026 01:45:50
25-Aug-2026 01:45:50 test_task_feather.py::feather_test::test_highres
25-Aug-2026 01:45:50 test_highres
25-Aug-2026 01:45:50 --------------
25-Aug-2026 01:45:50
25-Aug-2026 01:45:50 Check that the interferometric image is provided with this parameter
25-Aug-2026 01:45:50 This parameter is nessisary to run the task
25-Aug-2026 01:45:50 PASSED
25-Aug-2026 01:45:50
25-Aug-2026 01:45:50 test_task_feather.py::feather_test::test_imagename 2026-08-25 01:45:50        WARN        feather::ImageRegrid::regrid        You are regridding an image whose beam is not well sampled by the pixel size.  Total flux can be lost when regridding such images, especially when the new pixel size is larger than the old pixel size. It is recommended to check the total flux of your input and output image, and if necessary rebin the input to have smaller pixels.
25-Aug-2026 01:45:50 2026-08-25 01:45:50        WARN        feather::ImageRegrid::regrid        You are regridding an image whose beam is not well sampled by the pixel size.  Total flux can be lost when regridding such images, especially when the new pixel size is larger than the old pixel size. It is recommended to check the total flux of your input and output image, and if necessary rebin the input to have smaller pixels.
25-Aug-2026 01:45:50
25-Aug-2026 01:45:50 test_imagename
25-Aug-2026 01:45:50 ----------------
25-Aug-2026 01:45:50
25-Aug-2026 01:45:50 Check that the imagename parameter gives the name of the output image file
25-Aug-2026 01:45:50 PASSED
25-Aug-2026 01:45:50
25-Aug-2026 01:45:50 test_task_feather.py::feather_test::test_lowpassfiltersd 2026-08-25 01:45:51        WARN        feather::ImageRegrid::regrid        You are regridding an image whose beam is not well sampled by the pixel size.  Total flux can be lost when regridding such images, especially when the new pixel size is larger than the old pixel size. It is recommended to check the total flux of your input and output image, and if necessary rebin the input to have smaller pixels.
25-Aug-2026 01:45:50 2026-08-25 01:45:51        WARN        feather::ImageRegrid::regrid        You are regridding an image whose beam is not well sampled by the pixel size.  Total flux can be lost when regridding such images, especially when the new pixel size is larger than the old pixel size. It is recommended to check the total flux of your input and output image, and if necessary rebin the input to have smaller pixels.
25-Aug-2026 01:45:50
25-Aug-2026 01:45:50 test_lowpassfiltersd
25-Aug-2026 01:45:50 ----------------------
25-Aug-2026 01:45:50
25-Aug-2026 01:45:50 Check that lowpassfiltersd = True results in a different image than the default
25-Aug-2026 01:45:50 PASSED
25-Aug-2026 01:45:50
25-Aug-2026 01:45:50 test_task_feather.py::feather_test::test_lowres
25-Aug-2026 01:45:50 test_lowres
25-Aug-2026 01:45:50 -------------
25-Aug-2026 01:45:50
25-Aug-2026 01:45:50 Check that the single dish image is provided with this parameter
25-Aug-2026 01:45:50 This parameter is nessisary to run the task
25-Aug-2026 01:45:50 PASSED
25-Aug-2026 01:45:50
25-Aug-2026 01:45:50 test_task_feather.py::feather_test::test_sdfactor 2026-08-25 01:45:51        WARN        feather::ImageRegrid::regrid        You are regridding an image whose beam is not well sampled by the pixel size.  Total flux can be lost when regridding such images, especially when the new pixel size is larger than the old pixel size. It is recommended to check the total flux of your input and output image, and if necessary rebin the input to have smaller pixels.
25-Aug-2026 01:45:51 2026-08-25 01:45:51        WARN        feather::ImageRegrid::regrid        You are regridding an image whose beam is not well sampled by the pixel size.  Total flux can be lost when regridding such images, especially when the new pixel size is larger than the old pixel size. It is recommended to check the total flux of your input and output image, and if necessary rebin the input to have smaller pixels.
25-Aug-2026 01:45:51
25-Aug-2026 01:45:51 test_sdfactor
25-Aug-2026 01:45:51 ---------------
25-Aug-2026 01:45:51
25-Aug-2026 01:45:51 Check that differing sdfactors results in differing image files
25-Aug-2026 01:45:51 PASSED
25-Aug-2026 01:45:51
25-Aug-2026 01:45:51 - generated xml file: /home/casatest/casa6/casatestutils/nosedir/xml/test_task_feather/nose.xml -
25-Aug-2026 01:45:51 ========================= 7 passed, 1 warning in 3.04s =========================
25-Aug-2026 01:45:51 Running Command: pytest --junitxml=/home/casatest/casa6/casatestutils/nosedir/xml/test_task_plotbandpass/nose.xml -s --disable-pytest-warnings --verbose -ra --tb=short /home/casatest/casa6/casatestutils/nosedir/test_task_plotbandpass/
25-Aug-2026 01:45:51
25-Aug-2026 01:45:51 Setting Working Directory: /home/casatest/casa6/casatestutils/nosedir/test_task_imcollapse/
25-Aug-2026 01:45:51 Test Directory: /home/casatest/casa6/casatestutils/nosedir/test_task_imcollapse
25-Aug-2026 01:45:51
25-Aug-2026 01:45:51 Running Command: pytest --junitxml=/home/casatest/casa6/casatestutils/nosedir/xml/test_task_imcollapse/nose.xml -s --disable-pytest-warnings --verbose -ra --tb=short /home/casatest/casa6/casatestutils/nosedir/test_task_imcollapse/
25-Aug-2026 01:45:51
25-Aug-2026 01:45:51 Setting Working Directory: /home/casatest/casa6/casatestutils/nosedir/test_task_splattotable/
25-Aug-2026 01:45:51 Test Directory: /home/casatest/casa6/casatestutils/nosedir/test_task_splattotable
25-Aug-2026 01:45:51
25-Aug-2026 01:45:51 Running Command: pytest --junitxml=/home/casatest/casa6/casatestutils/nosedir/xml/test_task_splattotable/nose.xml -s --disable-pytest-warnings --verbose -ra --tb=short /home/casatest/casa6/casatestutils/nosedir/test_task_splattotable/
25-Aug-2026 01:45:51
25-Aug-2026 01:45:51 Setting Working Directory: /home/casatest/casa6/casatestutils/nosedir/test_task_smoothcal/
25-Aug-2026 01:45:51 Test Directory: /home/casatest/casa6/casatestutils/nosedir/test_task_smoothcal
25-Aug-2026 01:45:51
25-Aug-2026 01:45:51 Running Command: pytest --junitxml=/home/casatest/casa6/casatestutils/nosedir/xml/test_task_smoothcal/nose.xml -s --disable-pytest-warnings --verbose -ra --tb=short /home/casatest/casa6/casatestutils/nosedir/test_task_smoothcal/
25-Aug-2026 01:45:51
25-Aug-2026 01:45:51 Setting Working Directory: /home/casatest/casa6/casatestutils/nosedir/test_task_getephemtable/
25-Aug-2026 01:45:51 Test Directory: /home/casatest/casa6/casatestutils/nosedir/test_task_getephemtable
25-Aug-2026 01:45:51
25-Aug-2026 01:45:51 Running Command: pytest --junitxml=/home/casatest/casa6/casatestutils/nosedir/xml/test_task_getephemtable/nose.xml -s --disable-pytest-warnings --verbose -ra --tb=short /home/casatest/casa6/casatestutils/nosedir/test_task_getephemtable/
25-Aug-2026 01:45:51
25-Aug-2026 01:45:51 Setting Working Directory: /home/casatest/casa6/casatestutils/nosedir/test_task_gencal/
25-Aug-2026 01:45:51 Test Directory: /home/casatest/casa6/casatestutils/nosedir/test_task_gencal
25-Aug-2026 01:45:51
25-Aug-2026 01:45:51 Running Command: pytest --junitxml=/home/casatest/casa6/casatestutils/nosedir/xml/test_task_gencal/nose.xml -s --disable-pytest-warnings --verbose -ra --tb=short /home/casatest/casa6/casatestutils/nosedir/test_task_gencal/
25-Aug-2026 01:45:51
25-Aug-2026 01:45:51 Setting Working Directory: /home/casatest/casa6/casatestutils/nosedir/test_task_imrebin/
25-Aug-2026 01:45:51 Test Directory: /home/casatest/casa6/casatestutils/nosedir/test_task_imrebin
25-Aug-2026 01:45:51
25-Aug-2026 01:45:51 Running Command: pytest --junitxml=/home/casatest/casa6/casatestutils/nosedir/xml/test_task_imrebin/nose.xml -s --disable-pytest-warnings --verbose -ra --tb=short /home/casatest/casa6/casatestutils/nosedir/test_task_imrebin/
25-Aug-2026 01:45:51
25-Aug-2026 01:45:51 Setting Working Directory: /home/casatest/casa6/casatestutils/nosedir/test_task_imdev/
25-Aug-2026 01:45:51 Test Directory: /home/casatest/casa6/casatestutils/nosedir/test_task_imdev
25-Aug-2026 01:45:51
25-Aug-2026 01:45:51 Running Command: pytest --junitxml=/home/casatest/casa6/casatestutils/nosedir/xml/test_task_imdev/nose.xml -s --disable-pytest-warnings --verbose -ra --tb=short /home/casatest/casa6/casatestutils/nosedir/test_task_imdev/
25-Aug-2026 01:45:51
25-Aug-2026 01:45:51 Setting Working Directory: /home/casatest/casa6/casatestutils/nosedir/test_task_predictcomp/
25-Aug-2026 01:45:51 Test Directory: /home/casatest/casa6/casatestutils/nosedir/test_task_predictcomp
25-Aug-2026 01:45:51
25-Aug-2026 01:45:51 Running Command: pytest --junitxml=/home/casatest/casa6/casatestutils/nosedir/xml/test_task_predictcomp/nose.xml -s --disable-pytest-warnings --verbose -ra --tb=short /home/casatest/casa6/casatestutils/nosedir/test_task_predictcomp/
25-Aug-2026 01:45:51
25-Aug-2026 01:45:51 Setting Working Directory: /home/casatest/casa6/casatestutils/nosedir/test_task_listfits/
25-Aug-2026 01:45:51 Test Directory: /home/casatest/casa6/casatestutils/nosedir/test_task_listfits
25-Aug-2026 01:45:51
25-Aug-2026 01:45:51 Running Command: pytest --junitxml=/home/casatest/casa6/casatestutils/nosedir/xml/test_task_listfits/nose.xml -s --disable-pytest-warnings --verbose -ra --tb=short /home/casatest/casa6/casatestutils/nosedir/test_task_listfits/
25-Aug-2026 01:45:51
25-Aug-2026 01:45:51 Setting Working Directory: /home/casatest/casa6/casatestutils/nosedir/test_task_visstat/
25-Aug-2026 01:45:51 Test Directory: /home/casatest/casa6/casatestutils/nosedir/test_task_visstat
25-Aug-2026 01:45:51
25-Aug-2026 01:45:51 Running Command: pytest --junitxml=/home/casatest/casa6/casatestutils/nosedir/xml/test_task_visstat/nose.xml -s --disable-pytest-warnings --verbose -ra --tb=short /home/casatest/casa6/casatestutils/nosedir/test_task_visstat/
25-Aug-2026 01:45:51
25-Aug-2026 01:45:51 Setting Working Directory: /home/casatest/casa6/casatestutils/nosedir/test_task_flagdata/
25-Aug-2026 01:45:51 Test Directory: /home/casatest/casa6/casatestutils/nosedir/test_task_flagdata
25-Aug-2026 01:45:51
25-Aug-2026 01:45:51 Running Command: pytest --junitxml=/home/casatest/casa6/casatestutils/nosedir/xml/test_task_flagdata/nose.xml -s --disable-pytest-warnings --verbose -ra --tb=short /home/casatest/casa6/casatestutils/nosedir/test_task_flagdata/
25-Aug-2026 01:45:51
25-Aug-2026 01:45:51 Setting Working Directory: /home/casatest/casa6/casatestutils/nosedir/test_task_imhistory/
25-Aug-2026 01:45:51 Test Directory: /home/casatest/casa6/casatestutils/nosedir/test_task_imhistory
25-Aug-2026 01:45:51
25-Aug-2026 01:45:51 Running Command: pytest --junitxml=/home/casatest/casa6/casatestutils/nosedir/xml/test_task_imhistory/nose.xml -s --disable-pytest-warnings --verbose -ra --tb=short /home/casatest/casa6/casatestutils/nosedir/test_task_imhistory/
25-Aug-2026 01:45:51
25-Aug-2026 01:45:51 Setting Working Directory: /home/casatest/casa6/casatestutils/nosedir/test_task_importfitsidi/
25-Aug-2026 01:45:51 Test Directory: /home/casatest/casa6/casatestutils/nosedir/test_task_importfitsidi
25-Aug-2026 01:45:51
25-Aug-2026 01:45:51 Running Command: pytest --junitxml=/home/casatest/casa6/casatestutils/nosedir/xml/test_task_importfitsidi/nose.xml -s --disable-pytest-warnings --verbose -ra --tb=short /home/casatest/casa6/casatestutils/nosedir/test_task_importfitsidi/
25-Aug-2026 01:45:51
25-Aug-2026 01:45:51 Setting Working Directory: /home/casatest/casa6/casatestutils/nosedir/test_task_imsmooth/
25-Aug-2026 01:45:51 Test Directory: /home/casatest/casa6/casatestutils/nosedir/test_task_imsmooth
25-Aug-2026 01:45:51
25-Aug-2026 01:45:51 Running Command: pytest --junitxml=/home/casatest/casa6/casatestutils/nosedir/xml/test_task_imsmooth/nose.xml -s --disable-pytest-warnings --verbose -ra --tb=short /home/casatest/casa6/casatestutils/nosedir/test_task_imsmooth/
25-Aug-2026 01:45:51
25-Aug-2026 01:45:51 Setting Working Directory: /home/casatest/casa6/casatestutils/nosedir/test_task_feather/
25-Aug-2026 01:45:51 Test Directory: /home/casatest/casa6/casatestutils/nosedir/test_task_feather
25-Aug-2026 01:45:51
25-Aug-2026 01:45:51 Running Command: pytest --junitxml=/home/casatest/casa6/casatestutils/nosedir/xml/test_task_feather/nose.xml -s --disable-pytest-warnings --verbose -ra --tb=short /home/casatest/casa6/casatestutils/nosedir/test_task_feather/
25-Aug-2026 01:45:52 total 398276
25-Aug-2026 01:45:52 -rw-r--r-- 1 casaci 15001   1845691 Aug 24 20:25 casatasks-6.7.1.12a14708.dev7-py3-none-any.whl
25-Aug-2026 01:45:52 -rw-r--r-- 1 casaci root    4584470 Aug 25 01:45 casatasks_test.log
25-Aug-2026 01:45:52 -rw-r--r-- 1 casaci 15001    135265 Aug 24 20:25 casatestutils-6.7.1.12a14708.dev7-py3-none-any.whl
25-Aug-2026 01:45:52 -rw-r--r-- 1 casaci 15001 400485148 Aug 24 20:26 casatools-6.7.1.12a14708.dev7-cp310-cp310-manylinux_2_28_x86_64.whl
25-Aug-2026 01:45:52 -rw-r--r-- 1 casaci root       1177 Aug 25 01:45 requirements.txt
25-Aug-2026 01:45:52 -rw-r--r-- 1 casaci root       1802 Aug 25 01:45 test_task_accor.xml
25-Aug-2026 01:45:52 -rw-r--r-- 1 casaci root       3158 Aug 25 01:45 test_task_applycal.xml
25-Aug-2026 01:45:52 -rw-r--r-- 1 casaci root        635 Aug 25 01:45 test_task_asdmsummary.xml
25-Aug-2026 01:45:52 -rw-r--r-- 1 casaci root        811 Aug 25 01:45 test_task_bandpass.xml
25-Aug-2026 01:45:52 -rw-r--r-- 1 casaci root       1728 Aug 25 01:45 test_task_blcal.xml
25-Aug-2026 01:45:52 -rw-r--r-- 1 casaci root        860 Aug 25 01:45 test_task_calstat.xml
25-Aug-2026 01:45:52 -rw-r--r-- 1 casaci root        978 Aug 25 01:45 test_task_clearcal.xml
25-Aug-2026 01:45:52 -rw-r--r-- 1 casaci root        669 Aug 25 01:45 test_task_clearstat.xml
25-Aug-2026 01:45:52 -rw-r--r-- 1 casaci root       1836 Aug 25 01:45 test_task_concat.xml
25-Aug-2026 01:45:52 -rw-r--r-- 1 casaci root       1347 Aug 25 01:45 test_task_conjugatevis.xml
25-Aug-2026 01:45:52 -rw-r--r-- 1 casaci root       7403 Aug 25 01:45 test_task_cvel.xml
25-Aug-2026 01:45:52 -rw-r--r-- 1 casaci root       5034 Aug 25 01:45 test_task_cvel2.xml
25-Aug-2026 01:45:52 -rw-r--r-- 1 casaci root      15715 Aug 25 01:45 test_task_deconvolve.xml
25-Aug-2026 01:45:52 -rw-r--r-- 1 casaci root        728 Aug 25 01:45 test_task_defintent.xml
25-Aug-2026 01:45:52 -rw-r--r-- 1 casaci root        592 Aug 25 01:45 test_task_delmod.xml
25-Aug-2026 01:45:52 -rw-r--r-- 1 casaci root       1778 Aug 25 01:45 test_task_exportasdm.xml
25-Aug-2026 01:45:52 -rw-r--r-- 1 casaci root        339 Aug 25 01:45 test_task_exportfits.xml
25-Aug-2026 01:45:52 -rw-r--r-- 1 casaci root       1843 Aug 25 01:45 test_task_exportuvfits.xml
25-Aug-2026 01:45:52 -rw-r--r-- 1 casaci root        872 Aug 25 01:45 test_task_feather.xml
25-Aug-2026 01:45:52 -rw-r--r-- 1 casaci root       1957 Aug 25 01:45 test_task_fixplanets.xml
25-Aug-2026 01:45:52 -rw-r--r-- 1 casaci root       1449 Aug 25 01:45 test_task_fixvis.xml
25-Aug-2026 01:45:52 -rw-r--r-- 1 casaci root       4607 Aug 25 01:45 test_task_flagcmd.xml
25-Aug-2026 01:45:52 -rw-r--r-- 1 casaci root      27913 Aug 25 01:45 test_task_flagdata.xml
25-Aug-2026 01:45:52 -rw-r--r-- 1 casaci root        946 Aug 25 01:45 test_task_flagmanager.xml
25-Aug-2026 01:45:52 -rw-r--r-- 1 casaci root       2338 Aug 25 01:45 test_task_fluxscale.xml
25-Aug-2026 01:45:52 -rw-r--r-- 1 casaci root       1351 Aug 25 01:45 test_task_fringefit.xml
25-Aug-2026 01:45:52 -rw-r--r-- 1 casaci root       3234 Aug 25 01:45 test_task_gaincal.xml
25-Aug-2026 01:45:52 -rw-r--r-- 1 casaci root       3702 Aug 25 01:45 test_task_gencal.xml
25-Aug-2026 01:45:52 -rw-r--r-- 1 casaci root        457 Aug 25 01:45 test_task_getantposalma.xml
25-Aug-2026 01:45:52 -rw-r--r-- 1 casaci root        665 Aug 25 01:45 test_task_getcalmodvla.xml
25-Aug-2026 01:45:52 -rw-r--r-- 1 casaci root       1021 Aug 25 01:45 test_task_getephemtable.xml
25-Aug-2026 01:45:52 -rw-r--r-- 1 casaci root       1211 Aug 25 01:45 test_task_hanningsmooth.xml
25-Aug-2026 01:45:52 -rw-r--r-- 1 casaci root      29142 Aug 25 01:45 test_task_imbaseline.xml
25-Aug-2026 01:45:52 -rw-r--r-- 1 casaci root       2200 Aug 25 01:45 test_task_imcollapse.xml
25-Aug-2026 01:45:52 -rw-r--r-- 1 casaci root       1203 Aug 25 01:45 test_task_imcontsub.xml
25-Aug-2026 01:45:52 -rw-r--r-- 1 casaci root       1747 Aug 25 01:45 test_task_imdev.xml
25-Aug-2026 01:45:52 -rw-r--r-- 1 casaci root       3172 Aug 25 01:45 test_task_imfit.xml
25-Aug-2026 01:45:52 -rw-r--r-- 1 casaci root       2114 Aug 25 01:45 test_task_imhead.xml
25-Aug-2026 01:45:52 -rw-r--r-- 1 casaci root       1155 Aug 25 01:45 test_task_imhistory.xml
25-Aug-2026 01:45:52 -rw-r--r-- 1 casaci root       3035 Aug 25 01:45 test_task_immath.xml
25-Aug-2026 01:45:52 -rw-r--r-- 1 casaci root       1648 Aug 25 01:45 test_task_immoments.xml
25-Aug-2026 01:45:52 -rw-r--r-- 1 casaci root       1109 Aug 25 01:45 test_task_impbcor.xml
25-Aug-2026 01:45:52 -rw-r--r-- 1 casaci root        732 Aug 25 01:45 test_task_importasap.xml
25-Aug-2026 01:45:52 -rw-r--r-- 1 casaci root       3685 Aug 25 01:45 test_task_importasdm.xml
25-Aug-2026 01:45:52 -rw-r--r-- 1 casaci root        332 Aug 25 01:45 test_task_importatca.xml
25-Aug-2026 01:45:52 -rw-r--r-- 1 casaci root        993 Aug 25 01:45 test_task_importfitsidi.xml
25-Aug-2026 01:45:52 -rw-r--r-- 1 casaci root        338 Aug 25 01:45 test_task_importmiriad.xml
25-Aug-2026 01:45:52 -rw-r--r-- 1 casaci root        619 Aug 25 01:45 test_task_importnro.xml
25-Aug-2026 01:45:52 -rw-r--r-- 1 casaci root       1798 Aug 25 01:45 test_task_importuvfits.xml
25-Aug-2026 01:45:52 -rw-r--r-- 1 casaci root        813 Aug 25 01:45 test_task_importvla.xml
25-Aug-2026 01:45:52 -rw-r--r-- 1 casaci root       1818 Aug 25 01:45 test_task_impv.xml
25-Aug-2026 01:45:52 -rw-r--r-- 1 casaci root       2095 Aug 25 01:45 test_task_imrebin.xml
25-Aug-2026 01:45:52 -rw-r--r-- 1 casaci root        810 Aug 25 01:45 test_task_imreframe.xml
25-Aug-2026 01:45:52 -rw-r--r-- 1 casaci root       2322 Aug 25 01:45 test_task_imregrid.xml
25-Aug-2026 01:45:52 -rw-r--r-- 1 casaci root       1442 Aug 25 01:45 test_task_imsmooth.xml
25-Aug-2026 01:45:52 -rw-r--r-- 1 casaci root       1420 Aug 25 01:45 test_task_imstat.xml
25-Aug-2026 01:45:52 -rw-r--r-- 1 casaci root        714 Aug 25 01:45 test_task_imsubimage.xml
25-Aug-2026 01:45:52 -rw-r--r-- 1 casaci root        784 Aug 25 01:45 test_task_imtrans.xml
25-Aug-2026 01:45:52 -rw-r--r-- 1 casaci root       3109 Aug 25 01:45 test_task_imval.xml
25-Aug-2026 01:45:52 -rw-r--r-- 1 casaci root       3776 Aug 25 01:45 test_task_initweights.xml
25-Aug-2026 01:45:52 -rw-r--r-- 1 casaci root       1464 Aug 25 01:45 test_task_listcal.xml
25-Aug-2026 01:45:52 -rw-r--r-- 1 casaci root        492 Aug 25 01:45 test_task_listfits.xml
25-Aug-2026 01:45:52 -rw-r--r-- 1 casaci root        732 Aug 25 01:45 test_task_listhistory.xml
25-Aug-2026 01:45:52 -rw-r--r-- 1 casaci root       8561 Aug 25 01:45 test_task_listobs.xml
25-Aug-2026 01:45:52 -rw-r--r-- 1 casaci root       1499 Aug 25 01:45 test_task_listpartition.xml
25-Aug-2026 01:45:52 -rw-r--r-- 1 casaci root        505 Aug 25 01:45 test_task_listsdm.xml
25-Aug-2026 01:45:52 -rw-r--r-- 1 casaci root        734 Aug 25 01:45 test_task_listvis.xml
25-Aug-2026 01:45:52 -rw-r--r-- 1 casaci root       2643 Aug 25 01:45 test_task_makemask.xml
25-Aug-2026 01:45:52 -rw-r--r-- 1 casaci root      34468 Aug 25 01:45 test_task_mstransform.xml
25-Aug-2026 01:45:52 -rw-r--r-- 1 casaci root       5827 Aug 25 01:45 test_task_mstransform_mms.xml
25-Aug-2026 01:45:52 -rw-r--r-- 1 casaci root        762 Aug 25 01:45 test_task_nrobeamaverage.xml
25-Aug-2026 01:45:52 -rw-r--r-- 1 casaci root       3447 Aug 25 01:45 test_task_partition.xml
25-Aug-2026 01:45:52 -rw-r--r-- 1 casaci root       3221 Aug 25 01:45 test_task_phaseshift.xml
25-Aug-2026 01:45:52 -rw-r--r-- 1 casaci root       1075 Aug 25 01:45 test_task_plotants.xml
25-Aug-2026 01:45:52 -rw-r--r-- 1 casaci root      25954 Aug 25 01:45 test_task_plotbandpass.xml
25-Aug-2026 01:45:52 -rw-r--r-- 1 casaci root       1775 Aug 25 01:45 test_task_plotprofilemap.xml
25-Aug-2026 01:45:52 -rw-r--r-- 1 casaci root       1800 Aug 25 01:45 test_task_plotweather.xml
25-Aug-2026 01:45:52 -rw-r--r-- 1 casaci root       3068 Aug 25 01:45 test_task_polcal.xml
25-Aug-2026 01:45:52 -rw-r--r-- 1 casaci root        338 Aug 25 01:45 test_task_polfromgain.xml
25-Aug-2026 01:45:52 -rw-r--r-- 1 casaci root       1197 Aug 25 01:45 test_task_predictcomp.xml
25-Aug-2026 01:45:52 -rw-r--r-- 1 casaci root        953 Aug 25 01:45 test_task_rerefant.xml
25-Aug-2026 01:45:52 -rw-r--r-- 1 casaci root       1187 Aug 25 01:45 test_task_rmfit.xml
25-Aug-2026 01:45:52 -rw-r--r-- 1 casaci root        790 Aug 25 01:45 test_task_rmtables.xml
25-Aug-2026 01:45:52 -rw-r--r-- 1 casaci root       5009 Aug 25 01:45 test_task_sdatmcor.xml
25-Aug-2026 01:45:52 -rw-r--r-- 1 casaci root      17967 Aug 25 01:45 test_task_sdbaseline.xml
25-Aug-2026 01:45:52 -rw-r--r-- 1 casaci root       6626 Aug 25 01:45 test_task_sdcal.xml
25-Aug-2026 01:45:52 -rw-r--r-- 1 casaci root       4156 Aug 25 01:45 test_task_sdfit.xml
25-Aug-2026 01:45:52 -rw-r--r-- 1 casaci root       1842 Aug 25 01:45 test_task_sdfixscan.xml
25-Aug-2026 01:45:52 -rw-r--r-- 1 casaci root       1569 Aug 25 01:45 test_task_sdgaincal.xml
25-Aug-2026 01:45:52 -rw-r--r-- 1 casaci root      23642 Aug 25 01:45 test_task_sdimaging.xml
25-Aug-2026 01:45:52 -rw-r--r-- 1 casaci root       2600 Aug 25 01:45 test_task_sdintimaging.xml
25-Aug-2026 01:45:52 -rw-r--r-- 1 casaci root        565 Aug 25 01:45 test_task_sdpolaverage.xml
25-Aug-2026 01:45:52 -rw-r--r-- 1 casaci root       2433 Aug 25 01:45 test_task_sdsidebandsplit.xml
25-Aug-2026 01:45:52 -rw-r--r-- 1 casaci root       3927 Aug 25 01:45 test_task_sdsmooth.xml
25-Aug-2026 01:45:52 -rw-r--r-- 1 casaci root       4379 Aug 25 01:45 test_task_sdtimeaverage.xml
25-Aug-2026 01:45:52 -rw-r--r-- 1 casaci root       3432 Aug 25 01:45 test_task_setjy.xml
25-Aug-2026 01:45:52 -rw-r--r-- 1 casaci root       1695 Aug 25 01:45 test_task_simanalyze.xml
25-Aug-2026 01:45:52 -rw-r--r-- 1 casaci root      12694 Aug 25 01:45 test_task_simobserve.xml
25-Aug-2026 01:45:52 -rw-r--r-- 1 casaci root       1491 Aug 25 01:45 test_task_slsearch.xml
25-Aug-2026 01:45:52 -rw-r--r-- 1 casaci root       1368 Aug 25 01:45 test_task_smoothcal.xml
25-Aug-2026 01:45:52 -rw-r--r-- 1 casaci root       1929 Aug 25 01:45 test_task_specfit.xml
25-Aug-2026 01:45:52 -rw-r--r-- 1 casaci root        696 Aug 25 01:45 test_task_specflux.xml
25-Aug-2026 01:45:52 -rw-r--r-- 1 casaci root        433 Aug 25 01:45 test_task_specsmooth.xml
25-Aug-2026 01:45:52 -rw-r--r-- 1 casaci root        448 Aug 25 01:45 test_task_splattotable.xml
25-Aug-2026 01:45:52 -rw-r--r-- 1 casaci root      17882 Aug 25 01:45 test_task_split.xml
25-Aug-2026 01:45:52 -rw-r--r-- 1 casaci root        686 Aug 25 01:45 test_task_spxfit.xml
25-Aug-2026 01:45:52 -rw-r--r-- 1 casaci root       2389 Aug 25 01:45 test_task_statwt.xml
25-Aug-2026 01:45:52 -rw-r--r-- 1 casaci root      38641 Aug 25 01:45 test_task_tclean.xml
25-Aug-2026 01:45:52 -rw-r--r-- 1 casaci root        680 Aug 25 01:45 test_task_testconcat.xml
25-Aug-2026 01:45:52 -rw-r--r-- 1 casaci root      23506 Aug 25 01:45 test_task_tsdimaging.xml
25-Aug-2026 01:45:52 -rw-r--r-- 1 casaci root       4535 Aug 25 01:45 test_task_uvcontsub.xml
25-Aug-2026 01:45:52 -rw-r--r-- 1 casaci root        823 Aug 25 01:45 test_task_uvcontsub_old.xml
25-Aug-2026 01:45:52 -rw-r--r-- 1 casaci root       1502 Aug 25 01:45 test_task_uvmodelfit.xml
25-Aug-2026 01:45:52 -rw-r--r-- 1 casaci root       1463 Aug 25 01:45 test_task_virtualconcat.xml
25-Aug-2026 01:45:52 -rw-r--r-- 1 casaci root       1076 Aug 25 01:45 test_task_vishead.xml
25-Aug-2026 01:45:52 -rw-r--r-- 1 casaci root       3268 Aug 25 01:45 test_task_visstat.xml
25-Aug-2026 01:45:52 -rw-r--r-- 1 casaci root       1965 Aug 25 01:45 test_task_wvrgcal.xml
25-Aug-2026 01:45:52 Finished task 'Test wheel' with result: Success
25-Aug-2026 01:45:52 Starting task 'Inject is_641' of type 'com.atlassian.bamboo.plugins.bamboo-variable-inject-plugin:inject'
25-Aug-2026 01:45:52 Injected variable bamboo.inject.is_641=False in LOCAL scope
25-Aug-2026 01:45:52 Finished task 'Inject is_641' with result: Success
25-Aug-2026 01:45:52
Substituting variable: ${bamboo.planRepository.branchName} with CAS-14708
25-Aug-2026 01:45:52 Starting task 'Tar work directory' of type 'com.atlassian.bamboo.plugins.scripttask:task.builder.script'
25-Aug-2026 01:45:52
Beginning to execute external process for build 'CASASPECS - Dev Test GPU 3.10 L4 - CAS-14708 - Test Tasks Many Linux 2.28 Python 3.10 L4 #4 (CASASPECS-DEVTESTGPUPY3103-TTM228PY310-4)'
... running command line:
/export/cvpost135-nvme/casa/bamboohome/temp/CASASPECS-DEVTESTGPUPY3103-TTM228PY310-4-ScriptBuildTask-5964818997478374793.sh
... in: /export/cvpost135-nvme/casa/bamboohome/xml-data/build-dir/CASASPECS-DEVTESTGPUPY3103-TTM228PY310
25-Aug-2026 01:45:52 Package working directory
25-Aug-2026 01:45:52 tar: work: Cannot stat: No such file or directory
25-Aug-2026 01:45:52 tar: Exiting with failure status due to previous errors
25-Aug-2026 01:45:53 total 398280
25-Aug-2026 01:45:53 -rw-r--r-- 1 casaci 15001   1845691 Aug 24 20:25 casatasks-6.7.1.12a14708.dev7-py3-none-any.whl
25-Aug-2026 01:45:53 -rw-r--r-- 1 casaci root    4584470 Aug 25 01:45 casatasks_test.log
25-Aug-2026 01:45:53 -rw-r--r-- 1 casaci 15001    135265 Aug 24 20:25 casatestutils-6.7.1.12a14708.dev7-py3-none-any.whl
25-Aug-2026 01:45:53 -rw-r--r-- 1 casaci 15001 400485148 Aug 24 20:26 casatools-6.7.1.12a14708.dev7-cp310-cp310-manylinux_2_28_x86_64.whl
25-Aug-2026 01:45:53 -rw-r--r-- 1 casaci root       1177 Aug 25 01:45 requirements.txt
25-Aug-2026 01:45:53 -rw-r--r-- 1 casaci root       1802 Aug 25 01:45 test_task_accor.xml
25-Aug-2026 01:45:53 -rw-r--r-- 1 casaci root       3158 Aug 25 01:45 test_task_applycal.xml
25-Aug-2026 01:45:53 -rw-r--r-- 1 casaci root        635 Aug 25 01:45 test_task_asdmsummary.xml
25-Aug-2026 01:45:53 -rw-r--r-- 1 casaci root        811 Aug 25 01:45 test_task_bandpass.xml
25-Aug-2026 01:45:53 -rw-r--r-- 1 casaci root       1728 Aug 25 01:45 test_task_blcal.xml
25-Aug-2026 01:45:53 -rw-r--r-- 1 casaci root        860 Aug 25 01:45 test_task_calstat.xml
25-Aug-2026 01:45:53 -rw-r--r-- 1 casaci root        978 Aug 25 01:45 test_task_clearcal.xml
25-Aug-2026 01:45:53 -rw-r--r-- 1 casaci root        669 Aug 25 01:45 test_task_clearstat.xml
25-Aug-2026 01:45:53 -rw-r--r-- 1 casaci root       1836 Aug 25 01:45 test_task_concat.xml
25-Aug-2026 01:45:53 -rw-r--r-- 1 casaci root       1347 Aug 25 01:45 test_task_conjugatevis.xml
25-Aug-2026 01:45:53 -rw-r--r-- 1 casaci root       7403 Aug 25 01:45 test_task_cvel.xml
25-Aug-2026 01:45:53 -rw-r--r-- 1 casaci root       5034 Aug 25 01:45 test_task_cvel2.xml
25-Aug-2026 01:45:53 -rw-r--r-- 1 casaci root      15715 Aug 25 01:45 test_task_deconvolve.xml
25-Aug-2026 01:45:53 -rw-r--r-- 1 casaci root        728 Aug 25 01:45 test_task_defintent.xml
25-Aug-2026 01:45:53 -rw-r--r-- 1 casaci root        592 Aug 25 01:45 test_task_delmod.xml
25-Aug-2026 01:45:53 -rw-r--r-- 1 casaci root       1778 Aug 25 01:45 test_task_exportasdm.xml
25-Aug-2026 01:45:53 -rw-r--r-- 1 casaci root        339 Aug 25 01:45 test_task_exportfits.xml
25-Aug-2026 01:45:53 -rw-r--r-- 1 casaci root       1843 Aug 25 01:45 test_task_exportuvfits.xml
25-Aug-2026 01:45:53 -rw-r--r-- 1 casaci root        872 Aug 25 01:45 test_task_feather.xml
25-Aug-2026 01:45:53 -rw-r--r-- 1 casaci root       1957 Aug 25 01:45 test_task_fixplanets.xml
25-Aug-2026 01:45:53 -rw-r--r-- 1 casaci root       1449 Aug 25 01:45 test_task_fixvis.xml
25-Aug-2026 01:45:53 -rw-r--r-- 1 casaci root       4607 Aug 25 01:45 test_task_flagcmd.xml
25-Aug-2026 01:45:53 -rw-r--r-- 1 casaci root      27913 Aug 25 01:45 test_task_flagdata.xml
25-Aug-2026 01:45:53 -rw-r--r-- 1 casaci root        946 Aug 25 01:45 test_task_flagmanager.xml
25-Aug-2026 01:45:53 -rw-r--r-- 1 casaci root       2338 Aug 25 01:45 test_task_fluxscale.xml
25-Aug-2026 01:45:53 -rw-r--r-- 1 casaci root       1351 Aug 25 01:45 test_task_fringefit.xml
25-Aug-2026 01:45:53 -rw-r--r-- 1 casaci root       3234 Aug 25 01:45 test_task_gaincal.xml
25-Aug-2026 01:45:53 -rw-r--r-- 1 casaci root       3702 Aug 25 01:45 test_task_gencal.xml
25-Aug-2026 01:45:53 -rw-r--r-- 1 casaci root        457 Aug 25 01:45 test_task_getantposalma.xml
25-Aug-2026 01:45:53 -rw-r--r-- 1 casaci root        665 Aug 25 01:45 test_task_getcalmodvla.xml
25-Aug-2026 01:45:53 -rw-r--r-- 1 casaci root       1021 Aug 25 01:45 test_task_getephemtable.xml
25-Aug-2026 01:45:53 -rw-r--r-- 1 casaci root       1211 Aug 25 01:45 test_task_hanningsmooth.xml
25-Aug-2026 01:45:53 -rw-r--r-- 1 casaci root      29142 Aug 25 01:45 test_task_imbaseline.xml
25-Aug-2026 01:45:53 -rw-r--r-- 1 casaci root       2200 Aug 25 01:45 test_task_imcollapse.xml
25-Aug-2026 01:45:53 -rw-r--r-- 1 casaci root       1203 Aug 25 01:45 test_task_imcontsub.xml
25-Aug-2026 01:45:53 -rw-r--r-- 1 casaci root       1747 Aug 25 01:45 test_task_imdev.xml
25-Aug-2026 01:45:53 -rw-r--r-- 1 casaci root       3172 Aug 25 01:45 test_task_imfit.xml
25-Aug-2026 01:45:53 -rw-r--r-- 1 casaci root       2114 Aug 25 01:45 test_task_imhead.xml
25-Aug-2026 01:45:53 -rw-r--r-- 1 casaci root       1155 Aug 25 01:45 test_task_imhistory.xml
25-Aug-2026 01:45:53 -rw-r--r-- 1 casaci root       3035 Aug 25 01:45 test_task_immath.xml
25-Aug-2026 01:45:53 -rw-r--r-- 1 casaci root       1648 Aug 25 01:45 test_task_immoments.xml
25-Aug-2026 01:45:53 -rw-r--r-- 1 casaci root       1109 Aug 25 01:45 test_task_impbcor.xml
25-Aug-2026 01:45:53 -rw-r--r-- 1 casaci root        732 Aug 25 01:45 test_task_importasap.xml
25-Aug-2026 01:45:53 -rw-r--r-- 1 casaci root       3685 Aug 25 01:45 test_task_importasdm.xml
25-Aug-2026 01:45:53 -rw-r--r-- 1 casaci root        332 Aug 25 01:45 test_task_importatca.xml
25-Aug-2026 01:45:53 -rw-r--r-- 1 casaci root        993 Aug 25 01:45 test_task_importfitsidi.xml
25-Aug-2026 01:45:53 -rw-r--r-- 1 casaci root        338 Aug 25 01:45 test_task_importmiriad.xml
25-Aug-2026 01:45:53 -rw-r--r-- 1 casaci root        619 Aug 25 01:45 test_task_importnro.xml
25-Aug-2026 01:45:53 -rw-r--r-- 1 casaci root       1798 Aug 25 01:45 test_task_importuvfits.xml
25-Aug-2026 01:45:53 -rw-r--r-- 1 casaci root        813 Aug 25 01:45 test_task_importvla.xml
25-Aug-2026 01:45:53 -rw-r--r-- 1 casaci root       1818 Aug 25 01:45 test_task_impv.xml
25-Aug-2026 01:45:53 -rw-r--r-- 1 casaci root       2095 Aug 25 01:45 test_task_imrebin.xml
25-Aug-2026 01:45:53 -rw-r--r-- 1 casaci root        810 Aug 25 01:45 test_task_imreframe.xml
25-Aug-2026 01:45:53 -rw-r--r-- 1 casaci root       2322 Aug 25 01:45 test_task_imregrid.xml
25-Aug-2026 01:45:53 -rw-r--r-- 1 casaci root       1442 Aug 25 01:45 test_task_imsmooth.xml
25-Aug-2026 01:45:53 -rw-r--r-- 1 casaci root       1420 Aug 25 01:45 test_task_imstat.xml
25-Aug-2026 01:45:53 -rw-r--r-- 1 casaci root        714 Aug 25 01:45 test_task_imsubimage.xml
25-Aug-2026 01:45:53 -rw-r--r-- 1 casaci root        784 Aug 25 01:45 test_task_imtrans.xml
25-Aug-2026 01:45:53 -rw-r--r-- 1 casaci root       3109 Aug 25 01:45 test_task_imval.xml
25-Aug-2026 01:45:53 -rw-r--r-- 1 casaci root       3776 Aug 25 01:45 test_task_initweights.xml
25-Aug-2026 01:45:53 -rw-r--r-- 1 casaci root       1464 Aug 25 01:45 test_task_listcal.xml
25-Aug-2026 01:45:53 -rw-r--r-- 1 casaci root        492 Aug 25 01:45 test_task_listfits.xml
25-Aug-2026 01:45:53 -rw-r--r-- 1 casaci root        732 Aug 25 01:45 test_task_listhistory.xml
25-Aug-2026 01:45:53 -rw-r--r-- 1 casaci root       8561 Aug 25 01:45 test_task_listobs.xml
25-Aug-2026 01:45:53 -rw-r--r-- 1 casaci root       1499 Aug 25 01:45 test_task_listpartition.xml
25-Aug-2026 01:45:53 -rw-r--r-- 1 casaci root        505 Aug 25 01:45 test_task_listsdm.xml
25-Aug-2026 01:45:53 -rw-r--r-- 1 casaci root        734 Aug 25 01:45 test_task_listvis.xml
25-Aug-2026 01:45:53 -rw-r--r-- 1 casaci root       2643 Aug 25 01:45 test_task_makemask.xml
25-Aug-2026 01:45:53 -rw-r--r-- 1 casaci root      34468 Aug 25 01:45 test_task_mstransform.xml
25-Aug-2026 01:45:53 -rw-r--r-- 1 casaci root       5827 Aug 25 01:45 test_task_mstransform_mms.xml
25-Aug-2026 01:45:53 -rw-r--r-- 1 casaci root        762 Aug 25 01:45 test_task_nrobeamaverage.xml
25-Aug-2026 01:45:53 -rw-r--r-- 1 casaci root       3447 Aug 25 01:45 test_task_partition.xml
25-Aug-2026 01:45:53 -rw-r--r-- 1 casaci root       3221 Aug 25 01:45 test_task_phaseshift.xml
25-Aug-2026 01:45:53 -rw-r--r-- 1 casaci root       1075 Aug 25 01:45 test_task_plotants.xml
25-Aug-2026 01:45:53 -rw-r--r-- 1 casaci root      25954 Aug 25 01:45 test_task_plotbandpass.xml
25-Aug-2026 01:45:53 -rw-r--r-- 1 casaci root       1775 Aug 25 01:45 test_task_plotprofilemap.xml
25-Aug-2026 01:45:53 -rw-r--r-- 1 casaci root       1800 Aug 25 01:45 test_task_plotweather.xml
25-Aug-2026 01:45:53 -rw-r--r-- 1 casaci root       3068 Aug 25 01:45 test_task_polcal.xml
25-Aug-2026 01:45:53 -rw-r--r-- 1 casaci root        338 Aug 25 01:45 test_task_polfromgain.xml
25-Aug-2026 01:45:53 -rw-r--r-- 1 casaci root       1197 Aug 25 01:45 test_task_predictcomp.xml
25-Aug-2026 01:45:53 -rw-r--r-- 1 casaci root        953 Aug 25 01:45 test_task_rerefant.xml
25-Aug-2026 01:45:53 -rw-r--r-- 1 casaci root       1187 Aug 25 01:45 test_task_rmfit.xml
25-Aug-2026 01:45:53 -rw-r--r-- 1 casaci root        790 Aug 25 01:45 test_task_rmtables.xml
25-Aug-2026 01:45:53 -rw-r--r-- 1 casaci root       5009 Aug 25 01:45 test_task_sdatmcor.xml
25-Aug-2026 01:45:53 -rw-r--r-- 1 casaci root      17967 Aug 25 01:45 test_task_sdbaseline.xml
25-Aug-2026 01:45:53 -rw-r--r-- 1 casaci root       6626 Aug 25 01:45 test_task_sdcal.xml
25-Aug-2026 01:45:53 -rw-r--r-- 1 casaci root       4156 Aug 25 01:45 test_task_sdfit.xml
25-Aug-2026 01:45:53 -rw-r--r-- 1 casaci root       1842 Aug 25 01:45 test_task_sdfixscan.xml
25-Aug-2026 01:45:53 -rw-r--r-- 1 casaci root       1569 Aug 25 01:45 test_task_sdgaincal.xml
25-Aug-2026 01:45:53 -rw-r--r-- 1 casaci root      23642 Aug 25 01:45 test_task_sdimaging.xml
25-Aug-2026 01:45:53 -rw-r--r-- 1 casaci root       2600 Aug 25 01:45 test_task_sdintimaging.xml
25-Aug-2026 01:45:53 -rw-r--r-- 1 casaci root        565 Aug 25 01:45 test_task_sdpolaverage.xml
25-Aug-2026 01:45:53 -rw-r--r-- 1 casaci root       2433 Aug 25 01:45 test_task_sdsidebandsplit.xml
25-Aug-2026 01:45:53 -rw-r--r-- 1 casaci root       3927 Aug 25 01:45 test_task_sdsmooth.xml
25-Aug-2026 01:45:53 -rw-r--r-- 1 casaci root       4379 Aug 25 01:45 test_task_sdtimeaverage.xml
25-Aug-2026 01:45:53 -rw-r--r-- 1 casaci root       3432 Aug 25 01:45 test_task_setjy.xml
25-Aug-2026 01:45:53 -rw-r--r-- 1 casaci root       1695 Aug 25 01:45 test_task_simanalyze.xml
25-Aug-2026 01:45:53 -rw-r--r-- 1 casaci root      12694 Aug 25 01:45 test_task_simobserve.xml
25-Aug-2026 01:45:53 -rw-r--r-- 1 casaci root       1491 Aug 25 01:45 test_task_slsearch.xml
25-Aug-2026 01:45:53 -rw-r--r-- 1 casaci root       1368 Aug 25 01:45 test_task_smoothcal.xml
25-Aug-2026 01:45:53 -rw-r--r-- 1 casaci root       1929 Aug 25 01:45 test_task_specfit.xml
25-Aug-2026 01:45:53 -rw-r--r-- 1 casaci root        696 Aug 25 01:45 test_task_specflux.xml
25-Aug-2026 01:45:53 -rw-r--r-- 1 casaci root        433 Aug 25 01:45 test_task_specsmooth.xml
25-Aug-2026 01:45:53 -rw-r--r-- 1 casaci root        448 Aug 25 01:45 test_task_splattotable.xml
25-Aug-2026 01:45:53 -rw-r--r-- 1 casaci root      17882 Aug 25 01:45 test_task_split.xml
25-Aug-2026 01:45:53 -rw-r--r-- 1 casaci root        686 Aug 25 01:45 test_task_spxfit.xml
25-Aug-2026 01:45:53 -rw-r--r-- 1 casaci root       2389 Aug 25 01:45 test_task_statwt.xml
25-Aug-2026 01:45:53 -rw-r--r-- 1 casaci root      38641 Aug 25 01:45 test_task_tclean.xml
25-Aug-2026 01:45:53 -rw-r--r-- 1 casaci root        680 Aug 25 01:45 test_task_testconcat.xml
25-Aug-2026 01:45:53 -rw-r--r-- 1 casaci root      23506 Aug 25 01:45 test_task_tsdimaging.xml
25-Aug-2026 01:45:53 -rw-r--r-- 1 casaci root       4535 Aug 25 01:45 test_task_uvcontsub.xml
25-Aug-2026 01:45:53 -rw-r--r-- 1 casaci root        823 Aug 25 01:45 test_task_uvcontsub_old.xml
25-Aug-2026 01:45:53 -rw-r--r-- 1 casaci root       1502 Aug 25 01:45 test_task_uvmodelfit.xml
25-Aug-2026 01:45:53 -rw-r--r-- 1 casaci root       1463 Aug 25 01:45 test_task_virtualconcat.xml
25-Aug-2026 01:45:53 -rw-r--r-- 1 casaci root       1076 Aug 25 01:45 test_task_vishead.xml
25-Aug-2026 01:45:53 -rw-r--r-- 1 casaci root       3268 Aug 25 01:45 test_task_visstat.xml
25-Aug-2026 01:45:53 -rw-r--r-- 1 casaci root       1965 Aug 25 01:45 test_task_wvrgcal.xml
25-Aug-2026 01:45:53 -rw-r--r-- 1 casaci root         45 Aug 25 01:45 work-manylinux_228_casatasks-3.10.tar.gz
25-Aug-2026 01:45:53 Done packaging working directory
25-Aug-2026 01:45:53 Finished task 'Tar work directory' with result: Success
25-Aug-2026 01:45:53 Starting task 'Parse tests' of type 'com.atlassian.bamboo.plugins.testresultparser:task.testresultparser.junit'
25-Aug-2026 01:45:53 Parsing test results under /export/cvpost135-nvme/casa/bamboohome/xml-data/build-dir/CASASPECS-DEVTESTGPUPY3103-TTM228PY310...
25-Aug-2026 01:45:53 Failing task since 3 failing test cases were found.
25-Aug-2026 01:45:53 Finished task 'Parse tests' with result: Failed
25-Aug-2026 01:45:53 Starting task 'Cleanup' of type 'com.atlassian.bamboo.plugins.scripttask:task.builder.script'
25-Aug-2026 01:45:53
Beginning to execute external process for build 'CASASPECS - Dev Test GPU 3.10 L4 - CAS-14708 - Test Tasks Many Linux 2.28 Python 3.10 L4 #4 (CASASPECS-DEVTESTGPUPY3103-TTM228PY310-4)'
... running command line:
/export/cvpost135-nvme/casa/bamboohome/temp/CASASPECS-DEVTESTGPUPY3103-TTM228PY310-4-ScriptBuildTask-9689066028624344335.sh
... in: /export/cvpost135-nvme/casa/bamboohome/xml-data/build-dir/CASASPECS-DEVTESTGPUPY3103-TTM228PY310
25-Aug-2026 01:45:53 Starting cleanup
25-Aug-2026 01:46:03 wheel-container-test
25-Aug-2026 01:46:08 wheel-container-test
25-Aug-2026 01:46:08 Cleanup complete
25-Aug-2026 01:46:08 Finished task 'Cleanup' with result: Success
25-Aug-2026 01:46:08 Running post build plugin 'Docker Container Cleanup'
25-Aug-2026 01:46:08 Running post build plugin 'NCover Results Collector'
25-Aug-2026 01:46:08 Running post build plugin 'Build Results Label Collector'
25-Aug-2026 01:46:08 Running post build plugin 'Clover Results Collector'
25-Aug-2026 01:46:08 Running post build plugin 'npm Cache Cleanup'
25-Aug-2026 01:46:08 Running post build plugin 'Artifact Copier'
25-Aug-2026 01:46:08 Publishing an artifact: requirements.txt
25-Aug-2026 01:46:08 Finished publishing of artifact Non required job artifact Http Compression On : [requirements.txt], patterns: [requirements.txt] anchored at: [wheeldirectory/] in 59.32 ms
25-Aug-2026 01:46:08 Publishing an artifact: XML Directories
25-Aug-2026 01:46:08 Finished publishing of artifact Non required job artifact Http Compression On : [XML Directories], patterns: [**/*.xml] anchored at: [wheeldirectory/] in 415.3 ms
25-Aug-2026 01:46:08 Finalising the build...
25-Aug-2026 01:46:08 Stopping timer.
25-Aug-2026 01:46:08 Build CASASPECS-DEVTESTGPUPY3103-TTM228PY310-4 completed.
24-Aug-2026 21:46:09 Running on server: post build plugin 'Build Hanging Detection Configuration'
24-Aug-2026 21:46:09 Running on server: post build plugin 'NCover Results Collector'
24-Aug-2026 21:46:09 Running on server: post build plugin 'Build Labeller'
24-Aug-2026 21:46:09 Running on server: post build plugin 'Clover Delta Calculator'
24-Aug-2026 21:46:09 Running on server: post build plugin 'Maven Dependencies Postprocessor'
24-Aug-2026 21:46:09 All post build plugins have finished
24-Aug-2026 21:46:09 Generating build results summary...
24-Aug-2026 21:46:10 Saving build results to disk...
24-Aug-2026 21:46:10 Store variable context...
24-Aug-2026 21:46:11 Finished building CASASPECS-DEVTESTGPUPY3103-TTM228PY310-4.