Build: #2 failed

Job: Test Tools Many Linux 2.28 failed

Stages & jobs

  1. Default Stage

  2. Test

Build log

The build generated 283 lines of output. Download or view full build log.

27-Aug-2026 12:51:40 Build CASASPECS - CI Build - CAS-14858 - Test Tools Many Linux 2.28 #2 (CASASPECS-CI314-TTOML228-2) is being prepared for building on agent cbt-el7-6.cv.nrao.edu (2), bamboo version: 9.6.26
27-Aug-2026 12:51:40 Remote agent on host cbt-el7-6.cv.nrao.edu
27-Aug-2026 12:51:40 Build working directory is /export/home/cbt-el7-6/bamboohome/xml-data/build-dir/CASASPECS-CI314-TTOML228
27-Aug-2026 12:51:40 Executing build CASASPECS - CI Build - CAS-14858 - Test Tools Many Linux 2.28 #2 (CASASPECS-CI314-TTOML228-2)
27-Aug-2026 12:51:40 Starting task 'Source Code Checkout' of type 'com.atlassian.bamboo.plugins.vcs:task.vcs.checkout'
27-Aug-2026 12:51:40 Build always requires a clean checkout
27-Aug-2026 12:51:40 Cleaning build directory '/export/home/cbt-el7-6/bamboohome/xml-data/build-dir/CASASPECS-CI314-TTOML228'
27-Aug-2026 12:51:40 Checking out into /export/home/cbt-el7-6/bamboohome/xml-data/build-dir/CASASPECS-CI314-TTOML228
27-Aug-2026 12:51:40 Updating source code to revision: 71c68755dcea307d2f9f7fc449c4a7f98e045fa5
27-Aug-2026 12:51:40 Creating local git repository in '/export/home/cbt-el7-6/bamboohome/xml-data/build-dir/CASASPECS-CI314-TTOML228/.git'.
27-Aug-2026 12:51:40 Initialized empty Git repository in /export/home/cbt-el7-6/bamboohome/xml-data/build-dir/CASASPECS-CI314-TTOML228/.git/
27-Aug-2026 12:51:40 Fetching 'refs/heads/CAS-14858' from 'ssh://git@open-bitbucket.nrao.edu:7999/casa/casa6.git'.
27-Aug-2026 12:51:41 Warning: Permanently added '[127.0.0.1]:37451' (RSA) to the list of known hosts.
27-Aug-2026 12:51:41 X11 forwarding request failed on channel 0
27-Aug-2026 12:51:56 Checking out revision 71c68755dcea307d2f9f7fc449c4a7f98e045fa5.
27-Aug-2026 12:51:59 Switched to branch 'CAS-14858'
27-Aug-2026 12:51:59 Submodule 'casatools/casacore' (https://github.com/casacore/casacore.git) registered for path 'casatools/casacore'
27-Aug-2026 12:51:59 Submodule 'casatools/grpc-source' (https://github.com/grpc/grpc) registered for path 'casatools/grpc-source'
27-Aug-2026 12:52:00 Cloning into 'casatools/casacore'...
27-Aug-2026 12:52:55 Submodule path 'casatools/casacore': checked out 'aaf72eb7edd5a5fecefa78ca04713233b7b6ffd6'
27-Aug-2026 12:52:55 Cloning into 'casatools/grpc-source'...
27-Aug-2026 13:04:25 Submodule path 'casatools/grpc-source': checked out 'cca868ac8f3641df4003a82b7fc54c921e14f765'
27-Aug-2026 13:04:25 Submodule 'third_party/abseil-cpp' (https://github.com/abseil/abseil-cpp) registered for path 'third_party/abseil-cpp'
27-Aug-2026 13:04:25 Submodule 'third_party/benchmark' (https://github.com/google/benchmark) registered for path 'third_party/benchmark'
27-Aug-2026 13:04:26 Submodule 'third_party/bloaty' (https://github.com/google/bloaty.git) registered for path 'third_party/bloaty'
27-Aug-2026 13:04:26 Submodule 'third_party/boringssl' (https://github.com/google/boringssl.git) registered for path 'third_party/boringssl'
27-Aug-2026 13:04:26 Submodule 'third_party/boringssl-with-bazel' (https://github.com/google/boringssl.git) registered for path 'third_party/boringssl-with-bazel'
27-Aug-2026 13:04:26 Submodule 'third_party/cares/cares' (https://github.com/c-ares/c-ares.git) registered for path 'third_party/cares/cares'
27-Aug-2026 13:04:26 Submodule 'third_party/gflags' (https://github.com/gflags/gflags.git) registered for path 'third_party/gflags'
27-Aug-2026 13:04:26 Submodule 'third_party/googletest' (https://github.com/google/googletest.git) registered for path 'third_party/googletest'
27-Aug-2026 13:04:26 Submodule 'third_party/protobuf' (https://github.com/google/protobuf.git) registered for path 'third_party/protobuf'
27-Aug-2026 13:04:26 Submodule 'third_party/zlib' (https://github.com/madler/zlib) registered for path 'third_party/zlib'
27-Aug-2026 13:04:26 Cloning into 'third_party/abseil-cpp'...
27-Aug-2026 13:04:31 Submodule path 'casatools/grpc-source/third_party/abseil-cpp': checked out 'cc4bed2d74f7c8717e31f9579214ab52a9c9c610'
27-Aug-2026 13:04:31 Cloning into 'third_party/benchmark'...
27-Aug-2026 13:04:33 Submodule path 'casatools/grpc-source/third_party/benchmark': checked out '5b7683f49e1e9223cf9927b24f6fd3d6bd82e3f8'
27-Aug-2026 13:04:34 Cloning into 'third_party/bloaty'...
27-Aug-2026 13:04:35 Submodule path 'casatools/grpc-source/third_party/bloaty': checked out '73594cde8c9a52a102c4341c244c833aa61b9c06'
27-Aug-2026 13:04:35 Submodule 'third_party/googletest' (https://github.com/google/googletest.git) registered for path 'third_party/googletest'
27-Aug-2026 13:04:35 Submodule 'third_party/libFuzzer' (https://chromium.googlesource.com/chromium/llvm-project/llvm/lib/Fuzzer) registered for path 'third_party/libFuzzer'
27-Aug-2026 13:04:35 Submodule 'third_party/re2' (https://github.com/google/re2) registered for path 'third_party/re2'
27-Aug-2026 13:04:35 Cloning into 'third_party/googletest'...
27-Aug-2026 13:04:41 Submodule path 'casatools/grpc-source/third_party/bloaty/third_party/googletest': checked out 'a2b8a8e07628e5fd60644b6dd99c1b5e7d7f1f47'
27-Aug-2026 13:04:41 Cloning into 'third_party/libFuzzer'...
27-Aug-2026 13:04:42 Submodule path 'casatools/grpc-source/third_party/bloaty/third_party/libFuzzer': checked out '1b543d6e5073b56be214394890c9193979a3d7e1'
27-Aug-2026 13:04:43 Cloning into 'third_party/re2'...
27-Aug-2026 13:04:45 Submodule path 'casatools/grpc-source/third_party/bloaty/third_party/re2': checked out 'c964d9b07816f9b52ca692e23b8b3dba33beec54'
27-Aug-2026 13:04:45 Cloning into 'third_party/boringssl'...
27-Aug-2026 13:06:10 Submodule path 'casatools/grpc-source/third_party/boringssl': checked out 'be2ee342d3781ddb954f91f8a7e660c6f59e87e5'
27-Aug-2026 13:06:10 Cloning into 'third_party/boringssl-with-bazel'...
27-Aug-2026 13:07:45 Submodule path 'casatools/grpc-source/third_party/boringssl-with-bazel': checked out '886e7d75368e3f4fab3f4d0d3584e4abfc557755'
27-Aug-2026 13:07:45 Cloning into 'third_party/cares/cares'...
27-Aug-2026 13:07:47 Submodule path 'casatools/grpc-source/third_party/cares/cares': checked out '3be1924221e1326df520f8498d704a5c4c8d0cce'
27-Aug-2026 13:07:47 Cloning into 'third_party/gflags'...
27-Aug-2026 13:07:48 Submodule path 'casatools/grpc-source/third_party/gflags': checked out '30dbc81fb5ffdc98ea9b14b1918bfe4e8779b26e'
27-Aug-2026 13:07:48 Submodule 'doc' (https://github.com/gflags/gflags.git) registered for path 'doc'
27-Aug-2026 13:07:48 Cloning into 'doc'...
27-Aug-2026 13:07:49 Submodule path 'casatools/grpc-source/third_party/gflags/doc': checked out '971dd2a4fadac9cdab174c523c22df79efd63aa5'
27-Aug-2026 13:07:49 Cloning into 'third_party/googletest'...
27-Aug-2026 13:07:55 Submodule path 'casatools/grpc-source/third_party/googletest': checked out 'ec44c6c1675c25b9827aacd08c02433cccde7780'
27-Aug-2026 13:07:55 Cloning into 'third_party/protobuf'...
27-Aug-2026 13:10:26 Submodule path 'casatools/grpc-source/third_party/protobuf': checked out '2761122b810fe8861004ae785cc3ab39f384d342'
27-Aug-2026 13:10:26 Submodule 'third_party/benchmark' (https://github.com/google/benchmark.git) registered for path 'third_party/benchmark'
27-Aug-2026 13:10:26 Cloning into 'third_party/benchmark'...
27-Aug-2026 13:10:27 Submodule path 'casatools/grpc-source/third_party/protobuf/third_party/benchmark': checked out '360e66c1c4777c99402cf8cd535aa510fee16573'
27-Aug-2026 13:10:27 Cloning into 'third_party/zlib'...
27-Aug-2026 13:10:28 Submodule path 'casatools/grpc-source/third_party/zlib': checked out 'cacf7f1d4e3d44d871b605da3b647f07d718623f'
27-Aug-2026 13:10:28 Updated source code to revision: 71c68755dcea307d2f9f7fc449c4a7f98e045fa5
27-Aug-2026 13:10:28 Finished task 'Source Code Checkout' with result: Success
27-Aug-2026 13:10:28 Running pre-build action: Build Log Labeller Pre Build Action
27-Aug-2026 13:10:28 Running pre-build action: VCS Version Collector
27-Aug-2026 13:10:28 Build CASASPECS - CI Build - CAS-14858 - Test Tools Many Linux 2.28 #2 (CASASPECS-CI314-TTOML228-2) started building on agent 'cbt-el7-6.cv.nrao.edu (2)' (Remote agent on host cbt-el7-6.cv.nrao.edu)
27-Aug-2026 13:10:29 Starting task 'Update data' of type 'com.atlassian.bamboo.plugins.scripttask:task.builder.script'
27-Aug-2026 13:10:29
Beginning to execute external process for build 'CASASPECS - CI Build - CAS-14858 - Test Tools Many Linux 2.28 #2 (CASASPECS-CI314-TTOML228-2)'
... running command line:
/export/home/cbt-el7-6/bamboohome/temp/CASASPECS-CI314-TTOML228-2-ScriptBuildTask-8786698236601429500.sh
... in: /export/home/cbt-el7-6/bamboohome/xml-data/build-dir/CASASPECS-CI314-TTOML228
27-Aug-2026 13:10:29 Already up-to-date.
27-Aug-2026 13:10:30
27-Aug-2026 13:10:30 (gnome-ssh-askpass:1848): Gtk-WARNING **: 13:10:30.409: cannot open display: localhost:10.0
27-Aug-2026 13:10:30 error: unable to read askpass response from '/usr/libexec/openssh/gnome-ssh-askpass'
27-Aug-2026 13:10:30 fatal: could not read Username for 'https://open-bitbucket.nrao.edu': No such device or address
27-Aug-2026 13:10:30 Already up-to-date.
27-Aug-2026 13:10:30 Data update complete
27-Aug-2026 13:10:30 Finished task 'Update data' with result: Success
27-Aug-2026 13:10:30 Starting task 'Create wheeldirectory' of type 'com.atlassian.bamboo.plugins.scripttask:task.builder.script'
27-Aug-2026 13:10:30
Beginning to execute external process for build 'CASASPECS - CI Build - CAS-14858 - Test Tools Many Linux 2.28 #2 (CASASPECS-CI314-TTOML228-2)'
... running command line:
/export/home/cbt-el7-6/bamboohome/temp/CASASPECS-CI314-TTOML228-2-ScriptBuildTask-13348896726491808443.sh
... in: /export/home/cbt-el7-6/bamboohome/xml-data/build-dir/CASASPECS-CI314-TTOML228
27-Aug-2026 13:10:30 Finished task 'Create wheeldirectory' with result: Success
27-Aug-2026 13:10:30 Starting task 'Get latest wheel' of type 'com.atlassian.bamboo.plugins.bamboo-artifact-downloader-plugin:artifactdownloadertask'
27-Aug-2026 13:10:30 Preparing to download plan result CASASPECS-CI314-2 artifact: Required shared artifact Http Compression On : [ManyLinux228 Python 3.12 Tool wheel], patterns: [casatools*.whl] anchored at: [source/wheels]
27-Aug-2026 13:10:30 Retrieving artifact ManyLinux228 Python 3.12 Tool wheel for CASASPECS-CI314-2 using Bamboo server artifact handler
27-Aug-2026 13:10:37 Artifact [ManyLinux228 Python 3.12 Tool wheel] downloaded successfully in 6.360 s to wheeldirectory/
27-Aug-2026 13:10:37 Preparing to download plan result CASASPECS-CI314-2 artifact: Required shared artifact Http Compression On : [ManyLinux228 Casatestutils], patterns: [casatestutils*.whl] anchored at: [source/wheels]
27-Aug-2026 13:10:37 Retrieving artifact ManyLinux228 Casatestutils for CASASPECS-CI314-2 using Bamboo server artifact handler
27-Aug-2026 13:10:37 Artifact [ManyLinux228 Casatestutils] downloaded successfully in 32.32 ms to wheeldirectory/
27-Aug-2026 13:10:37 Finished task 'Get latest wheel' with result: Success
27-Aug-2026 13:10:37 Starting task 'Stop and remove running wheel-container-test' of type 'com.atlassian.bamboo.plugins.scripttask:task.builder.script'
27-Aug-2026 13:10:37
Beginning to execute external process for build 'CASASPECS - CI Build - CAS-14858 - Test Tools Many Linux 2.28 #2 (CASASPECS-CI314-TTOML228-2)'
... running command line:
/export/home/cbt-el7-6/bamboohome/temp/CASASPECS-CI314-TTOML228-2-ScriptBuildTask-954455458401509927.sh
... in: /export/home/cbt-el7-6/bamboohome/xml-data/build-dir/CASASPECS-CI314-TTOML228
27-Aug-2026 13:10:37 Error response from daemon: No such container: wheel-container-test
27-Aug-2026 13:10:37 Error response from daemon: No such container: wheel-container-test
27-Aug-2026 13:10:37 Removed wheel-container-test
27-Aug-2026 13:10:37 Finished task 'Stop and remove running wheel-container-test' with result: Success
27-Aug-2026 13:10:37
Substituting variable: ${bamboo.working.directory} with /export/home/cbt-el7-6/bamboohome/xml-data/build-dir/CASASPECS-CI314-TTOML228
27-Aug-2026 13:10:37 Starting task 'Start container' of type 'com.atlassian.bamboo.plugins.bamboo-docker-plugin:task.docker.cli'
27-Aug-2026 13:10:37 Running image name (casa-docker.nrao.edu:5000/casa-test-rocky-8.10:4)
27-Aug-2026 13:10:37
Beginning to execute external process for build 'CASASPECS - CI Build - CAS-14858 - Test Tools Many Linux 2.28 #2 (CASASPECS-CI314-TTOML228-2)'
... running command line:
/usr/bin/docker run --volume /export/home/cbt-el7-6/bamboohome/xml-data/build-dir/CASASPECS-CI314-TTOML228/wheeldirectory:/wheeldirectory --volume /opt/casa/data:/opt/casa/data --detach --name wheel-container-test casa-docker.nrao.edu:5000/casa-test-rocky-8.10:4 tail -f /dev/null
... in: /export/home/cbt-el7-6/bamboohome/xml-data/build-dir/CASASPECS-CI314-TTOML228
27-Aug-2026 13:10:38 6ddd384d48ecd62f7f120105b805b92b2ec80ab1cac1de73471e254f51eadbf5
27-Aug-2026 13:10:39 Finished task 'Start container' with result: Success
27-Aug-2026 13:10:39
Substituting variable: ${bamboo.planRepository.branchName} with CAS-14858
27-Aug-2026 13:10:39 Starting task 'Test wheel' of type 'com.atlassian.bamboo.plugins.scripttask:task.builder.script'
27-Aug-2026 13:10:39
Beginning to execute external process for build 'CASASPECS - CI Build - CAS-14858 - Test Tools Many Linux 2.28 #2 (CASASPECS-CI314-TTOML228-2)'
... running command line:
/export/home/cbt-el7-6/bamboohome/temp/CASASPECS-CI314-TTOML228-2-ScriptBuildTask-5549540593846290103.sh
... in: /export/home/cbt-el7-6/bamboohome/xml-data/build-dir/CASASPECS-CI314-TTOML228
27-Aug-2026 13:10:39 branch: CAS-14858
27-Aug-2026 13:10:39 Python version: 3.12
27-Aug-2026 13:10:39   % Total    % Received % Xferd  Average Speed   Time    Time     Time  Current
27-Aug-2026 13:10:39                                  Dload  Upload   Total   Spent    Left  Speed
27-Aug-2026 13:10:39
27-Aug-2026 13:10:39   0     0    0     0    0     0      0      0 --:--:-- --:--:-- --:--:--     0
27-Aug-2026 13:10:39 100 6002k  100 6002k    0     0  23.4M      0 --:--:-- --:--:-- --:--:-- 23.7M
27-Aug-2026 13:10:39 bamboo_jira_components:''
27-Aug-2026 13:10:39 bamboo_testlist:''
27-Aug-2026 13:10:40 [1992] Failed to execute script 'atlutil' due to unhandled exception!
27-Aug-2026 13:10:40 Traceback (most recent call last):
27-Aug-2026 13:10:40   File "atlutil.py", line 194, in <module>
27-Aug-2026 13:10:40   File "atlutil.py", line 112, in get_ticket_components
27-Aug-2026 13:10:40   File "json/__init__.py", line 354, in loads
27-Aug-2026 13:10:40   File "json/decoder.py", line 339, in decode
27-Aug-2026 13:10:40   File "json/decoder.py", line 357, in raw_decode
27-Aug-2026 13:10:40 json.decoder.JSONDecodeError: Expecting value: line 12 column 1 (char 11)
27-Aug-2026 13:10:40 Ticket components:  -j ""
27-Aug-2026 13:10:40 datapath=[ "/opt/casa/data/master", "/opt/casa/data/casatestdata" ]
27-Aug-2026 13:10:40 measurespath="/opt/casa/data/master"
27-Aug-2026 13:10:40 measures_auto_update=False
27-Aug-2026 13:10:40 data_auto_update=False
27-Aug-2026 13:10:40 datapath=[ "/opt/casa/data/master", "/opt/casa/data/casatestdata" ]
27-Aug-2026 13:10:40 measurespath="/opt/casa/data/master"
27-Aug-2026 13:10:40 measures_auto_update=False
27-Aug-2026 13:10:40 data_auto_update=False
27-Aug-2026 13:10:44 Requirement already satisfied: pip in /home/casatest/venv/lib/python3.12/site-packages (24.3.1)
27-Aug-2026 13:10:44 Collecting pip
27-Aug-2026 13:10:44   Downloading pip-26.2.1-py3-none-any.whl.metadata (4.6 kB)
27-Aug-2026 13:10:45 Collecting numpy
27-Aug-2026 13:10:45   Downloading numpy-2.5.2-cp312-cp312-manylinux_2_27_x86_64.manylinux_2_28_x86_64.whl.metadata (6.6 kB)
27-Aug-2026 13:10:45 Downloading pip-26.2.1-py3-none-any.whl (1.8 MB)
27-Aug-2026 13:10:45    ━━━━━━━━━━━━━━━━━━━━━━━━━━━━━━━━━━━━━━━━ 1.8/1.8 MB 52.7 MB/s eta 0:00:00
27-Aug-2026 13:10:45 Downloading numpy-2.5.2-cp312-cp312-manylinux_2_27_x86_64.manylinux_2_28_x86_64.whl (16.7 MB)
27-Aug-2026 13:10:45    ━━━━━━━━━━━━━━━━━━━━━━━━━━━━━━━━━━━━━━━━ 16.7/16.7 MB 63.0 MB/s eta 0:00:00
27-Aug-2026 13:10:45 Installing collected packages: pip, numpy
27-Aug-2026 13:10:45   Attempting uninstall: pip
27-Aug-2026 13:10:45     Found existing installation: pip 24.3.1
27-Aug-2026 13:10:45     Uninstalling pip-24.3.1:
27-Aug-2026 13:10:45       Successfully uninstalled pip-24.3.1
27-Aug-2026 13:10:49 Successfully installed numpy-2.5.2 pip-26.2.1
27-Aug-2026 13:10:49 Processing ./casatestutils-6.7.7.7a14858.dev1-py3-none-any.whl
27-Aug-2026 13:10:50 Collecting pytest>=6.0 (from casatestutils==6.7.7.7a14858.dev1)
27-Aug-2026 13:10:50   Downloading pytest-9.1.1-py3-none-any.whl.metadata (7.6 kB)
27-Aug-2026 13:10:50 Collecting astropy (from casatestutils==6.7.7.7a14858.dev1)
27-Aug-2026 13:10:50   Downloading astropy-8.0.1-cp311-abi3-manylinux2014_x86_64.manylinux_2_17_x86_64.manylinux_2_28_x86_64.whl.metadata (11 kB)
27-Aug-2026 13:10:50 Collecting iniconfig>=1.0.1 (from pytest>=6.0->casatestutils==6.7.7.7a14858.dev1)
27-Aug-2026 13:10:50   Downloading iniconfig-2.3.0-py3-none-any.whl.metadata (2.5 kB)
27-Aug-2026 13:10:50 Collecting packaging>=22 (from pytest>=6.0->casatestutils==6.7.7.7a14858.dev1)
27-Aug-2026 13:10:50   Downloading packaging-26.3-py3-none-any.whl.metadata (3.5 kB)
27-Aug-2026 13:10:50 Collecting pluggy<2,>=1.5 (from pytest>=6.0->casatestutils==6.7.7.7a14858.dev1)
27-Aug-2026 13:10:50   Downloading pluggy-1.6.0-py3-none-any.whl.metadata (4.8 kB)
27-Aug-2026 13:10:50 Collecting pygments>=2.7.2 (from pytest>=6.0->casatestutils==6.7.7.7a14858.dev1)
27-Aug-2026 13:10:50   Downloading pygments-2.21.0-py3-none-any.whl.metadata (2.5 kB)
27-Aug-2026 13:10:50 Collecting astropy-iers-data>=0.2026.6.22.1.23.34 (from astropy->casatestutils==6.7.7.7a14858.dev1)
27-Aug-2026 13:10:50   Downloading astropy_iers_data-0.2026.8.24.0.24.29-py3-none-any.whl.metadata (3.4 kB)
27-Aug-2026 13:10:50 Requirement already satisfied: numpy>=2.0 in /home/casatest/venv/lib/python3.12/site-packages (from astropy->casatestutils==6.7.7.7a14858.dev1) (2.5.2)
27-Aug-2026 13:10:50 Collecting pyerfa>=2.0.1.3 (from astropy->casatestutils==6.7.7.7a14858.dev1)
27-Aug-2026 13:10:50   Downloading pyerfa-2.0.1.5-cp39-abi3-manylinux_2_17_x86_64.manylinux2014_x86_64.whl.metadata (5.7 kB)
27-Aug-2026 13:10:50 Collecting PyYAML>=6.0.0 (from astropy->casatestutils==6.7.7.7a14858.dev1)
27-Aug-2026 13:10:50   Downloading pyyaml-6.0.3-cp312-cp312-manylinux2014_x86_64.manylinux_2_17_x86_64.manylinux_2_28_x86_64.whl.metadata (2.4 kB)
27-Aug-2026 13:10:50 Downloading pytest-9.1.1-py3-none-any.whl (386 kB)
27-Aug-2026 13:10:50 Downloading pluggy-1.6.0-py3-none-any.whl (20 kB)
27-Aug-2026 13:10:50 Downloading iniconfig-2.3.0-py3-none-any.whl (7.5 kB)
27-Aug-2026 13:10:50 Downloading packaging-26.3-py3-none-any.whl (129 kB)
27-Aug-2026 13:10:50 Downloading pygments-2.21.0-py3-none-any.whl (1.3 MB)
27-Aug-2026 13:10:50    ━━━━━━━━━━━━━━━━━━━━━━━━━━━━━━━━━━━━━━━━ 1.3/1.3 MB 36.5 MB/s  0:00:00
27-Aug-2026 13:10:50 Downloading astropy-8.0.1-cp311-abi3-manylinux2014_x86_64.manylinux_2_17_x86_64.manylinux_2_28_x86_64.whl (10.5 MB)
27-Aug-2026 13:10:50    ━━━━━━━━━━━━━━━━━━━━━━━━━━━━━━━━━━━━━━━━ 10.5/10.5 MB 71.3 MB/s  0:00:00
27-Aug-2026 13:10:50 Downloading astropy_iers_data-0.2026.8.24.0.24.29-py3-none-any.whl (2.0 MB)
27-Aug-2026 13:10:50    ━━━━━━━━━━━━━━━━━━━━━━━━━━━━━━━━━━━━━━━━ 2.0/2.0 MB 53.2 MB/s  0:00:00
27-Aug-2026 13:10:50 Downloading pyerfa-2.0.1.5-cp39-abi3-manylinux_2_17_x86_64.manylinux2014_x86_64.whl (738 kB)
27-Aug-2026 13:10:51    ━━━━━━━━━━━━━━━━━━━━━━━━━━━━━━━━━━━━━━━━ 738.7/738.7 kB 31.7 MB/s  0:00:00
27-Aug-2026 13:10:51 Downloading pyyaml-6.0.3-cp312-cp312-manylinux2014_x86_64.manylinux_2_17_x86_64.manylinux_2_28_x86_64.whl (807 kB)
27-Aug-2026 13:10:51    ━━━━━━━━━━━━━━━━━━━━━━━━━━━━━━━━━━━━━━━━ 807.9/807.9 kB 34.9 MB/s  0:00:00
27-Aug-2026 13:10:51 Installing collected packages: PyYAML, pygments, pyerfa, pluggy, packaging, iniconfig, astropy-iers-data, pytest, astropy, casatestutils
27-Aug-2026 13:10:57
27-Aug-2026 13:10:57 Successfully installed PyYAML-6.0.3 astropy-8.0.1 astropy-iers-data-0.2026.8.24.0.24.29 casatestutils-6.7.7.7a14858.dev1 iniconfig-2.3.0 packaging-26.3 pluggy-1.6.0 pyerfa-2.0.1.5 pygments-2.21.0 pytest-9.1.1
27-Aug-2026 13:10:57 Processing ./casatools-6.7.7.7a14858.dev1-cp312-cp312-manylinux_2_28_x86_64.whl
27-Aug-2026 13:10:58 Requirement already satisfied: numpy in /home/casatest/venv/lib/python3.12/site-packages (from casatools==6.7.7.7a14858.dev1) (2.5.2)
27-Aug-2026 13:10:58 Collecting casaconfig (from casatools==6.7.7.7a14858.dev1)
27-Aug-2026 13:10:58   Downloading casaconfig-1.5.0-py3-none-any.whl.metadata (4.0 kB)
27-Aug-2026 13:10:58 Collecting certifi>=2023.5.7 (from casaconfig->casatools==6.7.7.7a14858.dev1)
27-Aug-2026 13:10:58   Downloading certifi-2026.7.22-py3-none-any.whl.metadata (2.5 kB)
27-Aug-2026 13:10:58 Downloading casaconfig-1.5.0-py3-none-any.whl (77 kB)
27-Aug-2026 13:10:58 Downloading certifi-2026.7.22-py3-none-any.whl (136 kB)
27-Aug-2026 13:10:58 Installing collected packages: certifi, casaconfig, casatools
27-Aug-2026 13:11:00
27-Aug-2026 13:11:00 Successfully installed casaconfig-1.5.0 casatools-6.7.7.7a14858.dev1 certifi-2026.7.22
27-Aug-2026 13:25:02 Switched to a new branch 'CAS-14858'
27-Aug-2026 13:25:02 branch 'CAS-14858' set up to track 'origin/CAS-14858'.
27-Aug-2026 13:25:02   % Total    % Received % Xferd  Average Speed   Time    Time     Time  Current
27-Aug-2026 13:25:02                                  Dload  Upload   Total   Spent    Left  Speed
27-Aug-2026 13:25:02
27-Aug-2026 13:25:03   0     0    0     0    0     0      0      0 --:--:-- --:--:-- --:--:--     0
27-Aug-2026 13:25:04   0     0    0     0    0     0      0      0 --:--:--  0:00:01 --:--:--     0
27-Aug-2026 13:25:04   0     0    0     0    0     0      0      0 --:--:--  0:00:02 --:--:--     0
27-Aug-2026 13:25:04 100   669    0   669    0     0    279      0 --:--:--  0:00:02 --:--:--   279
27-Aug-2026 13:27:31 Traceback (most recent call last):
27-Aug-2026 13:27:31   File "/home/casatest/casa6/casatestutils/runtest.py", line 637, in run_shell_command
27-Aug-2026 13:27:31     r = ShellRunner()
27-Aug-2026 13:27:31         ^^^^^^^^^^^
27-Aug-2026 13:27:31 NameError: name 'ShellRunner' is not defined
27-Aug-2026 13:27:31
27-Aug-2026 13:27:31 During handling of the above exception, another exception occurred:
27-Aug-2026 13:27:31
27-Aug-2026 13:27:31 Traceback (most recent call last):
27-Aug-2026 13:27:31   File "/home/casatest/casa6/casatestutils/runtest.py", line 1526, in <module>
27-Aug-2026 13:27:31     run(
27-Aug-2026 13:27:31   File "/home/casatest/casa6/casatestutils/runtest.py", line 1088, in run
27-Aug-2026 13:27:31     testpaths = fetch_tests(workdir, branch, merge_target, test_paths)
27-Aug-2026 13:27:31                 ^^^^^^^^^^^^^^^^^^^^^^^^^^^^^^^^^^^^^^^^^^^^^^^^^^^^^^
27-Aug-2026 13:27:31   File "/home/casatest/casa6/casatestutils/runtest.py", line 855, in fetch_tests
27-Aug-2026 13:27:31     run_shell_command(cmd, source_dir + "/" + repo)
27-Aug-2026 13:27:31   File "/home/casatest/casa6/casatestutils/runtest.py", line 641, in run_shell_command
27-Aug-2026 13:27:31     os.chdir(run_directory)
27-Aug-2026 13:27:31 FileNotFoundError: [Errno 2] No such file or directory: '/home/casatest/casa6/casatestutils/nosedir//casasources/casa6'
27-Aug-2026 13:27:31 Namespace(list=False, verbose=False, dry_run=False, classes=None, file=None, mapfile=<_io.TextIOWrapper name='/home/casatest/casa6/casatestutils/casatestutils/component_to_test_map.json' mode='r' encoding='utf-8'>, branch='CAS-14858', merge_target=None, pkg=None, work_dir=None, ncores=2, test_paths=None, test_list=None, test_config=None, test_group='casatools', pmode=None, bamboo=False, cachedir=None, ignore_list=None, run_skipped=False, only_skipped=False)
27-Aug-2026 13:27:31
27-Aug-2026 13:27:31 Operating system: Linux
27-Aug-2026 13:27:31
27-Aug-2026 13:27:31 Testing Components['casatools']
27-Aug-2026 13:27:31
27-Aug-2026 13:27:31 Arguments Sent Direct To Pytest :  []
27-Aug-2026 13:27:31 Running 33 Test(s)
27-Aug-2026 13:27:31 Cleaning: /home/casatest/casa6/casatestutils/nosedir/
27-Aug-2026 13:27:31 Tests: ['test_tool_agentflagger', 'test_tool_calanalysis', 'test_tool_calibrater', 'test_tool_componentlist', 'test_tool_coordsys', 'test_tool_image', 'test_tool_image_collapse', 'test_tool_image_deviation', 'test_tool_image_fitprofile', 'test_tool_image_pbcor', 'test_tool_image_pv', 'test_tool_image_rebin', 'test_tool_image_regrid', 'test_tool_image_statistics', 'test_tool_image_subimage', 'test_tool_image_transpose', 'test_tool_imagepol', 'test_tool_linearmosaic', 'test_tool_logsink', 'test_tool_measures', 'test_tool_ms', 'test_tool_ms_createmultims', 'test_tool_ms_statwt', 'test_tool_msmetadata', 'test_tool_msuvbinner', 'test_tool_quanta', 'test_tool_regionmanager', 'test_tool_sdm', 'test_tool_sdm_toms', 'test_tool_simulator', 'test_tool_synthesisutils', 'test_tool_table', 'test_tool_vpmanager']
27-Aug-2026 13:27:31 Fetching Repository: casa6
27-Aug-2026 13:27:31         Running:  git clone https://open-bitbucket.nrao.edu/scm/casa/casa6
27-Aug-2026 13:27:31         Running:  git checkout origin/CAS-14858
27-Aug-2026 13:27:31 find: '/home/casatest/casa6/casatestutils/nosedir/xml/': No such file or directory
27-Aug-2026 13:27:31 total 77648
27-Aug-2026 13:27:31 -rw-r--r-- 1 casaci 15001   161132 Aug 27 17:10 casatestutils-6.7.7.7a14858.dev1-py3-none-any.whl
27-Aug-2026 13:27:31 -rw-r--r-- 1 casaci 15001 79346756 Aug 27 17:10 casatools-6.7.7.7a14858.dev1-cp312-cp312-manylinux_2_28_x86_64.whl
27-Aug-2026 13:27:31 Finished task 'Test wheel' with result: Success
27-Aug-2026 13:27:31 Starting task 'Parse tests' of type 'com.atlassian.bamboo.plugins.testresultparser:task.testresultparser.junit'
27-Aug-2026 13:27:31 Parsing test results under /export/home/cbt-el7-6/bamboohome/xml-data/build-dir/CASASPECS-CI314-TTOML228...
27-Aug-2026 13:27:31 Failing task since test cases were expected but none were found.
27-Aug-2026 13:27:31 Finished task 'Parse tests' with result: Failed
27-Aug-2026 13:27:31 Starting task 'Cleanup' of type 'com.atlassian.bamboo.plugins.scripttask:task.builder.script'
27-Aug-2026 13:27:31
Beginning to execute external process for build 'CASASPECS - CI Build - CAS-14858 - Test Tools Many Linux 2.28 #2 (CASASPECS-CI314-TTOML228-2)'
... running command line:
/export/home/cbt-el7-6/bamboohome/temp/CASASPECS-CI314-TTOML228-2-ScriptBuildTask-11567110654651945350.sh
... in: /export/home/cbt-el7-6/bamboohome/xml-data/build-dir/CASASPECS-CI314-TTOML228
27-Aug-2026 13:27:31 Starting cleanup
27-Aug-2026 13:27:42 wheel-container-test
27-Aug-2026 13:27:43 wheel-container-test
27-Aug-2026 13:27:43 Cleanup complete
27-Aug-2026 13:27:43 Finished task 'Cleanup' with result: Success
27-Aug-2026 13:27:43 Running post build plugin 'Docker Container Cleanup'
27-Aug-2026 13:27:43
Beginning to execute external process for build 'CASASPECS - CI Build - CAS-14858 - Test Tools Many Linux 2.28 #2 (CASASPECS-CI314-TTOML228-2)'
... running command line:
/usr/bin/docker rm -f wheel-container-test
... in: /export/home/cbt-el7-6/bamboohome/xml-data/build-dir/CASASPECS-CI314-TTOML228
27-Aug-2026 13:27:43 Error response from daemon: No such container: wheel-container-test
27-Aug-2026 13:27:43 Running post build plugin 'NCover Results Collector'
27-Aug-2026 13:27:43 Running post build plugin 'Build Results Label Collector'
27-Aug-2026 13:27:43 Running post build plugin 'Clover Results Collector'
27-Aug-2026 13:27:43 Running post build plugin 'npm Cache Cleanup'
27-Aug-2026 13:27:43 Running post build plugin 'Artifact Copier'
27-Aug-2026 13:27:43 Publishing an artifact: Tests
27-Aug-2026 13:27:45 Failing as no matching files has been found and empty artifacts are not allowed.
27-Aug-2026 13:27:45 Unable to publish artifact [Tests]:
27-Aug-2026 13:27:45 The artifact hasn't been successfully published after 1.230 s
27-Aug-2026 13:27:45 Publishing an artifact: xml Directories
27-Aug-2026 13:27:45 Failing as no matching files has been found and empty artifacts are not allowed.
27-Aug-2026 13:27:45 Unable to publish artifact [xml Directories]:
27-Aug-2026 13:27:45 The artifact hasn't been successfully published after 26.58 ms
27-Aug-2026 13:27:45 Finalising the build...
27-Aug-2026 13:27:45 Stopping timer.
27-Aug-2026 13:27:45 Build CASASPECS-CI314-TTOML228-2 completed.
27-Aug-2026 13:27:45 Running on server: post build plugin 'Build Hanging Detection Configuration'
27-Aug-2026 13:27:45 Running on server: post build plugin 'NCover Results Collector'
27-Aug-2026 13:27:45 Running on server: post build plugin 'Build Labeller'
27-Aug-2026 13:27:45 Running on server: post build plugin 'Clover Delta Calculator'
27-Aug-2026 13:27:45 Running on server: post build plugin 'Maven Dependencies Postprocessor'
27-Aug-2026 13:27:45 All post build plugins have finished
27-Aug-2026 13:27:45 Generating build results summary...
27-Aug-2026 13:27:45 Saving build results to disk...
27-Aug-2026 13:27:45 Store variable context...
27-Aug-2026 13:27:45 Finished building CASASPECS-CI314-TTOML228-2.