Build: #2 failed Manual run by Ville Suoranta

Stages & jobs

  1. Default Stage

  2. Test

Build result summary

Details

Completed
Queue duration
1 second
Duration
57 minutes
Labels
None
Revision
71c68755dcea307d2f9f7fc449c4a7f98e045fa5
Failing since
#1 (First build for this plan – )
Fixed in
#3 (Changes by Kumar Golap)
No failed test found. A possible compilation error occurred.

Responsible

  • Kumar Golap Kumar Golap Automatically assigned

Shared artifacts

Artifact File size
ManyLinux228 Casatestutils 157 KB
ManyLinux228 Python 3.12 Tool wheel 75 MB

Error summary for Test Tools Many Linux 2.28

The job generated some errors, drill down into the full build log for more details.


(gnome-ssh-askpass:1848): Gtk-WARNING **: 13:10:30.409: cannot open display: localhost:10.0
error: unable to read askpass response from '/usr/libexec/openssh/gnome-ssh-askpass'
fatal: could not read Username for 'https://open-bitbucket.nrao.edu': No such device or address
Error response from daemon: No such container: wheel-container-test
Error response from daemon: No such container: wheel-container-test
  % Total    % Received % Xferd  Average Speed   Time    Time     Time  Current
                                 Dload  Upload   Total   Spent    Left  Speed

  0     0    0     0    0     0      0      0 --:--:-- --:--:-- --:--:--     0
100 6002k  100 6002k    0     0  23.4M      0 --:--:-- --:--:-- --:--:-- 23.7M
[1992] Failed to execute script 'atlutil' due to unhandled exception!
Traceback (most recent call last):
  File "atlutil.py", line 194, in <module>
  File "atlutil.py", line 112, in get_ticket_components
  File "json/__init__.py", line 354, in loads
  File "json/decoder.py", line 339, in decode
  File "json/decoder.py", line 357, in raw_decode
json.decoder.JSONDecodeError: Expecting value: line 12 column 1 (char 11)
Switched to a new branch 'CAS-14858'
  % Total    % Received % Xferd  Average Speed   Time    Time     Time  Current
                                 Dload  Upload   Total   Spent    Left  Speed

  0     0    0     0    0     0      0      0 --:--:-- --:--:-- --:--:--     0
  0     0    0     0    0     0      0      0 --:--:--  0:00:01 --:--:--     0
  0     0    0     0    0     0      0      0 --:--:--  0:00:02 --:--:--     0
100   669    0   669    0     0    279      0 --:--:--  0:00:02 --:--:--   279
Traceback (most recent call last):
  File "/home/casatest/casa6/casatestutils/runtest.py", line 637, in run_shell_command
    r = ShellRunner()
        ^^^^^^^^^^^
NameError: name 'ShellRunner' is not defined

During handling of the above exception, another exception occurred:

Traceback (most recent call last):
  File "/home/casatest/casa6/casatestutils/runtest.py", line 1526, in <module>
    run(
  File "/home/casatest/casa6/casatestutils/runtest.py", line 1088, in run
    testpaths = fetch_tests(workdir, branch, merge_target, test_paths)
                ^^^^^^^^^^^^^^^^^^^^^^^^^^^^^^^^^^^^^^^^^^^^^^^^^^^^^^
  File "/home/casatest/casa6/casatestutils/runtest.py", line 855, in fetch_tests
    run_shell_command(cmd, source_dir + "/" + repo)
  File "/home/casatest/casa6/casatestutils/runtest.py", line 641, in run_shell_command
    os.chdir(run_directory)
FileNotFoundError: [Errno 2] No such file or directory: '/home/casatest/casa6/casatestutils/nosedir//casasources/casa6'
find: '/home/casatest/casa6/casatestutils/nosedir/xml/': No such file or directory