a comprehensive HTML report from Allure test results.
Build: #115 failed Changes by Victor de Souza Magalhaes
Build result summary
Details
- Completed
- Queue duration
- 1 second
- Duration
- 35 minutes
- Labels
- None
- Agent
- casaci-4.cv.nrao.edu test agent7
- Revision
-
b13eec898c7db6ba724c6e911c477e6ae467f6b2
- Total tests
- 750
- Failing since
- #114 (Changes by Des Small – )
- Fixed in
- #116 (Changes by Josh Marvil)
Tests
- 0 New failures
- 2 Existing failures
- 0 Fixed
- 5 Quarantined / skipped
Responsible
-
Des Small
Automatically assigned
Code commits
Tests
| Status | Test | Failing since | View job | Duration | |
|---|---|---|---|---|---|
|
test_task_fringefit
Fringefit_ignore_stations.test_spw
|
Failing since build #114 (Changes by Des Small) | Test Tasks ManyLinux | 29 secs | ||
AssertionError: np.False_ is not true : Flags for antenna 1 are inconsistent
test_task_fringefit.py:569: in test_spw
self.assertTrue(np.all(flags== np.array([ True, True, True, False, False])), msg="Flags for antenna 1 are inconsistent")
E AssertionError: np.False_ is not true : Flags for antenna 1 are inconsistent
|
|||||
|
test_task_pccor
pccor_test_solutionValues.test_solutionValues
|
Failing since build #114 (Changes by Des Small) | Test Tasks ManyLinux | 5 secs | ||
AssertionError: False is not true : Current solutions differs from reference solution. max diff: 181.81819915771484, mean diff: -0.07818151673747335, median diff 0.0, tol: 1e-05.
test_task_pccor.py:286: in test_solutionValues
self.assertTrue(passed, f'Current solutions differs from reference solution. max diff: {diff_max}, mean diff: '
E AssertionError: False is not true : Current solutions differs from reference solution. max diff: 181.81819915771484, mean diff: -0.07818151673747335, median diff 0.0, tol: 1e-05.
|
|||||
Jira issues
| Issue | Description | Status | |
|---|---|---|---|
| Unknown Issue Type | CAS-14867 | Could not obtain issue details from Jira | |