a comprehensive HTML report from Allure test results.
Build: #115 failed Changes by Victor de Souza Magalhaes
Test results
- 750 tests in total
- 2 tests failed
- 5 tests were quarantined / skipped
- 32 minutes taken in total.
| Status | Test | Failing since | View job | Duration | |
|---|---|---|---|---|---|
|
test_task_fringefit
Fringefit_ignore_stations.test_spw
|
Failing since build #114 (Changes by Des Small) | Test Tasks ManyLinux | 29 secs | ||
AssertionError: np.False_ is not true : Flags for antenna 1 are inconsistent
test_task_fringefit.py:569: in test_spw
self.assertTrue(np.all(flags== np.array([ True, True, True, False, False])), msg="Flags for antenna 1 are inconsistent")
E AssertionError: np.False_ is not true : Flags for antenna 1 are inconsistent
|
|||||
|
test_task_pccor
pccor_test_solutionValues.test_solutionValues
|
Failing since build #114 (Changes by Des Small) | Test Tasks ManyLinux | 5 secs | ||
AssertionError: False is not true : Current solutions differs from reference solution. max diff: 181.81819915771484, mean diff: -0.07818151673747335, median diff 0.0, tol: 1e-05.
test_task_pccor.py:286: in test_solutionValues
self.assertTrue(passed, f'Current solutions differs from reference solution. max diff: {diff_max}, mean diff: '
E AssertionError: False is not true : Current solutions differs from reference solution. max diff: 181.81819915771484, mean diff: -0.07818151673747335, median diff 0.0, tol: 1e-05.
|
|||||
| Status | Test | Failing since | View job |
|---|---|---|---|
|
test_flaghelper
test_flaghelper.test_evaluateParameters2
|
Test Tasks ManyLinux | ||
|
test_task_flagdata
test_auto_methods_display.test_display_rflag_timeavg_chanavg_extendflags
|
Test Tasks ManyLinux | ||
|
test_task_flagdata
test_auto_methods_display.test_display_clip_timeavg_chanavg
|
Test Tasks ManyLinux | ||
|
test_task_flagdata
test_auto_methods_display.test_display_all_auto_timeavg_chanavg_extendflags_list_antint
|
Test Tasks ManyLinux | ||
|
test_task_flagdata
test_auto_methods_display.test_display_tfcrop_timeavg_chanavg_extendflags
|
Test Tasks ManyLinux |