a comprehensive HTML report from Allure test results.

Build: #114 failed Changes by Des Small

Stages & jobs

  1. Default Stage

  2. Generate Full Report

    Final

Build result summary

Details

Completed
Queue duration
1 second
Duration
34 minutes
Labels
None
Agent
casaci-4.cv.nrao.edu test agent6
Revision
1b880b849e6793c588f665ce67229ce68f2be8da
Total tests
750
Fixed in
#116 (Changes by Josh Marvil)

Tests

Responsible

  • Des Small Des Small Automatically assigned

Code commits

Author Commit Message Commit date
Des Small Des Small 1b880b849e6793c588f665ce67229ce68f2be8da Pull request #1075: CAS-14194
Merge in CASA/casa6 from CAS-14194 to master

* commit 'b1e3123ed19a5629ffb6176fb67b4137ca5731c5':
  Added a test for this use case
  Fringefit now excludes antennas with too few visibilities to be usefully solved for in a solution interval
  Plumbed the logger throught to the fringefit grid builder
  Tweaked fringefitter to remove antennas that have almost no data in a solution interval
  Changed the fringefit least-squares routine to use modified cholesky method for factoring matrix
  Added a handler for gsl errors to FringeJones.cc
Des Small Des Small b1e3123ed19a5629ffb6176fb67b4137ca5731c5 m Added a test for this use case
Des Small Des Small 390ce66910c13774cb1b987c15a35fbc6da43ce4 m Fringefit now excludes antennas with too few visibilities to be usefully solved for in a solution interval
Des Small Des Small 61b01d8e80e23fa2835faa69106495722343a0bb m Plumbed the logger throught to the fringefit grid builder
Des Small Des Small e8250816832d20be4b86a0e95a02ea3bad86dcfe m Merge branch 'master' into CAS-14194

Tests

New test failures 2
Status Test View job Duration
Collapse Failed test_task_fringefit Fringefit_ignore_stations.test_spw
Test Tasks ManyLinux 29 secs
AssertionError: np.False_ is not true : Flags for antenna 1 are inconsistent
test_task_fringefit.py:569: in test_spw
    self.assertTrue(np.all(flags== np.array([ True,  True,  True, False, False])), msg="Flags for antenna 1 are inconsistent")
E   AssertionError: np.False_ is not true : Flags for antenna 1 are inconsistent
Collapse Failed test_task_pccor pccor_test_solutionValues.test_solutionValues
Test Tasks ManyLinux 5 secs
AssertionError: False is not true : Current solutions differs from reference solution. max diff: 181.81819915771484, mean diff: -0.07818151673747335, median diff 0.0, tol: 1e-05.
test_task_pccor.py:286: in test_solutionValues
    self.assertTrue(passed, f'Current solutions differs from reference solution. max diff: {diff_max}, mean diff: '
E   AssertionError: False is not true : Current solutions differs from reference solution. max diff: 181.81819915771484, mean diff: -0.07818151673747335, median diff 0.0, tol: 1e-05.

Jira issues

IssueDescriptionStatus
Unknown Issue TypeCAS-14194Could not obtain issue details from Jira

Shared artifacts

Artifact File size
Tasks Workdir 1012 KB