Test Tools and Tasks using https://go.nrao.edu/iers/

Build: #5 failed

Job: Test Tasks Many Linux 2.28 Rocky 8.10 Py3.12 failed

Job result summary

Completed
Duration
206 minutes
Agent
casaci-4.cv.nrao.edu test agent6
Total tests
3793
Failing since
#3 (Manual run by Akeem Wells – )

Tests

  • 3,793 tests in total
  • 5 tests failed
  • 4 failures are new
  • 143 tests were quarantined / skipped
  • 200 minutes taken in total.
New test failures 4
Status Test Duration
Collapse Failed test_task_importasdm asdm_import3.test_evlatest1
< 1 sec
AssertionError: False is not true
test_task_importasdm.py:893: in test_evlatest1
    self.assertTrue(retValue['success'])
E   AssertionError: False is not true
Collapse Failed test_task_polcal polcal_test.test_posAngLin
< 1 sec
AssertionError: np.False_ is not true
test_task_polcal.py:412: in test_posAngLin
    self.assertTrue(np.all(np.isclose(calresult, 0)))
E   AssertionError: np.False_ is not true
Collapse Failed test_task_polcal polcal_test.test_sourceInstPolDllsLin
< 1 sec
AssertionError: np.False_ is not true
test_task_polcal.py:281: in test_sourceInstPolDllsLin
    self.assertTrue(np.all(np.isclose(calresult, refresult)))
E   AssertionError: np.False_ is not true
Collapse Failed test_task_tclean test_widefield.test_widefield_awp2_mtmfs
4 mins
AssertionError: False is not true
test_task_tclean.py:4482: in test_widefield_awp2_mtmfs
    self.assertTrue(self.check_final(report))
E   AssertionError: False is not true
Existing test failures 1
Status Test Failing since Duration
AssertionError: False is not true
test_task_gencal.py:911: in test_eop
    self.assertTrue(th.compTables(caltab, reference, ['WEIGHT'], [0.001, 1e-14], mode="both"))
E   AssertionError: False is not true

Error summary

The build generated some errors. See the full build log for more details.

Error response from daemon: No such container: wheel-container-test-153550854
Error response from daemon: No such container: wheel-container-test-153550854
  % Total    % Received % Xferd  Average Speed   Time    Time     Time  Current
                                 Dload  Upload   Total   Spent    Left  Speed

  0     0    0     0    0     0      0      0 --:--:-- --:--:-- --:--:--     0
100 6002k  100 6002k    0     0   110M      0 --:--:-- --:--:-- --:--:--  110M
[990738] Failed to execute script 'atlutil' due to unhandled exception!
Traceback (most recent call last):
  File "atlutil.py", line 200, in <module>
  File "atlutil.py", line 165, in has_fix_version
KeyError: 'fields'
Already on 'master'