Test Tools and Tasks using https://go.nrao.edu/iers/

Build: #5 failed Manual run by Akeem Wells

Build result summary

Details

Completed
Queue duration
< 1 second
Duration
206 minutes
Labels
None
Revisions
CASA6
1c15161af4835b249f46b5067f9a4927f32ea461
OPEN-CASA-PKG
e5285e68467f01199807a1f1a978aec8a4781be7
Total tests
4490
Failing since
#2 (Manual run by Akeem Wells – )

Responsible

This build has been failing since #2
No one has taken responsibility

Tests

New test failures 4
Status Test View job Duration
Collapse Failed test_task_importasdm asdm_import3.test_evlatest1
Test Tasks Many Linux 2.28 Rocky 8.10 Py3.12 < 1 sec
AssertionError: False is not true
test_task_importasdm.py:893: in test_evlatest1
    self.assertTrue(retValue['success'])
E   AssertionError: False is not true
Collapse Failed test_task_polcal polcal_test.test_posAngLin
Test Tasks Many Linux 2.28 Rocky 8.10 Py3.12 < 1 sec
AssertionError: np.False_ is not true
test_task_polcal.py:412: in test_posAngLin
    self.assertTrue(np.all(np.isclose(calresult, 0)))
E   AssertionError: np.False_ is not true
Collapse Failed test_task_polcal polcal_test.test_sourceInstPolDllsLin
Test Tasks Many Linux 2.28 Rocky 8.10 Py3.12 < 1 sec
AssertionError: np.False_ is not true
test_task_polcal.py:281: in test_sourceInstPolDllsLin
    self.assertTrue(np.all(np.isclose(calresult, refresult)))
E   AssertionError: np.False_ is not true
Collapse Failed test_task_tclean test_widefield.test_widefield_awp2_mtmfs
Test Tasks Many Linux 2.28 Rocky 8.10 Py3.12 4 mins
AssertionError: False is not true
test_task_tclean.py:4482: in test_widefield_awp2_mtmfs
    self.assertTrue(self.check_final(report))
E   AssertionError: False is not true
Existing test failures 2
Status Test Failing since View job Duration
AssertionError: False is not true
test_task_gencal.py:911: in test_eop
    self.assertTrue(th.compTables(caltab, reference, ['WEIGHT'], [0.001, 1e-14], mode="both"))
E   AssertionError: False is not true
AssertionError: 220295510184.34296 != 220295510184.3427
test_tool_synthesisutils.py:478: in test_su_advisechansel_getfreqrange_ephem
    self.assertEqual(res['freqstart']['value'], refdict['freqstart']['value'])
E   AssertionError: 220295510184.34296 != 220295510184.3427