Test Tools and Tasks using https://go.nrao.edu/iers/

Build: #4 failed Manual run by Akeem Wells

Build result summary

Details

Completed
Queue duration
3 seconds
Duration
10 minutes
Labels
None
Revisions
CASA6
1c15161af4835b249f46b5067f9a4927f32ea461
OPEN-CASA-PKG
e5285e68467f01199807a1f1a978aec8a4781be7
Total tests
725
Failing since
#2 (Manual run by Akeem Wells – )

Responsible

This build has been failing since #2
No one has taken responsibility

Code commits

CASA6
Author Commit Message Commit date
Kumar Golap Kumar Golap 1c15161af4835b249f46b5067f9a4927f32ea461 Pull request #1079: CAS-14812
Merge in CASA/casa6 from CAS-14812 to master

* commit '96f0882b20b77a5dabb50d0519fbb2fb99490292':
  make minimum oversampling to be 10 for awp2 and awphpg..reduces flux difference from mosaic by a few %
  Fixed a rounding to zero problem when the field of view of image is tiny wrt to beam fov
  some suggestions from reviewer and removed some commented code
  cherry picked stuff from CAS-14708
  cherry picked fixes from CAS-14708
  cherrypicking this file
Kumar Golap Kumar Golap 96f0882b20b77a5dabb50d0519fbb2fb99490292 Merge branch 'master' into CAS-14812
Bob Garwood Bob Garwood 612f68aa4c4ac067af4a9ede0e5e6aa74dc5b64d Pull request #1083: CAS-14806
Merge in CASA/casa6 from CAS-14806 to master

* commit 'a4242e42dc1055ce9b6cdd982beb51b2e664ce83':
  updated the description of the search parameter for the new default value of 'auto'
  added test_search_values
  default search value is now 'auto'
  change URL for service used by getantposalma
Akeem Wells Akeem Wells 17a0b04d04c69a1f14ea8ac7e5e62f01f0eaec86 Pull request #1086: CAS-14875
Merge in CASA/casa6 from CAS-14875 to master

* commit '72a7ccba00dc38eccb998be7cc6a99f464e61d2e':
  Update build.conf for casaplotms to 3.0.2
  CAS-14875 use dev version of casaplotms
Takeshi Nakazato Takeshi Nakazato 72a7ccba00dc38eccb998be7cc6a99f464e61d2e Merge branch 'master' into CAS-14875

Tests

New test failures 1
Status Test View job Duration
Collapse Failed test_task_gencal gencal_eoptest.test_eop
Test Tasks Many Linux 2.28 Rocky 8.10 Py3.12 < 1 sec
AssertionError: False is not true
test_task_gencal.py:911: in test_eop
    self.assertTrue(th.compTables(caltab, reference, ['WEIGHT'], [0.001, 1e-14], mode="both"))
E   AssertionError: False is not true
Existing test failures 1
Status Test Failing since View job Duration
AssertionError: 220295510184.34296 != 220295510184.3427
test_tool_synthesisutils.py:478: in test_su_advisechansel_getfreqrange_ephem
    self.assertEqual(res['freqstart']['value'], refdict['freqstart']['value'])
E   AssertionError: 220295510184.34296 != 220295510184.3427

Jira issues

IssueDescriptionStatus
5 more issues…
Unknown Issue TypeCAS-14194Could not obtain issue details from Jira
Unknown Issue TypeCAS-14708Could not obtain issue details from Jira
Unknown Issue TypeCAS-14806Could not obtain issue details from Jira
Unknown Issue TypeCAS-14812Could not obtain issue details from Jira
Unknown Issue TypeCAS-14827Could not obtain issue details from Jira