Test Tools and Tasks using https://go.nrao.edu/iers/

Build: #4 failed

Job: Test Tasks Many Linux 2.28 Rocky 8.10 Py3.12 failed

Build log

The build generated 1,170 lines of output.   The output is too long and has been truncated to the last 1,000 lines. Download or view full build log.

05-Oct-2026 12:26:15 Requirement already satisfied: numpy in /home/casatest/venv/lib/python3.12/site-packages (from casatools==6.7.7.11) (2.5.3)
05-Oct-2026 12:26:15 Collecting casaconfig (from casatools==6.7.7.11)
05-Oct-2026 12:26:15   Downloading casaconfig-1.5.2-py3-none-any.whl.metadata (4.0 kB)
05-Oct-2026 12:26:15 Collecting certifi>=2023.5.7 (from casaconfig->casatools==6.7.7.11)
05-Oct-2026 12:26:15   Downloading certifi-2026.7.22-py3-none-any.whl.metadata (2.5 kB)
05-Oct-2026 12:26:15 Downloading casaconfig-1.5.2-py3-none-any.whl (77 kB)
05-Oct-2026 12:26:15 Downloading certifi-2026.7.22-py3-none-any.whl (136 kB)
05-Oct-2026 12:26:15 Installing collected packages: certifi, casaconfig, casatools
05-Oct-2026 12:26:16
05-Oct-2026 12:26:16 Successfully installed casaconfig-1.5.2 casatools-6.7.7.11 certifi-2026.7.22
05-Oct-2026 12:26:17 Processing ./casatasks-6.7.7.11-py3-none-any.whl
05-Oct-2026 12:26:17 Requirement already satisfied: casatools==6.7.7.11 in /home/casatest/venv/lib/python3.12/site-packages (from casatasks==6.7.7.11) (6.7.7.11)
05-Oct-2026 12:26:17 Requirement already satisfied: matplotlib in /home/casatest/venv/lib/python3.12/site-packages (from casatasks==6.7.7.11) (3.11.2)
05-Oct-2026 12:26:17 Requirement already satisfied: scipy in /home/casatest/venv/lib/python3.12/site-packages (from casatasks==6.7.7.11) (1.18.1)
05-Oct-2026 12:26:17 Requirement already satisfied: certifi in /home/casatest/venv/lib/python3.12/site-packages (from casatasks==6.7.7.11) (2026.7.22)
05-Oct-2026 12:26:17 Requirement already satisfied: pyerfa in /home/casatest/venv/lib/python3.12/site-packages (from casatasks==6.7.7.11) (2.0.1.5)
05-Oct-2026 12:26:17 Requirement already satisfied: numpy in /home/casatest/venv/lib/python3.12/site-packages (from casatools==6.7.7.11->casatasks==6.7.7.11) (2.5.3)
05-Oct-2026 12:26:17 Requirement already satisfied: casaconfig in /home/casatest/venv/lib/python3.12/site-packages (from casatools==6.7.7.11->casatasks==6.7.7.11) (1.5.2)
05-Oct-2026 12:26:17 Requirement already satisfied: contourpy>=1.0.1 in /home/casatest/venv/lib/python3.12/site-packages (from matplotlib->casatasks==6.7.7.11) (1.4.0)
05-Oct-2026 12:26:17 Requirement already satisfied: cycler>=0.10 in /home/casatest/venv/lib/python3.12/site-packages (from matplotlib->casatasks==6.7.7.11) (0.12.1)
05-Oct-2026 12:26:17 Requirement already satisfied: fonttools>=4.28.2 in /home/casatest/venv/lib/python3.12/site-packages (from matplotlib->casatasks==6.7.7.11) (4.66.1)
05-Oct-2026 12:26:17 Requirement already satisfied: kiwisolver>=1.3.1 in /home/casatest/venv/lib/python3.12/site-packages (from matplotlib->casatasks==6.7.7.11) (1.5.1)
05-Oct-2026 12:26:17 Requirement already satisfied: packaging>=20.0 in /home/casatest/venv/lib/python3.12/site-packages (from matplotlib->casatasks==6.7.7.11) (26.3)
05-Oct-2026 12:26:17 Requirement already satisfied: pillow>=9 in /home/casatest/venv/lib/python3.12/site-packages (from matplotlib->casatasks==6.7.7.11) (12.3.0)
05-Oct-2026 12:26:17 Requirement already satisfied: pyparsing>=3 in /home/casatest/venv/lib/python3.12/site-packages (from matplotlib->casatasks==6.7.7.11) (3.3.3)
05-Oct-2026 12:26:17 Requirement already satisfied: python-dateutil>=2.7 in /home/casatest/venv/lib/python3.12/site-packages (from matplotlib->casatasks==6.7.7.11) (2.9.0.post0)
05-Oct-2026 12:26:17 Requirement already satisfied: six>=1.5 in /home/casatest/venv/lib/python3.12/site-packages (from python-dateutil>=2.7->matplotlib->casatasks==6.7.7.11) (1.17.0)
05-Oct-2026 12:26:17 Installing collected packages: casatasks
05-Oct-2026 12:26:17 Successfully installed casatasks-6.7.7.11
05-Oct-2026 12:26:18 Checking for updates into /home/casatest/data/measures
05-Oct-2026 12:26:18 pull_data using version casarundata-2026.02.19-1.tar.gz, acquiring the lock ...
05-Oct-2026 12:26:21 downloading casarundata contents to  /home/casatest/data/measures (336M) ... done
05-Oct-2026 12:26:22 casarundata installed casarundata-2026.02.19-1.tar.gz at /home/casatest/data/measures
05-Oct-2026 12:27:09 measures_update ... acquiring the lock ...
05-Oct-2026 12:27:09 A measures update has been requested by the force argument
05-Oct-2026 12:27:09   ... finding available measures ...
05-Oct-2026 12:27:09   ... downloading NRAO_Measures_20261004-140454.ztar from https://go.nrao.edu/iers/ to /home/casatest/data/measures ...
05-Oct-2026 12:27:09   ... measures data updated at /home/casatest/data/measures
05-Oct-2026 12:27:09 Runtest command: python3.12 runtest.py --ignore_list 'test_casampi,test_task_msview,test_task_imview,test_task_plotms' -t /home/casatest/casa6/casatasks/tests/tasks,/home/casatest/casa6/casatasks/tests/scripts -e /home/casatest/casa6/casatestutils/casatestutils/component_to_test_map.json -j gencal 2>&1 | tee casatasks_test.log
05-Oct-2026 12:29:16 Already on 'master'
05-Oct-2026 12:29:16 Your branch is up to date with 'origin/master'.
05-Oct-2026 12:29:16 LICENSE
05-Oct-2026 12:29:16 README.md
05-Oct-2026 12:29:16 __init__.py
05-Oct-2026 12:29:16 casatestutils
05-Oct-2026 12:29:16 pyproject.toml
05-Oct-2026 12:29:16 runtest.py
05-Oct-2026 12:29:16 setup.py
05-Oct-2026 12:29:16 testrunner
05-Oct-2026 12:29:16 tests
05-Oct-2026 12:29:16 version
05-Oct-2026 12:29:16 xmlrunner_to_junit.py
05-Oct-2026 12:29:16 ============================= test session starts ==============================
05-Oct-2026 12:29:16 platform linux -- Python 3.12.9, pytest-9.1.1, pluggy-1.6.0 -- /home/casatest/venv/bin/python3.12
05-Oct-2026 12:29:16 cachedir: .pytest_cache
05-Oct-2026 12:29:16 rootdir: /home/casatest/casa6/casatestutils/nosedir/test_task_gencal
05-Oct-2026 12:29:16 configfile: pytest.ini
05-Oct-2026 12:29:17 collecting ... gencal tests will use data from /opt/casa/data/casatestdata//unittest/gencal/
05-Oct-2026 12:29:17 collected 28 items
05-Oct-2026 12:29:17
05-Oct-2026 12:29:17
05-Oct-2026 12:29:22 test_task_gencal.py::gencal_antpostest::test_antpos_auto_evla
05-Oct-2026 12:29:22 Test automated antenna position correction.
05-Oct-2026 12:29:22
05-Oct-2026 12:29:22 Testing column TIME
05-Oct-2026 12:29:22 Column TIME PASSED
05-Oct-2026 12:29:22
05-Oct-2026 12:29:22 Testing column FIELD_ID
05-Oct-2026 12:29:22 Column FIELD_ID PASSED
05-Oct-2026 12:29:22
05-Oct-2026 12:29:22 Testing column SPECTRAL_WINDOW_ID
05-Oct-2026 12:29:22 Column SPECTRAL_WINDOW_ID PASSED
05-Oct-2026 12:29:22
05-Oct-2026 12:29:22 Testing column ANTENNA1
05-Oct-2026 12:29:22 Column ANTENNA1 PASSED
05-Oct-2026 12:29:22
05-Oct-2026 12:29:22 Testing column ANTENNA2
05-Oct-2026 12:29:22 Column ANTENNA2 PASSED
05-Oct-2026 12:29:22
05-Oct-2026 12:29:22 Testing column INTERVAL
05-Oct-2026 12:29:22 Column INTERVAL PASSED
05-Oct-2026 12:29:22
05-Oct-2026 12:29:22 Testing column SCAN_NUMBER
05-Oct-2026 12:29:22 Column SCAN_NUMBER PASSED
05-Oct-2026 12:29:22
05-Oct-2026 12:29:22 Testing column FPARAM
05-Oct-2026 12:29:22 Column FPARAM PASSED
05-Oct-2026 12:29:22
05-Oct-2026 12:29:22 Testing column PARAMERR
05-Oct-2026 12:29:22 Column PARAMERR PASSED
05-Oct-2026 12:29:22
05-Oct-2026 12:29:22 Testing column FLAG
05-Oct-2026 12:29:22 Column FLAG PASSED
05-Oct-2026 12:29:22
05-Oct-2026 12:29:22 Testing column SNR
05-Oct-2026 12:29:22 Column SNR PASSED
05-Oct-2026 12:29:22 PASSED
05-Oct-2026 12:29:22
05-Oct-2026 12:29:26 test_task_gencal.py::gencal_antpostest::test_antpos_auto_evla_CAS13057
05-Oct-2026 12:29:26 gencal: test a bugfix of CAS-13057 for automated antenna position correction
05-Oct-2026 12:29:26
05-Oct-2026 12:29:26 Testing column TIME
05-Oct-2026 12:29:26 Column TIME PASSED
05-Oct-2026 12:29:26
05-Oct-2026 12:29:26 Testing column FIELD_ID
05-Oct-2026 12:29:26 Column FIELD_ID PASSED
05-Oct-2026 12:29:26
05-Oct-2026 12:29:26 Testing column SPECTRAL_WINDOW_ID
05-Oct-2026 12:29:26 Column SPECTRAL_WINDOW_ID PASSED
05-Oct-2026 12:29:26
05-Oct-2026 12:29:26 Testing column ANTENNA1
05-Oct-2026 12:29:26 Column ANTENNA1 PASSED
05-Oct-2026 12:29:26
05-Oct-2026 12:29:26 Testing column ANTENNA2
05-Oct-2026 12:29:26 Column ANTENNA2 PASSED
05-Oct-2026 12:29:26
05-Oct-2026 12:29:26 Testing column INTERVAL
05-Oct-2026 12:29:26 Column INTERVAL PASSED
05-Oct-2026 12:29:26
05-Oct-2026 12:29:26 Testing column SCAN_NUMBER
05-Oct-2026 12:29:26 Column SCAN_NUMBER PASSED
05-Oct-2026 12:29:26
05-Oct-2026 12:29:26 Testing column PARAMERR
05-Oct-2026 12:29:26 Column PARAMERR PASSED
05-Oct-2026 12:29:26
05-Oct-2026 12:29:26 Testing column FLAG
05-Oct-2026 12:29:26 Column FLAG PASSED
05-Oct-2026 12:29:26
05-Oct-2026 12:29:26 Testing column SNR
05-Oct-2026 12:29:26 Column SNR PASSED
05-Oct-2026 12:29:26 PASSED
05-Oct-2026 12:29:26
05-Oct-2026 12:29:26 test_task_gencal.py::gencal_antpostest::test_antpos_manual
05-Oct-2026 12:29:26 Test manual antenna position correction.
05-Oct-2026 12:29:26
05-Oct-2026 12:29:26 Testing column TIME
05-Oct-2026 12:29:26 Column TIME PASSED
05-Oct-2026 12:29:26
05-Oct-2026 12:29:26 Testing column FIELD_ID
05-Oct-2026 12:29:26 Column FIELD_ID PASSED
05-Oct-2026 12:29:26
05-Oct-2026 12:29:26 Testing column SPECTRAL_WINDOW_ID
05-Oct-2026 12:29:26 Column SPECTRAL_WINDOW_ID PASSED
05-Oct-2026 12:29:26
05-Oct-2026 12:29:26 Testing column ANTENNA1
05-Oct-2026 12:29:26 Column ANTENNA1 PASSED
05-Oct-2026 12:29:26
05-Oct-2026 12:29:26 Testing column ANTENNA2
05-Oct-2026 12:29:26 Column ANTENNA2 PASSED
05-Oct-2026 12:29:26
05-Oct-2026 12:29:26 Testing column INTERVAL
05-Oct-2026 12:29:26 Column INTERVAL PASSED
05-Oct-2026 12:29:26
05-Oct-2026 12:29:26 Testing column SCAN_NUMBER
05-Oct-2026 12:29:26 Column SCAN_NUMBER PASSED
05-Oct-2026 12:29:26
05-Oct-2026 12:29:26 Testing column FPARAM
05-Oct-2026 12:29:26 Column FPARAM PASSED
05-Oct-2026 12:29:26
05-Oct-2026 12:29:26 Testing column PARAMERR
05-Oct-2026 12:29:26 Column PARAMERR PASSED
05-Oct-2026 12:29:26
05-Oct-2026 12:29:26 Testing column FLAG
05-Oct-2026 12:29:26 Column FLAG PASSED
05-Oct-2026 12:29:26
05-Oct-2026 12:29:26 Testing column SNR
05-Oct-2026 12:29:26 Column SNR PASSED
05-Oct-2026 12:29:26 PASSED
05-Oct-2026 12:29:26
05-Oct-2026 12:29:33 test_task_gencal.py::gencal_antpostest::test_antpos_manual_time_limit_evla
05-Oct-2026 12:29:33 gencal: test if time limit sets cutoff date for antpos corrections
05-Oct-2026 12:29:33 PASSED
05-Oct-2026 12:29:33
05-Oct-2026 12:29:33 test_task_gencal.py::test_gencal_antpos_alma::test_antpos_alma_empty 2026-10-05 16:29:33        SEVERE        gencal::::casa        Task gencal raised an exception of class ValueError with the following message: The list of antenna positions in JSON file is empty
05-Oct-2026 12:29:33
05-Oct-2026 12:29:33 This test checks that an exception is thrown
05-Oct-2026 12:29:33 if the name of any of the antennas in the JSON file
05-Oct-2026 12:29:33 is not found in the MS
05-Oct-2026 12:29:33 PASSED
05-Oct-2026 12:29:33
05-Oct-2026 12:29:35 test_task_gencal.py::test_gencal_antpos_alma::test_antpos_alma_fake_positions
05-Oct-2026 12:29:35 This test uses a MS that has been hand-crafted to be a
05-Oct-2026 12:29:35 point source model distorted with the known phases
05-Oct-2026 12:29:35 that a displacement in the antenna positions would cause.
05-Oct-2026 12:29:35 Then, the right positions are used in gencal to generate
05-Oct-2026 12:29:35 a calibration table. Those positions are input in a JSON
05-Oct-2026 12:29:35 file created by create_fake_antenna_json().
05-Oct-2026 12:29:35
05-Oct-2026 12:29:35 Testing column TIME
05-Oct-2026 12:29:35 Column TIME PASSED
05-Oct-2026 12:29:35
05-Oct-2026 12:29:35 Testing column FIELD_ID
05-Oct-2026 12:29:35 Column FIELD_ID PASSED
05-Oct-2026 12:29:35
05-Oct-2026 12:29:35 Testing column SPECTRAL_WINDOW_ID
05-Oct-2026 12:29:35 Column SPECTRAL_WINDOW_ID PASSED
05-Oct-2026 12:29:35
05-Oct-2026 12:29:35 Testing column ANTENNA1
05-Oct-2026 12:29:35 Column ANTENNA1 PASSED
05-Oct-2026 12:29:35
05-Oct-2026 12:29:35 Testing column ANTENNA2
05-Oct-2026 12:29:35 Column ANTENNA2 PASSED
05-Oct-2026 12:29:35
05-Oct-2026 12:29:35 Testing column INTERVAL
05-Oct-2026 12:29:35 Column INTERVAL PASSED
05-Oct-2026 12:29:35
05-Oct-2026 12:29:35 Testing column SCAN_NUMBER
05-Oct-2026 12:29:35 Column SCAN_NUMBER PASSED
05-Oct-2026 12:29:35
05-Oct-2026 12:29:35 Testing column OBSERVATION_ID
05-Oct-2026 12:29:35 Column OBSERVATION_ID PASSED
05-Oct-2026 12:29:35
05-Oct-2026 12:29:35 Testing column FPARAM
05-Oct-2026 12:29:35 Column FPARAM PASSED
05-Oct-2026 12:29:35
05-Oct-2026 12:29:35 Testing column PARAMERR
05-Oct-2026 12:29:35 Column PARAMERR PASSED
05-Oct-2026 12:29:35
05-Oct-2026 12:29:35 Testing column FLAG
05-Oct-2026 12:29:35 Column FLAG PASSED
05-Oct-2026 12:29:35
05-Oct-2026 12:29:35 Testing column SNR
05-Oct-2026 12:29:35 Column SNR PASSED
05-Oct-2026 12:29:35 PASSED
05-Oct-2026 12:29:35
05-Oct-2026 12:29:35 test_task_gencal.py::test_gencal_antpos_alma::test_antpos_alma_non_existing_antenna 2026-10-05 16:29:36        SEVERE        gencal::::casa        Task gencal raised an exception of class ValueError with the following message: Antenna NON_EXISTENT could not be found in input MS
05-Oct-2026 12:29:35
05-Oct-2026 12:29:35 This test checks that an exception is thrown
05-Oct-2026 12:29:35 if the name of any of the antennas in the JSON file
05-Oct-2026 12:29:35 is not found in the MS
05-Oct-2026 12:29:35 PASSED
05-Oct-2026 12:29:35
05-Oct-2026 12:29:35 test_task_gencal.py::test_gencal_antpos_alma::test_antpos_alma_notalma 2026-10-05 16:29:36        SEVERE        gencal::::casa        Task gencal raised an exception of class ValueError with the following message: JSON file with antenna positions is not from ALMA. This is currently not supported
05-Oct-2026 12:29:35
05-Oct-2026 12:29:35 This test checks when the JSON file is used there are
05-Oct-2026 12:29:35 no other parameters being set like the antenna parameter
05-Oct-2026 12:29:35 PASSED
05-Oct-2026 12:29:35
05-Oct-2026 12:29:35 test_task_gencal.py::test_gencal_antpos_alma::test_antpos_alma_overspecify 2026-10-05 16:29:36        SEVERE        gencal::::casa        Task gencal raised an exception of class ValueError with the following message: When using infile for ALMA the caltype is antpos, antenna, pol and parameter must be empty
05-Oct-2026 12:29:35 2026-10-05 16:29:36        SEVERE        gencal::::casa        Task gencal raised an exception of class ValueError with the following message: When using infile for ALMA the caltype is antpos, antenna, pol and parameter must be empty
05-Oct-2026 12:29:35 2026-10-05 16:29:36        SEVERE        gencal::::casa        Task gencal raised an exception of class ValueError with the following message: When using infile for ALMA the caltype is antpos, antenna, pol and parameter must be empty
05-Oct-2026 12:29:35
05-Oct-2026 12:29:35 This test checks when the JSON file is used there are
05-Oct-2026 12:29:35 no other parameters being set like the antenna parameter
05-Oct-2026 12:29:35 PASSED
05-Oct-2026 12:29:35
05-Oct-2026 12:29:36 test_task_gencal.py::gencal_test_tec_vla::test_tec_maps
05-Oct-2026 12:29:36 gencal: very basic test of tec_maps and gencal(caltype='tecim')
05-Oct-2026 12:29:36 IGS files required for: ['2010/04/26']
05-Oct-2026 12:29:36
05-Oct-2026 12:29:36 For 2010/04/26, the required IGS file is called: igsg1160.10i
05-Oct-2026 12:29:36 Attempting retrieval of IGS Final product file: igsg1160.10i.Z
05-Oct-2026 12:29:36 Transforming IONEX data format to a TEC/DTEC array for 2010/04/26
05-Oct-2026 12:29:36 Making image: tdem0003gencal.ms.IGS_TEC.im
05-Oct-2026 12:29:36 Making image: tdem0003gencal.ms.IGS_RMS_TEC.im
05-Oct-2026 12:29:36 The following TEC map was generated: tdem0003gencal.ms.IGS_TEC.im & tdem0003gencal.ms.IGS_RMS_TEC.im
05-Oct-2026 12:29:36
05-Oct-2026 12:29:36 For 2023/12/01, the required IGS file is called: IGS0OPSFIN_20233350000_01D_02H_GIM.INX
05-Oct-2026 12:29:36 Attempting retrieval of IGS Final product file: IGS0OPSFIN_20233350000_01D_02H_GIM.INX.gz
05-Oct-2026 12:29:36 Transforming IONEX data format to a TEC/DTEC array for 2023/12/01
05-Oct-2026 12:29:36 PASSED
05-Oct-2026 12:29:36
05-Oct-2026 12:29:37 test_task_gencal.py::gencal_gaincurve_test::test_gainCurveVLA
05-Oct-2026 12:29:37 Test calibration table produced when gencal is run on a *VLA* MS and relying on data/nrao/VLA/GainCurves 
05-Oct-2026 12:29:37
05-Oct-2026 12:29:37 Testing column TIME
05-Oct-2026 12:29:37 Column TIME PASSED
05-Oct-2026 12:29:37
05-Oct-2026 12:29:37 Testing column FIELD_ID
05-Oct-2026 12:29:37 Column FIELD_ID PASSED
05-Oct-2026 12:29:37
05-Oct-2026 12:29:37 Testing column SPECTRAL_WINDOW_ID
05-Oct-2026 12:29:37 Column SPECTRAL_WINDOW_ID PASSED
05-Oct-2026 12:29:37
05-Oct-2026 12:29:37 Testing column ANTENNA1
05-Oct-2026 12:29:37 Column ANTENNA1 PASSED
05-Oct-2026 12:29:37
05-Oct-2026 12:29:37 Testing column ANTENNA2
05-Oct-2026 12:29:37 Column ANTENNA2 PASSED
05-Oct-2026 12:29:37
05-Oct-2026 12:29:37 Testing column INTERVAL
05-Oct-2026 12:29:37 Column INTERVAL PASSED
05-Oct-2026 12:29:37
05-Oct-2026 12:29:37 Testing column SCAN_NUMBER
05-Oct-2026 12:29:37 Column SCAN_NUMBER PASSED
05-Oct-2026 12:29:37
05-Oct-2026 12:29:37 Testing column OBSERVATION_ID
05-Oct-2026 12:29:37 Column OBSERVATION_ID PASSED
05-Oct-2026 12:29:37
05-Oct-2026 12:29:37 Testing column FPARAM
05-Oct-2026 12:29:37 Column FPARAM PASSED
05-Oct-2026 12:29:37
05-Oct-2026 12:29:37 Testing column PARAMERR
05-Oct-2026 12:29:37 Column PARAMERR PASSED
05-Oct-2026 12:29:37
05-Oct-2026 12:29:37 Testing column FLAG
05-Oct-2026 12:29:37 Column FLAG PASSED
05-Oct-2026 12:29:37
05-Oct-2026 12:29:37 Testing column SNR
05-Oct-2026 12:29:37 Column SNR PASSED
05-Oct-2026 12:29:37 PASSED
05-Oct-2026 12:29:37
05-Oct-2026 12:29:37 test_task_gencal.py::gencal_gaincurve_test::test_gainCurveVLBA
05-Oct-2026 12:29:37 Test calibration table produced when gencal is run on a VLBA MS with an internal GAIN_CURVE table 
05-Oct-2026 12:29:37
05-Oct-2026 12:29:37 Testing column TIME
05-Oct-2026 12:29:37 Column TIME PASSED
05-Oct-2026 12:29:37
05-Oct-2026 12:29:37 Testing column FIELD_ID
05-Oct-2026 12:29:37 Column FIELD_ID PASSED
05-Oct-2026 12:29:37
05-Oct-2026 12:29:37 Testing column SPECTRAL_WINDOW_ID
05-Oct-2026 12:29:37 Column SPECTRAL_WINDOW_ID PASSED
05-Oct-2026 12:29:37
05-Oct-2026 12:29:37 Testing column ANTENNA1
05-Oct-2026 12:29:37 Column ANTENNA1 PASSED
05-Oct-2026 12:29:37
05-Oct-2026 12:29:37 Testing column ANTENNA2
05-Oct-2026 12:29:37 Column ANTENNA2 PASSED
05-Oct-2026 12:29:37
05-Oct-2026 12:29:37 Testing column INTERVAL
05-Oct-2026 12:29:37 Column INTERVAL PASSED
05-Oct-2026 12:29:37
05-Oct-2026 12:29:37 Testing column SCAN_NUMBER
05-Oct-2026 12:29:37 Column SCAN_NUMBER PASSED
05-Oct-2026 12:29:37
05-Oct-2026 12:29:37 Testing column OBSERVATION_ID
05-Oct-2026 12:29:37 Column OBSERVATION_ID PASSED
05-Oct-2026 12:29:37
05-Oct-2026 12:29:37 Testing column FPARAM
05-Oct-2026 12:29:37 Column FPARAM PASSED
05-Oct-2026 12:29:37
05-Oct-2026 12:29:37 Testing column PARAMERR
05-Oct-2026 12:29:37 Column PARAMERR PASSED
05-Oct-2026 12:29:37
05-Oct-2026 12:29:37 Testing column FLAG
05-Oct-2026 12:29:37 Column FLAG PASSED
05-Oct-2026 12:29:37
05-Oct-2026 12:29:37 Testing column SNR
05-Oct-2026 12:29:37 Column SNR PASSED
05-Oct-2026 12:29:37 PASSED
05-Oct-2026 12:29:37
05-Oct-2026 12:29:37 test_task_gencal.py::gencal_gaincurve_test::test_noGainCurveEVN 2026-10-05 16:29:37        SEVERE        Calibrater::specifycal        Caught Exception: Automatic gain curve not supported for EVN
05-Oct-2026 12:29:37 2026-10-05 16:29:37        SEVERE                Exception Reported: Error in Calibrater::specifycal.
05-Oct-2026 12:29:37 2026-10-05 16:29:37        SEVERE        gencal::::casa        Task gencal raised an exception of class RuntimeError with the following message: Error in Calibrater::specifycal.
05-Oct-2026 12:29:37
05-Oct-2026 12:29:37 Test that when gencal is run on an EVN MS with no GAIN_CURVE table it creates no calibration table 
05-Oct-2026 12:29:37 PASSED
05-Oct-2026 12:29:37
05-Oct-2026 12:29:37 test_task_gencal.py::gencal_tsys_test::test_tsys 2026-10-05 16:29:37        WARN                  Tsys data for ant id=6 (pol=1) in spw 0 at t=2008/03/10/17:06:18.0 are all negative or zero will be entirely flagged.
05-Oct-2026 12:29:37 2026-10-05 16:29:37        WARN                  Tsys data for ant id=6 (pol=1) in spw 1 at t=2008/03/10/17:09:18.0 are all negative or zero will be entirely flagged.
05-Oct-2026 12:29:37 2026-10-05 16:29:37        WARN                  Tsys data for ant id=6 (pol=1) in spw 1 at t=2008/03/10/17:09:33.0 are all negative or zero will be entirely flagged.
05-Oct-2026 12:29:37 2026-10-05 16:29:37        WARN                  Tsys data for ant id=6 (pol=1) in spw 1 at t=2008/03/10/17:09:48.0 are all negative or zero will be entirely flagged.
05-Oct-2026 12:29:37 2026-10-05 16:29:37        WARN                  Tsys data for ant id=6 (pol=1) in spw 0 at t=2008/03/10/17:25:18.0 are all negative or zero will be entirely flagged.
05-Oct-2026 12:29:37 2026-10-05 16:29:37        WARN                  Tsys data for ant id=6 (pol=1) in spw 1 at t=2008/03/10/17:27:03.0 are all negative or zero will be entirely flagged.
05-Oct-2026 12:29:37 2026-10-05 16:29:38        WARN                  Tsys data for ant id=6 (pol=1) in spw 2 at t=2008/03/10/17:58:18.0 are all negative or zero will be entirely flagged.
05-Oct-2026 12:29:37 2026-10-05 16:29:38        WARN                  Tsys data for ant id=6 (pol=1) in spw 1 at t=2008/03/10/18:09:03.0 are all negative or zero will be entirely flagged.
05-Oct-2026 12:29:37 2026-10-05 16:29:38        WARN                  Tsys data for ant id=6 (pol=1) in spw 1 at t=2008/03/10/18:09:18.0 are all negative or zero will be entirely flagged.
05-Oct-2026 12:29:37 2026-10-05 16:29:38        WARN                  Tsys data for ant id=6 (pol=1) in spw 0 at t=2008/03/10/18:10:03.0 are all negative or zero will be entirely flagged.
05-Oct-2026 12:29:37 2026-10-05 16:29:38        WARN                  Tsys data for ant id=6 (pol=1) in spw 0 at t=2008/03/10/18:19:19.0 are all negative or zero will be entirely flagged.
05-Oct-2026 12:29:37 2026-10-05 16:29:38        WARN                  Tsys data for ant id=6 (pol=1) in spw 1 at t=2008/03/10/18:19:19.0 are all negative or zero will be entirely flagged.
05-Oct-2026 12:29:37 2026-10-05 16:29:38        WARN                  Tsys data for ant id=6 (pol=1) in spw 2 at t=2008/03/10/18:19:19.0 are all negative or zero will be entirely flagged.
05-Oct-2026 12:29:37 2026-10-05 16:29:38        WARN                  Tsys data for ant id=6 (pol=1) in spw 3 at t=2008/03/10/18:19:19.0 are all negative or zero will be entirely flagged.
05-Oct-2026 12:29:37 2026-10-05 16:29:38        WARN                  Tsys data for ant id=6 (pol=1) in spw 1 at t=2008/03/10/18:30:03.0 are all negative or zero will be entirely flagged.
05-Oct-2026 12:29:37 2026-10-05 16:29:38        WARN                  Tsys data for ant id=6 (pol=1) in spw 0 at t=2008/03/10/18:30:18.0 are all negative or zero will be entirely flagged.
05-Oct-2026 12:29:37 2026-10-05 16:29:38        WARN                  Tsys data for ant id=6 (pol=1) in spw 3 at t=2008/03/10/18:37:06.0 are all negative or zero will be entirely flagged.
05-Oct-2026 12:29:37 2026-10-05 16:29:38        WARN                  Tsys data for ant id=6 (pol=1) in spw 0 at t=2008/03/10/18:40:21.0 are all negative or zero will be entirely flagged.
05-Oct-2026 12:29:37 2026-10-05 16:29:38        WARN                  Tsys data for ant id=6 (pol=1) in spw 0 at t=2008/03/10/18:50:21.0 are all negative or zero will be entirely flagged.
05-Oct-2026 12:29:37 2026-10-05 16:29:38        WARN                  Tsys data for ant id=6 (pol=1) in spw 1 at t=2008/03/10/18:50:21.0 are all negative or zero will be entirely flagged.
05-Oct-2026 12:29:37 2026-10-05 16:29:38        WARN                  Tsys data for ant id=6 (pol=1) in spw 2 at t=2008/03/10/18:50:21.0 are all negative or zero will be entirely flagged.
05-Oct-2026 12:29:37 2026-10-05 16:29:38        WARN                  Tsys data for ant id=6 (pol=1) in spw 3 at t=2008/03/10/18:50:21.0 are all negative or zero will be entirely flagged.
05-Oct-2026 12:29:37 2026-10-05 16:29:38        WARN                  Tsys data for ant id=6 (pol=1) in spw 3 at t=2008/03/10/18:51:06.0 are all negative or zero will be entirely flagged.
05-Oct-2026 12:29:38 2026-10-05 16:29:38        WARN                  Tsys data for ant id=9 (pol=1) in spw 0 at t=2008/03/10/18:56:46.0 are all negative or zero will be entirely flagged.
05-Oct-2026 12:29:38
05-Oct-2026 12:29:38 Test calibration table produced when gencal is run on an MS with a SYSCAL table
05-Oct-2026 12:29:38
05-Oct-2026 12:29:38 Testing column TIME
05-Oct-2026 12:29:38 Column TIME PASSED
05-Oct-2026 12:29:38
05-Oct-2026 12:29:38 Testing column FIELD_ID
05-Oct-2026 12:29:38 Column FIELD_ID PASSED
05-Oct-2026 12:29:38
05-Oct-2026 12:29:38 Testing column SPECTRAL_WINDOW_ID
05-Oct-2026 12:29:38 Column SPECTRAL_WINDOW_ID PASSED
05-Oct-2026 12:29:38
05-Oct-2026 12:29:38 Testing column ANTENNA1
05-Oct-2026 12:29:38 Column ANTENNA1 PASSED
05-Oct-2026 12:29:38
05-Oct-2026 12:29:38 Testing column ANTENNA2
05-Oct-2026 12:29:38 Column ANTENNA2 PASSED
05-Oct-2026 12:29:38
05-Oct-2026 12:29:38 Testing column INTERVAL
05-Oct-2026 12:29:38 Column INTERVAL PASSED
05-Oct-2026 12:29:38
05-Oct-2026 12:29:38 Testing column SCAN_NUMBER
05-Oct-2026 12:29:38 Column SCAN_NUMBER PASSED
05-Oct-2026 12:29:38
05-Oct-2026 12:29:38 Testing column OBSERVATION_ID
05-Oct-2026 12:29:38 Column OBSERVATION_ID PASSED
05-Oct-2026 12:29:38
05-Oct-2026 12:29:38 Testing column FPARAM
05-Oct-2026 12:29:38 Column FPARAM PASSED
05-Oct-2026 12:29:38
05-Oct-2026 12:29:38 Testing column PARAMERR
05-Oct-2026 12:29:38 Column PARAMERR PASSED
05-Oct-2026 12:29:38
05-Oct-2026 12:29:38 Testing column FLAG
05-Oct-2026 12:29:38 Column FLAG PASSED
05-Oct-2026 12:29:38
05-Oct-2026 12:29:38 Testing column SNR
05-Oct-2026 12:29:38 Column SNR PASSED
05-Oct-2026 12:29:38 PASSED
05-Oct-2026 12:29:38
05-Oct-2026 12:29:38 test_task_gencal.py::gencal_tsys_test::test_tsys_nan 2026-10-05 16:29:39        WARN                  Tsys data for ant id=6 (pol=1) in spw 0 at t=2008/03/10/17:06:18.0 are all negative or zero will be entirely flagged.
05-Oct-2026 12:29:38 2026-10-05 16:29:39        WARN                  Tsys data for ant id=6 (pol=1) in spw 1 at t=2008/03/10/17:09:18.0 are all negative or zero will be entirely flagged.
05-Oct-2026 12:29:38 2026-10-05 16:29:39        WARN                  Tsys data for ant id=6 (pol=1) in spw 1 at t=2008/03/10/17:09:33.0 are all negative or zero will be entirely flagged.
05-Oct-2026 12:29:38 2026-10-05 16:29:39        WARN                  Tsys data for ant id=6 (pol=1) in spw 1 at t=2008/03/10/17:09:48.0 are all negative or zero will be entirely flagged.
05-Oct-2026 12:29:38 2026-10-05 16:29:39        WARN                  Tsys data for ant id=6 (pol=1) in spw 0 at t=2008/03/10/17:25:18.0 are all negative or zero will be entirely flagged.
05-Oct-2026 12:29:38 2026-10-05 16:29:39        WARN                  Tsys data for ant id=6 (pol=1) in spw 1 at t=2008/03/10/17:27:03.0 are all negative or zero will be entirely flagged.
05-Oct-2026 12:29:39 2026-10-05 16:29:39        WARN                  Tsys data for ant id=6 (pol=1) in spw 2 at t=2008/03/10/17:58:18.0 are all negative or zero will be entirely flagged.
05-Oct-2026 12:29:39 2026-10-05 16:29:39        WARN                  Tsys data for ant id=6 (pol=1) in spw 1 at t=2008/03/10/18:09:03.0 are all negative or zero will be entirely flagged.
05-Oct-2026 12:29:39 2026-10-05 16:29:39        WARN                  Tsys data for ant id=6 (pol=1) in spw 1 at t=2008/03/10/18:09:18.0 are all negative or zero will be entirely flagged.
05-Oct-2026 12:29:39 2026-10-05 16:29:39        WARN                  Tsys data for ant id=6 (pol=1) in spw 0 at t=2008/03/10/18:10:03.0 are all negative or zero will be entirely flagged.
05-Oct-2026 12:29:39 2026-10-05 16:29:39        WARN                  Tsys data for ant id=6 (pol=1) in spw 0 at t=2008/03/10/18:19:19.0 are all negative or zero will be entirely flagged.
05-Oct-2026 12:29:39 2026-10-05 16:29:39        WARN                  Tsys data for ant id=6 (pol=1) in spw 1 at t=2008/03/10/18:19:19.0 are all negative or zero will be entirely flagged.
05-Oct-2026 12:29:39 2026-10-05 16:29:39        WARN                  Tsys data for ant id=6 (pol=1) in spw 2 at t=2008/03/10/18:19:19.0 are all negative or zero will be entirely flagged.
05-Oct-2026 12:29:39 2026-10-05 16:29:39        WARN                  Tsys data for ant id=6 (pol=1) in spw 3 at t=2008/03/10/18:19:19.0 are all negative or zero will be entirely flagged.
05-Oct-2026 12:29:39 2026-10-05 16:29:39        WARN                  Tsys data for ant id=6 (pol=1) in spw 1 at t=2008/03/10/18:30:03.0 are all negative or zero will be entirely flagged.
05-Oct-2026 12:29:39 2026-10-05 16:29:39        WARN                  Tsys data for ant id=6 (pol=1) in spw 0 at t=2008/03/10/18:30:18.0 are all negative or zero will be entirely flagged.
05-Oct-2026 12:29:39 2026-10-05 16:29:39        WARN                  Tsys data for ant id=6 (pol=1) in spw 3 at t=2008/03/10/18:37:06.0 are all negative or zero will be entirely flagged.
05-Oct-2026 12:29:39 2026-10-05 16:29:39        WARN                  Tsys data for ant id=6 (pol=1) in spw 0 at t=2008/03/10/18:40:21.0 are all negative or zero will be entirely flagged.
05-Oct-2026 12:29:39 2026-10-05 16:29:40        WARN                  Tsys data for ant id=6 (pol=1) in spw 0 at t=2008/03/10/18:50:21.0 are all negative or zero will be entirely flagged.
05-Oct-2026 12:29:39 2026-10-05 16:29:40        WARN                  Tsys data for ant id=6 (pol=1) in spw 1 at t=2008/03/10/18:50:21.0 are all negative or zero will be entirely flagged.
05-Oct-2026 12:29:39 2026-10-05 16:29:40        WARN                  Tsys data for ant id=6 (pol=1) in spw 2 at t=2008/03/10/18:50:21.0 are all negative or zero will be entirely flagged.
05-Oct-2026 12:29:39 2026-10-05 16:29:40        WARN                  Tsys data for ant id=6 (pol=1) in spw 3 at t=2008/03/10/18:50:21.0 are all negative or zero will be entirely flagged.
05-Oct-2026 12:29:39 2026-10-05 16:29:40        WARN                  Tsys data for ant id=6 (pol=1) in spw 3 at t=2008/03/10/18:51:06.0 are all negative or zero will be entirely flagged.
05-Oct-2026 12:29:39 2026-10-05 16:29:40        WARN                  Tsys data for ant id=9 (pol=1) in spw 0 at t=2008/03/10/18:56:46.0 are all negative or zero will be entirely flagged.
05-Oct-2026 12:29:40
05-Oct-2026 12:29:40 Test calibration table produced when gencal is run on an MS with a SYSCAL table that contains NaNs
05-Oct-2026 12:29:40
05-Oct-2026 12:29:40 Testing column TIME
05-Oct-2026 12:29:40 Column TIME PASSED
05-Oct-2026 12:29:40
05-Oct-2026 12:29:40 Testing column FIELD_ID
05-Oct-2026 12:29:40 Column FIELD_ID PASSED
05-Oct-2026 12:29:40
05-Oct-2026 12:29:40 Testing column SPECTRAL_WINDOW_ID
05-Oct-2026 12:29:40 Column SPECTRAL_WINDOW_ID PASSED
05-Oct-2026 12:29:40
05-Oct-2026 12:29:40 Testing column ANTENNA1
05-Oct-2026 12:29:40 Column ANTENNA1 PASSED
05-Oct-2026 12:29:40
05-Oct-2026 12:29:40 Testing column ANTENNA2
05-Oct-2026 12:29:40 Column ANTENNA2 PASSED
05-Oct-2026 12:29:40
05-Oct-2026 12:29:40 Testing column INTERVAL
05-Oct-2026 12:29:40 Column INTERVAL PASSED
05-Oct-2026 12:29:40
05-Oct-2026 12:29:40 Testing column SCAN_NUMBER
05-Oct-2026 12:29:40 Column SCAN_NUMBER PASSED
05-Oct-2026 12:29:40
05-Oct-2026 12:29:40 Testing column OBSERVATION_ID
05-Oct-2026 12:29:40 Column OBSERVATION_ID PASSED
05-Oct-2026 12:29:40
05-Oct-2026 12:29:40 Testing column PARAMERR
05-Oct-2026 12:29:40 Column PARAMERR PASSED
05-Oct-2026 12:29:40
05-Oct-2026 12:29:40 Testing column FLAG
05-Oct-2026 12:29:40 Column FLAG PASSED
05-Oct-2026 12:29:40
05-Oct-2026 12:29:40 Testing column SNR
05-Oct-2026 12:29:40 Column SNR PASSED
05-Oct-2026 12:29:40 PASSED
05-Oct-2026 12:29:40
05-Oct-2026 12:29:40 test_task_gencal.py::TestJyPerK::test_infile_is_incorrect_type
05-Oct-2026 12:29:40 Test to check for ejecting raise when infile is incorrect type.
05-Oct-2026 12:29:40 PASSED
05-Oct-2026 12:29:40
05-Oct-2026 12:29:40 test_task_gencal.py::TestJyPerK::test_jyperk_gencal_for_asdm_web_api
05-Oct-2026 12:29:40 Test to check that the factors from the web API are applied to the caltable.
05-Oct-2026 12:29:40
05-Oct-2026 12:29:40 The following arguments are required for this test.
05-Oct-2026 12:29:40 * caltype='jyperk'
05-Oct-2026 12:29:40 * endpoint='asdm'
05-Oct-2026 12:29:40
05-Oct-2026 12:29:40 Testing column TIME
05-Oct-2026 12:29:40 Column TIME PASSED
05-Oct-2026 12:29:40
05-Oct-2026 12:29:40 Testing column FIELD_ID
05-Oct-2026 12:29:40 Column FIELD_ID PASSED
05-Oct-2026 12:29:40
05-Oct-2026 12:29:40 Testing column SPECTRAL_WINDOW_ID
05-Oct-2026 12:29:40 Column SPECTRAL_WINDOW_ID PASSED
05-Oct-2026 12:29:40
05-Oct-2026 12:29:40 Testing column ANTENNA1
05-Oct-2026 12:29:40 Column ANTENNA1 PASSED
05-Oct-2026 12:29:40
05-Oct-2026 12:29:40 Testing column ANTENNA2
05-Oct-2026 12:29:40 Column ANTENNA2 PASSED
05-Oct-2026 12:29:40
05-Oct-2026 12:29:40 Testing column INTERVAL
05-Oct-2026 12:29:40 Column INTERVAL PASSED
05-Oct-2026 12:29:40
05-Oct-2026 12:29:40 Testing column SCAN_NUMBER
05-Oct-2026 12:29:40 Column SCAN_NUMBER PASSED
05-Oct-2026 12:29:40
05-Oct-2026 12:29:40 Testing column OBSERVATION_ID
05-Oct-2026 12:29:40 Column OBSERVATION_ID PASSED
05-Oct-2026 12:29:40
05-Oct-2026 12:29:40 Testing column CPARAM
05-Oct-2026 12:29:40 Column CPARAM PASSED
05-Oct-2026 12:29:40
05-Oct-2026 12:29:40 Testing column PARAMERR
05-Oct-2026 12:29:40 Column PARAMERR PASSED
05-Oct-2026 12:29:40
05-Oct-2026 12:29:40 Testing column FLAG
05-Oct-2026 12:29:40 Column FLAG PASSED
05-Oct-2026 12:29:40
05-Oct-2026 12:29:40 Testing column SNR
05-Oct-2026 12:29:40 Column SNR PASSED
05-Oct-2026 12:29:40 PASSED
05-Oct-2026 12:29:40
05-Oct-2026 12:29:40 test_task_gencal.py::TestJyPerK::test_jyperk_gencal_for_factor_file
05-Oct-2026 12:29:40 Test to check that the factors in the csv file are applied to the caltable.
05-Oct-2026 12:29:40
05-Oct-2026 12:29:40 The following arguments are required for this test.
05-Oct-2026 12:29:40 * caltype='jyperk'
05-Oct-2026 12:29:40 * infile
05-Oct-2026 12:29:40
05-Oct-2026 12:29:40 Testing column TIME
05-Oct-2026 12:29:40 Column TIME PASSED
05-Oct-2026 12:29:40
05-Oct-2026 12:29:40 Testing column FIELD_ID
05-Oct-2026 12:29:40 Column FIELD_ID PASSED
05-Oct-2026 12:29:40
05-Oct-2026 12:29:40 Testing column SPECTRAL_WINDOW_ID
05-Oct-2026 12:29:40 Column SPECTRAL_WINDOW_ID PASSED
05-Oct-2026 12:29:40
05-Oct-2026 12:29:40 Testing column ANTENNA1
05-Oct-2026 12:29:40 Column ANTENNA1 PASSED
05-Oct-2026 12:29:40
05-Oct-2026 12:29:40 Testing column ANTENNA2
05-Oct-2026 12:29:40 Column ANTENNA2 PASSED
05-Oct-2026 12:29:40
05-Oct-2026 12:29:40 Testing column INTERVAL
05-Oct-2026 12:29:40 Column INTERVAL PASSED
05-Oct-2026 12:29:40
05-Oct-2026 12:29:40 Testing column SCAN_NUMBER
05-Oct-2026 12:29:40 Column SCAN_NUMBER PASSED
05-Oct-2026 12:29:40
05-Oct-2026 12:29:40 Testing column OBSERVATION_ID
05-Oct-2026 12:29:40 Column OBSERVATION_ID PASSED
05-Oct-2026 12:29:40
05-Oct-2026 12:29:40 Testing column CPARAM
05-Oct-2026 12:29:40 Column CPARAM PASSED
05-Oct-2026 12:29:40
05-Oct-2026 12:29:40 Testing column PARAMERR
05-Oct-2026 12:29:40 Column PARAMERR PASSED
05-Oct-2026 12:29:40
05-Oct-2026 12:29:40 Testing column FLAG
05-Oct-2026 12:29:40 Column FLAG PASSED
05-Oct-2026 12:29:40
05-Oct-2026 12:29:40 Testing column SNR
05-Oct-2026 12:29:40 Column SNR PASSED
05-Oct-2026 12:29:40 PASSED
05-Oct-2026 12:29:40
05-Oct-2026 12:29:41 test_task_gencal.py::TestJyPerK::test_jyperk_gencal_for_factor_file_xxyy
05-Oct-2026 12:29:41 Test to check that the factors in the csv file are applied to the caltable.
05-Oct-2026 12:29:41
05-Oct-2026 12:29:41 The following arguments are required for this test.
05-Oct-2026 12:29:41 * caltype='jyperk'
05-Oct-2026 12:29:41 * infile
05-Oct-2026 12:29:41
05-Oct-2026 12:29:41 Testing column TIME
05-Oct-2026 12:29:41 Column TIME PASSED
05-Oct-2026 12:29:41
05-Oct-2026 12:29:41 Testing column FIELD_ID
05-Oct-2026 12:29:41 Column FIELD_ID PASSED
05-Oct-2026 12:29:41
05-Oct-2026 12:29:41 Testing column SPECTRAL_WINDOW_ID
05-Oct-2026 12:29:41 Column SPECTRAL_WINDOW_ID PASSED
05-Oct-2026 12:29:41
05-Oct-2026 12:29:41 Testing column ANTENNA1
05-Oct-2026 12:29:41 Column ANTENNA1 PASSED
05-Oct-2026 12:29:41
05-Oct-2026 12:29:41 Testing column ANTENNA2
05-Oct-2026 12:29:41 Column ANTENNA2 PASSED
05-Oct-2026 12:29:41
05-Oct-2026 12:29:41 Testing column INTERVAL
05-Oct-2026 12:29:41 Column INTERVAL PASSED
05-Oct-2026 12:29:41
05-Oct-2026 12:29:41 Testing column SCAN_NUMBER
05-Oct-2026 12:29:41 Column SCAN_NUMBER PASSED
05-Oct-2026 12:29:41
05-Oct-2026 12:29:41 Testing column OBSERVATION_ID
05-Oct-2026 12:29:41 Column OBSERVATION_ID PASSED
05-Oct-2026 12:29:41
05-Oct-2026 12:29:41 Testing column PARAMERR
05-Oct-2026 12:29:41 Column PARAMERR PASSED
05-Oct-2026 12:29:41
05-Oct-2026 12:29:41 Testing column FLAG
05-Oct-2026 12:29:41 Column FLAG PASSED
05-Oct-2026 12:29:41
05-Oct-2026 12:29:41 Testing column SNR
05-Oct-2026 12:29:41 Column SNR PASSED
05-Oct-2026 12:29:41 PASSED
05-Oct-2026 12:29:41
05-Oct-2026 12:29:41 test_task_gencal.py::TestJyPerK::test_jyperk_gencal_for_interpolation_web_api 2026-10-05 16:29:42        WARN        gencal::jyperk.MeanElevation._calc_elevation_mean::casa        The elevation mean is np.nan, so the factor is set 1.
05-Oct-2026 12:29:41 2026-10-05 16:29:42        WARN        gencal::jyperk.MeanElevation._calc_elevation_mean::casa        The elevation mean is np.nan, so the factor is set 1.
05-Oct-2026 12:29:41 2026-10-05 16:29:42        WARN        gencal::jyperk.MeanElevation._calc_elevation_mean::casa        The elevation mean is np.nan, so the factor is set 1.
05-Oct-2026 12:29:41 2026-10-05 16:29:42        WARN        gencal::jyperk.MeanElevation._calc_elevation_mean::casa        The elevation mean is np.nan, so the factor is set 1.
05-Oct-2026 12:29:41 2026-10-05 16:29:42        WARN        gencal::jyperk.MeanElevation._calc_elevation_mean::casa        The elevation mean is np.nan, so the factor is set 1.
05-Oct-2026 12:29:41 2026-10-05 16:29:42        WARN        gencal::jyperk.MeanElevation._calc_elevation_mean::casa        The elevation mean is np.nan, so the factor is set 1.
05-Oct-2026 12:29:41 2026-10-05 16:29:42        WARN        gencal::jyperk.MeanElevation._calc_elevation_mean::casa        The elevation mean is np.nan, so the factor is set 1.
05-Oct-2026 12:29:41 2026-10-05 16:29:42        WARN        gencal::jyperk.MeanElevation._calc_elevation_mean::casa        The elevation mean is np.nan, so the factor is set 1.
05-Oct-2026 12:29:41 2026-10-05 16:29:42        WARN        gencal::jyperk.MeanElevation._calc_elevation_mean::casa        The elevation mean is np.nan, so the factor is set 1.
05-Oct-2026 12:29:41 2026-10-05 16:29:42        WARN        gencal::jyperk.MeanElevation._calc_elevation_mean::casa        The elevation mean is np.nan, so the factor is set 1.
05-Oct-2026 12:29:41 2026-10-05 16:29:42        WARN        gencal::jyperk.MeanElevation._calc_elevation_mean::casa        The elevation mean is np.nan, so the factor is set 1.
05-Oct-2026 12:29:41 2026-10-05 16:29:42        WARN        gencal::jyperk.MeanElevation._calc_elevation_mean::casa        The elevation mean is np.nan, so the factor is set 1.
05-Oct-2026 12:29:41 2026-10-05 16:29:42        WARN        gencal::jyperk.MeanElevation._calc_elevation_mean::casa        The elevation mean is np.nan, so the factor is set 1.
05-Oct-2026 12:29:41 2026-10-05 16:29:42        WARN        gencal::jyperk.MeanElevation._calc_elevation_mean::casa        The elevation mean is np.nan, so the factor is set 1.
05-Oct-2026 12:29:41 2026-10-05 16:29:42        WARN        gencal::jyperk.MeanElevation._calc_elevation_mean::casa        The elevation mean is np.nan, so the factor is set 1.
05-Oct-2026 12:29:41 2026-10-05 16:29:42        WARN        gencal::jyperk.MeanElevation._calc_elevation_mean::casa        The elevation mean is np.nan, so the factor is set 1.
05-Oct-2026 12:29:41 2026-10-05 16:29:42        WARN        gencal::jyperk.MeanElevation._calc_elevation_mean::casa        The elevation mean is np.nan, so the factor is set 1.
05-Oct-2026 12:29:41 2026-10-05 16:29:42        WARN        gencal::jyperk.MeanElevation._calc_elevation_mean::casa        The elevation mean is np.nan, so the factor is set 1.
05-Oct-2026 12:29:41 2026-10-05 16:29:42        WARN        gencal::jyperk.MeanElevation._calc_elevation_mean::casa        The elevation mean is np.nan, so the factor is set 1.
05-Oct-2026 12:29:41 2026-10-05 16:29:42        WARN        gencal::jyperk.MeanElevation._calc_elevation_mean::casa        The elevation mean is np.nan, so the factor is set 1.
05-Oct-2026 12:29:41 2026-10-05 16:29:42        WARN        gencal::jyperk.MeanElevation._calc_elevation_mean::casa        The elevation mean is np.nan, so the factor is set 1.
05-Oct-2026 12:29:41 2026-10-05 16:29:42        WARN        gencal::jyperk.MeanElevation._calc_elevation_mean::casa        The elevation mean is np.nan, so the factor is set 1.
05-Oct-2026 12:29:41 2026-10-05 16:29:42        WARN        gencal::jyperk.MeanElevation._calc_elevation_mean::casa        The elevation mean is np.nan, so the factor is set 1.
05-Oct-2026 12:29:41 2026-10-05 16:29:42        WARN        gencal::jyperk.MeanElevation._calc_elevation_mean::casa        The elevation mean is np.nan, so the factor is set 1.
05-Oct-2026 12:29:41 2026-10-05 16:29:42        WARN        gencal::jyperk.MeanElevation._calc_elevation_mean::casa        The elevation mean is np.nan, so the factor is set 1.
05-Oct-2026 12:29:41 2026-10-05 16:29:42        WARN        gencal::jyperk.MeanElevation._calc_elevation_mean::casa        The elevation mean is np.nan, so the factor is set 1.
05-Oct-2026 12:29:41 2026-10-05 16:29:42        WARN        gencal::jyperk.MeanElevation._calc_elevation_mean::casa        The elevation mean is np.nan, so the factor is set 1.
05-Oct-2026 12:29:41 2026-10-05 16:29:42        WARN        gencal::jyperk.MeanElevation._calc_elevation_mean::casa        The elevation mean is np.nan, so the factor is set 1.
05-Oct-2026 12:29:41 2026-10-05 16:29:42        WARN        gencal::jyperk.MeanElevation._calc_elevation_mean::casa        The elevation mean is np.nan, so the factor is set 1.
05-Oct-2026 12:29:41 2026-10-05 16:29:42        WARN        gencal::jyperk.MeanElevation._calc_elevation_mean::casa        The elevation mean is np.nan, so the factor is set 1.
05-Oct-2026 12:29:41 2026-10-05 16:29:42        WARN        gencal::jyperk.MeanElevation._calc_elevation_mean::casa        The elevation mean is np.nan, so the factor is set 1.
05-Oct-2026 12:29:41 2026-10-05 16:29:42        WARN        gencal::jyperk.MeanElevation._calc_elevation_mean::casa        The elevation mean is np.nan, so the factor is set 1.
05-Oct-2026 12:29:41 2026-10-05 16:29:42        WARN        gencal::jyperk.MeanElevation._calc_elevation_mean::casa        The elevation mean is np.nan, so the factor is set 1.
05-Oct-2026 12:29:41 2026-10-05 16:29:42        WARN        gencal::jyperk.MeanElevation._calc_elevation_mean::casa        The elevation mean is np.nan, so the factor is set 1.
05-Oct-2026 12:29:41 2026-10-05 16:29:42        WARN        gencal::jyperk.MeanElevation._calc_elevation_mean::casa        The elevation mean is np.nan, so the factor is set 1.
05-Oct-2026 12:29:41 2026-10-05 16:29:42        WARN        gencal::jyperk.MeanElevation._calc_elevation_mean::casa        The elevation mean is np.nan, so the factor is set 1.
05-Oct-2026 12:29:41 2026-10-05 16:29:42        WARN        gencal::jyperk.MeanElevation._calc_elevation_mean::casa        The elevation mean is np.nan, so the factor is set 1.
05-Oct-2026 12:29:41 2026-10-05 16:29:42        WARN        gencal::jyperk.MeanElevation._calc_elevation_mean::casa        The elevation mean is np.nan, so the factor is set 1.
05-Oct-2026 12:29:41 2026-10-05 16:29:42        WARN        gencal::jyperk.MeanElevation._calc_elevation_mean::casa        The elevation mean is np.nan, so the factor is set 1.
05-Oct-2026 12:29:41 2026-10-05 16:29:42        WARN        gencal::jyperk.MeanElevation._calc_elevation_mean::casa        The elevation mean is np.nan, so the factor is set 1.
05-Oct-2026 12:29:41 2026-10-05 16:29:42        WARN        gencal::jyperk.MeanElevation._calc_elevation_mean::casa        The elevation mean is np.nan, so the factor is set 1.
05-Oct-2026 12:29:41 2026-10-05 16:29:42        WARN        gencal::jyperk.MeanElevation._calc_elevation_mean::casa        The elevation mean is np.nan, so the factor is set 1.
05-Oct-2026 12:29:41 2026-10-05 16:29:42        WARN        gencal::jyperk.MeanElevation._calc_elevation_mean::casa        The elevation mean is np.nan, so the factor is set 1.
05-Oct-2026 12:29:41 2026-10-05 16:29:42        WARN        gencal::jyperk.MeanElevation._calc_elevation_mean::casa        The elevation mean is np.nan, so the factor is set 1.
05-Oct-2026 12:29:41 2026-10-05 16:29:42        WARN        gencal::jyperk.MeanElevation._calc_elevation_mean::casa        The elevation mean is np.nan, so the factor is set 1.
05-Oct-2026 12:29:41 2026-10-05 16:29:42        WARN        gencal::jyperk.MeanElevation._calc_elevation_mean::casa        The elevation mean is np.nan, so the factor is set 1.
05-Oct-2026 12:29:41 2026-10-05 16:29:42        WARN        gencal::jyperk.MeanElevation._calc_elevation_mean::casa        The elevation mean is np.nan, so the factor is set 1.
05-Oct-2026 12:29:41 2026-10-05 16:29:42        WARN        gencal::jyperk.MeanElevation._calc_elevation_mean::casa        The elevation mean is np.nan, so the factor is set 1.
05-Oct-2026 12:29:43
05-Oct-2026 12:29:43 Test to check that the factors from the web API are applied to the caltable.
05-Oct-2026 12:29:43
05-Oct-2026 12:29:43 The following arguments are required for this test.
05-Oct-2026 12:29:43 * caltype='jyperk'
05-Oct-2026 12:29:43 * endpoint='interpolation'
05-Oct-2026 12:29:43
05-Oct-2026 12:29:43 Testing column TIME
05-Oct-2026 12:29:43 Column TIME PASSED
05-Oct-2026 12:29:43
05-Oct-2026 12:29:43 Testing column FIELD_ID
05-Oct-2026 12:29:43 Column FIELD_ID PASSED
05-Oct-2026 12:29:43
05-Oct-2026 12:29:43 Testing column SPECTRAL_WINDOW_ID
05-Oct-2026 12:29:43 Column SPECTRAL_WINDOW_ID PASSED
05-Oct-2026 12:29:43
05-Oct-2026 12:29:43 Testing column ANTENNA1
05-Oct-2026 12:29:43 Column ANTENNA1 PASSED
05-Oct-2026 12:29:43
05-Oct-2026 12:29:43 Testing column ANTENNA2
05-Oct-2026 12:29:43 Column ANTENNA2 PASSED
05-Oct-2026 12:29:43
05-Oct-2026 12:29:43 Testing column INTERVAL
05-Oct-2026 12:29:43 Column INTERVAL PASSED
05-Oct-2026 12:29:43
05-Oct-2026 12:29:43 Testing column SCAN_NUMBER
05-Oct-2026 12:29:43 Column SCAN_NUMBER PASSED
05-Oct-2026 12:29:43
05-Oct-2026 12:29:43 Testing column OBSERVATION_ID
05-Oct-2026 12:29:43 Column OBSERVATION_ID PASSED
05-Oct-2026 12:29:43
05-Oct-2026 12:29:43 Testing column CPARAM
05-Oct-2026 12:29:43 Column CPARAM PASSED
05-Oct-2026 12:29:43
05-Oct-2026 12:29:43 Testing column PARAMERR
05-Oct-2026 12:29:43 Column PARAMERR PASSED
05-Oct-2026 12:29:43
05-Oct-2026 12:29:43 Testing column FLAG
05-Oct-2026 12:29:43 Column FLAG PASSED
05-Oct-2026 12:29:43
05-Oct-2026 12:29:43 Testing column SNR
05-Oct-2026 12:29:43 Column SNR PASSED
05-Oct-2026 12:29:43 PASSED
05-Oct-2026 12:29:43
05-Oct-2026 12:29:45 test_task_gencal.py::TestJyPerK::test_jyperk_gencal_for_model_fit_web_api
05-Oct-2026 12:29:45 Test to check that the factors from the web API are applied to the caltable.
05-Oct-2026 12:29:45
05-Oct-2026 12:29:45 The following arguments are required for this test.
05-Oct-2026 12:29:45 * caltype='jyperk'
05-Oct-2026 12:29:45 * endpoint='model-fit'
05-Oct-2026 12:29:45
05-Oct-2026 12:29:45 Testing column TIME
05-Oct-2026 12:29:45 Column TIME PASSED
05-Oct-2026 12:29:45
05-Oct-2026 12:29:45 Testing column FIELD_ID
05-Oct-2026 12:29:45 Column FIELD_ID PASSED
05-Oct-2026 12:29:45
05-Oct-2026 12:29:45 Testing column SPECTRAL_WINDOW_ID
05-Oct-2026 12:29:45 Column SPECTRAL_WINDOW_ID PASSED
05-Oct-2026 12:29:45
05-Oct-2026 12:29:45 Testing column ANTENNA1
05-Oct-2026 12:29:45 Column ANTENNA1 PASSED
05-Oct-2026 12:29:45
05-Oct-2026 12:29:45 Testing column ANTENNA2
05-Oct-2026 12:29:45 Column ANTENNA2 PASSED
05-Oct-2026 12:29:45
05-Oct-2026 12:29:45 Testing column INTERVAL
05-Oct-2026 12:29:45 Column INTERVAL PASSED
05-Oct-2026 12:29:45
05-Oct-2026 12:29:45 Testing column SCAN_NUMBER
05-Oct-2026 12:29:45 Column SCAN_NUMBER PASSED
05-Oct-2026 12:29:45
05-Oct-2026 12:29:45 Testing column OBSERVATION_ID
05-Oct-2026 12:29:45 Column OBSERVATION_ID PASSED
05-Oct-2026 12:29:45
05-Oct-2026 12:29:45 Testing column CPARAM
05-Oct-2026 12:29:45 Column CPARAM PASSED
05-Oct-2026 12:29:45
05-Oct-2026 12:29:45 Testing column PARAMERR
05-Oct-2026 12:29:45 Column PARAMERR PASSED
05-Oct-2026 12:29:45
05-Oct-2026 12:29:45 Testing column FLAG
05-Oct-2026 12:29:45 Column FLAG PASSED
05-Oct-2026 12:29:45
05-Oct-2026 12:29:45 Testing column SNR
05-Oct-2026 12:29:45 Column SNR PASSED
05-Oct-2026 12:29:45 PASSED
05-Oct-2026 12:29:45
05-Oct-2026 12:29:45 test_task_gencal.py::TestJyPerK::test_jyperk_gencal_for_web_api_error 2026-10-05 16:29:45        SEVERE        gencal::::casa        Failed to get Jy/K factors from DB: expected error
05-Oct-2026 12:29:45 2026-10-05 16:29:45        SEVERE        gencal::::casa        Task gencal raised an exception of class RuntimeError with the following message: Failed to get Jy/K factors from DB: expected error
05-Oct-2026 12:29:45
05-Oct-2026 12:29:45 Test to check that the factors from the web API are applied to the caltable.
05-Oct-2026 12:29:45
05-Oct-2026 12:29:45 The following arguments are required for this test.
05-Oct-2026 12:29:45 * caltype='jyperk'
05-Oct-2026 12:29:45 * endpoint='asdm'
05-Oct-2026 12:29:45 PASSED
05-Oct-2026 12:29:45
05-Oct-2026 12:29:45 test_task_gencal.py::TestJyPerK::test_not_vis_name_in_factor_csv 2026-10-05 16:29:45        SEVERE        gencal::::casa        Task gencal raised an exception of class Exception with the following message: There is no factor.
05-Oct-2026 12:29:45
05-Oct-2026 12:29:45 Test to check a caltable does not been generated when there are not vis name in the factor csv file.
05-Oct-2026 12:29:45          
05-Oct-2026 12:29:45 PASSED
05-Oct-2026 12:29:45
05-Oct-2026 12:29:45 test_task_gencal.py::TestSwPow::test_switched_power_weights_caltype Switched-Power (swpwts) calculation: 0
05-Oct-2026 12:29:45 Check that resulting caltable has all 1's for gains and non-trivial values for weight adjustment
05-Oct-2026 12:29:45
05-Oct-2026 12:29:45 The following arguments are required for this test.
05-Oct-2026 12:29:45 * caltype='swpwts'
05-Oct-2026 12:29:45 PASSED
05-Oct-2026 12:29:45
05-Oct-2026 12:29:46 test_task_gencal.py::gencal_eoptest::test_eop
05-Oct-2026 12:29:46 Test calibration table produced when gencal is run on an MS
05-Oct-2026 12:29:46 with an EARTH_ORIENTATION table.
05-Oct-2026 12:29:46
05-Oct-2026 12:29:46 Testing column TIME
05-Oct-2026 12:29:46 Column TIME PASSED
05-Oct-2026 12:29:46
05-Oct-2026 12:29:46 Testing column FIELD_ID
05-Oct-2026 12:29:46 Column FIELD_ID PASSED
05-Oct-2026 12:29:46
05-Oct-2026 12:29:46 Testing column SPECTRAL_WINDOW_ID
05-Oct-2026 12:29:46 Column SPECTRAL_WINDOW_ID PASSED
05-Oct-2026 12:29:46
05-Oct-2026 12:29:46 Testing column ANTENNA1
05-Oct-2026 12:29:46 Column ANTENNA1 PASSED
05-Oct-2026 12:29:46
05-Oct-2026 12:29:46 Testing column ANTENNA2
05-Oct-2026 12:29:46 Column ANTENNA2 PASSED
05-Oct-2026 12:29:46
05-Oct-2026 12:29:46 Testing column INTERVAL
05-Oct-2026 12:29:46 Column INTERVAL PASSED
05-Oct-2026 12:29:46
05-Oct-2026 12:29:46 Testing column SCAN_NUMBER
05-Oct-2026 12:29:46 Column SCAN_NUMBER PASSED
05-Oct-2026 12:29:46
05-Oct-2026 12:29:46 Testing column OBSERVATION_ID
05-Oct-2026 12:29:46 Column OBSERVATION_ID PASSED
05-Oct-2026 12:29:46
05-Oct-2026 12:29:46 Testing column FPARAM
05-Oct-2026 12:29:46 Column FPARAM differs
05-Oct-2026 12:29:46 (Row,Channel,Corr)=(0,0,0)
05-Oct-2026 12:29:46 Reference file value: 0.5808483958244324
05-Oct-2026 12:29:46 Input file value: -0.006523863412439823
05-Oct-2026 12:29:46 Tolerance in % should be 101.12316113108656
05-Oct-2026 12:29:46
05-Oct-2026 12:29:46 Testing column PARAMERR
05-Oct-2026 12:29:46 Column PARAMERR PASSED
05-Oct-2026 12:29:46
05-Oct-2026 12:29:46 Testing column FLAG
05-Oct-2026 12:29:46 Column FLAG PASSED
05-Oct-2026 12:29:46
05-Oct-2026 12:29:46 Testing column SNR
05-Oct-2026 12:29:46 Column SNR PASSED
05-Oct-2026 12:29:46 FAILED
05-Oct-2026 12:29:46
05-Oct-2026 12:29:46 test_task_gencal.py::gencal_eoptest::test_eop_iers
05-Oct-2026 12:29:46 Test calibration table produced when gencal is run using an
05-Oct-2026 12:29:46 external file.
05-Oct-2026 12:29:46
05-Oct-2026 12:29:46 Testing column TIME
05-Oct-2026 12:29:46 Column TIME PASSED
05-Oct-2026 12:29:46
05-Oct-2026 12:29:46 Testing column FIELD_ID
05-Oct-2026 12:29:46 Column FIELD_ID PASSED
05-Oct-2026 12:29:46
05-Oct-2026 12:29:46 Testing column SPECTRAL_WINDOW_ID
05-Oct-2026 12:29:46 Column SPECTRAL_WINDOW_ID PASSED
05-Oct-2026 12:29:46
05-Oct-2026 12:29:46 Testing column ANTENNA1
05-Oct-2026 12:29:46 Column ANTENNA1 PASSED
05-Oct-2026 12:29:46
05-Oct-2026 12:29:46 Testing column ANTENNA2
05-Oct-2026 12:29:46 Column ANTENNA2 PASSED
05-Oct-2026 12:29:46
05-Oct-2026 12:29:46 Testing column INTERVAL
05-Oct-2026 12:29:46 Column INTERVAL PASSED
05-Oct-2026 12:29:46
05-Oct-2026 12:29:46 Testing column SCAN_NUMBER
05-Oct-2026 12:29:46 Column SCAN_NUMBER PASSED
05-Oct-2026 12:29:46
05-Oct-2026 12:29:46 Testing column OBSERVATION_ID
05-Oct-2026 12:29:46 Column OBSERVATION_ID PASSED
05-Oct-2026 12:29:46
05-Oct-2026 12:29:46 Testing column FPARAM
05-Oct-2026 12:29:46 Column FPARAM PASSED
05-Oct-2026 12:29:46
05-Oct-2026 12:29:46 Testing column PARAMERR
05-Oct-2026 12:29:46 Column PARAMERR PASSED
05-Oct-2026 12:29:46
05-Oct-2026 12:29:46 Testing column FLAG
05-Oct-2026 12:29:46 Column FLAG PASSED
05-Oct-2026 12:29:46
05-Oct-2026 12:29:46 Testing column SNR
05-Oct-2026 12:29:46 Column SNR PASSED
05-Oct-2026 12:29:46 PASSED
05-Oct-2026 12:29:46
05-Oct-2026 12:29:46 test_task_gencal.py::gencal_eoptest::test_eop_usno
05-Oct-2026 12:29:46 Test calibration table produced when gencal is run using an
05-Oct-2026 12:29:46 external file.
05-Oct-2026 12:29:46
05-Oct-2026 12:29:46 Testing column TIME
05-Oct-2026 12:29:46 Column TIME PASSED
05-Oct-2026 12:29:46
05-Oct-2026 12:29:46 Testing column FIELD_ID
05-Oct-2026 12:29:46 Column FIELD_ID PASSED
05-Oct-2026 12:29:46
05-Oct-2026 12:29:46 Testing column SPECTRAL_WINDOW_ID
05-Oct-2026 12:29:46 Column SPECTRAL_WINDOW_ID PASSED
05-Oct-2026 12:29:46
05-Oct-2026 12:29:46 Testing column ANTENNA1
05-Oct-2026 12:29:46 Column ANTENNA1 PASSED
05-Oct-2026 12:29:46
05-Oct-2026 12:29:46 Testing column ANTENNA2
05-Oct-2026 12:29:46 Column ANTENNA2 PASSED
05-Oct-2026 12:29:46
05-Oct-2026 12:29:46 Testing column INTERVAL
05-Oct-2026 12:29:46 Column INTERVAL PASSED
05-Oct-2026 12:29:46
05-Oct-2026 12:29:46 Testing column SCAN_NUMBER
05-Oct-2026 12:29:46 Column SCAN_NUMBER PASSED
05-Oct-2026 12:29:46
05-Oct-2026 12:29:46 Testing column OBSERVATION_ID
05-Oct-2026 12:29:46 Column OBSERVATION_ID PASSED
05-Oct-2026 12:29:46
05-Oct-2026 12:29:46 Testing column FPARAM
05-Oct-2026 12:29:46 Column FPARAM PASSED
05-Oct-2026 12:29:46
05-Oct-2026 12:29:46 Testing column PARAMERR
05-Oct-2026 12:29:46 Column PARAMERR PASSED
05-Oct-2026 12:29:46
05-Oct-2026 12:29:46 Testing column FLAG
05-Oct-2026 12:29:46 Column FLAG PASSED
05-Oct-2026 12:29:46
05-Oct-2026 12:29:46 Testing column SNR
05-Oct-2026 12:29:46 Column SNR PASSED
05-Oct-2026 12:29:46 PASSED
05-Oct-2026 12:29:46
05-Oct-2026 12:29:46 test_task_gencal.py::gencal_eoptest::test_noeop 2026-10-05 16:29:46        SEVERE        open::evn_copy.ms/EARTH_ORIENTATION        Exception Reported: Table evn_copy.ms/EARTH_ORIENTATION does not exist
05-Oct-2026 12:29:46 2026-10-05 16:29:46        SEVERE        gencal::::casa        No EOPS found in evn_copy.ms
05-Oct-2026 12:29:46
05-Oct-2026 12:29:46 Test that no calibration table is produced when gencal is run on an
05-Oct-2026 12:29:46 MS without an EARTH_ORIENTATION table.
05-Oct-2026 12:29:46 PASSED
05-Oct-2026 12:29:46
05-Oct-2026 12:29:46 =================================== FAILURES ===================================
05-Oct-2026 12:29:46 ___________________________ gencal_eoptest.test_eop ____________________________
05-Oct-2026 12:29:46 test_task_gencal.py:911: in test_eop
05-Oct-2026 12:29:46     self.assertTrue(th.compTables(caltab, reference, ['WEIGHT'], [0.001, 1e-14], mode="both"))
05-Oct-2026 12:29:46 E   AssertionError: False is not true
05-Oct-2026 12:29:46 - generated xml file: /home/casatest/casa6/casatestutils/nosedir/xml/test_task_gencal/nose.xml -
05-Oct-2026 12:29:46 =========================== short test summary info ============================
05-Oct-2026 12:29:46 FAILED test_task_gencal.py::gencal_eoptest::test_eop - AssertionError: False ...
05-Oct-2026 12:29:46 =================== 1 failed, 27 passed, 1 warning in 30.14s ===================
05-Oct-2026 12:29:46 Namespace(list=False, verbose=False, dry_run=False, classes=None, file=None, mapfile=<_io.TextIOWrapper name='/home/casatest/casa6/casatestutils/casatestutils/component_to_test_map.json' mode='r' encoding='utf-8'>, branch=None, merge_target=None, pkg=None, work_dir=None, ncores=2, test_paths='/home/casatest/casa6/casatasks/tests/tasks,/home/casatest/casa6/casatasks/tests/scripts', test_list=None, test_config=None, test_group='gencal', pmode=None, bamboo=False, cachedir=None, ignore_list='test_casampi,test_task_msview,test_task_imview,test_task_plotms', run_skipped=False, only_skipped=False)
05-Oct-2026 12:29:46
05-Oct-2026 12:29:46 Operating system: Linux
05-Oct-2026 12:29:46
05-Oct-2026 12:29:46 Testing Components['gencal']
05-Oct-2026 12:29:46
05-Oct-2026 12:29:46 Arguments Sent Direct To Pytest :  []
05-Oct-2026 12:29:46
05-Oct-2026 12:29:46 Tests to Ignore:  ['test_casampi', 'test_task_msview', 'test_task_imview', 'test_task_plotms']
05-Oct-2026 12:29:46 Running 1 Test(s)
05-Oct-2026 12:29:46 Cleaning: /home/casatest/casa6/casatestutils/nosedir/
05-Oct-2026 12:29:46 Tests: ['/home/casatest/casa6/casatasks/tests/tasks/test_task_gencal.py']
05-Oct-2026 12:29:46
05-Oct-2026 12:29:46 Setting Working Directory: /home/casatest/casa6/casatestutils/nosedir/test_task_gencal/
05-Oct-2026 12:29:46 Test Directory: /home/casatest/casa6/casatestutils/nosedir/test_task_gencal
05-Oct-2026 12:29:46
05-Oct-2026 12:29:46 Running Command: pytest --junitxml=/home/casatest/casa6/casatestutils/nosedir/xml/test_task_gencal/nose.xml -s --disable-pytest-warnings --verbose -ra --tb=short /home/casatest/casa6/casatestutils/nosedir/test_task_gencal/
05-Oct-2026 12:29:47 total 80632
05-Oct-2026 12:29:47 -rw-r--r-- 1 casaci 15001  1066663 Oct  5 16:25 casashell-6.7.7.11-py3-none-any.whl
05-Oct-2026 12:29:47 -rw-r--r-- 1 casaci 15001  1935263 Oct  5 16:25 casatasks-6.7.7.11-py3-none-any.whl
05-Oct-2026 12:29:47 -rw-r--r-- 1 casaci root     33282 Oct  5 16:29 casatasks_test.log
05-Oct-2026 12:29:47 -rw-r--r-- 1 casaci 15001   161014 Oct  5 16:25 casatestutils-6.7.7.11-py3-none-any.whl
05-Oct-2026 12:29:47 -rw-r--r-- 1 casaci 15001 79350287 Oct  5 16:25 casatools-6.7.7.11-cp312-cp312-manylinux_2_28_x86_64.whl
05-Oct-2026 12:29:47 -rw-r--r-- 1 casaci root       861 Oct  5 16:29 requirements.txt
05-Oct-2026 12:29:47 -rw-r--r-- 1 casaci root      3411 Oct  5 16:29 test_task_gencal.xml
05-Oct-2026 12:29:47 Finished task 'Test wheel' with result: Success
05-Oct-2026 12:29:47 Starting task 'Inject is_641' of type 'com.atlassian.bamboo.plugins.bamboo-variable-inject-plugin:inject'
05-Oct-2026 12:29:47 Injected variable bamboo.inject.is_641=False in LOCAL scope
05-Oct-2026 12:29:47 Finished task 'Inject is_641' with result: Success
05-Oct-2026 12:29:47
Substituting variable: ${bamboo.planRepository.branchName} with master
05-Oct-2026 12:29:47
Substituting variable: ${bamboo.python_version} with 3.12
05-Oct-2026 12:29:47
Substituting variable: ${bamboo.agentId} with 153550853
05-Oct-2026 12:29:47
Substituting variable: ${bamboo.agentId} with 153550853
05-Oct-2026 12:29:47
Substituting variable: ${bamboo.agentId} with 153550853
05-Oct-2026 12:29:47
Substituting variable: ${bamboo.agentId} with 153550853
05-Oct-2026 12:29:47 Starting task 'Tar work directory' of type 'com.atlassian.bamboo.plugins.scripttask:task.builder.script'
05-Oct-2026 12:29:47
Beginning to execute external process for build 'CASA - Release Engineering Master Test 3.12 go.nrao.edu IERS - Test Tasks Many Linux 2.28 Rocky 8.10 Py3.12 #4 (CASA-REMT3GI-TTM228PY38-4)'
... running command line:
/opt/ci_workspace/casa/bamboo/agent5/temp/CASA-REMT3GI-TTM228PY38-4-ScriptBuildTask-6388887146922191376.sh
... in: /opt/ci_workspace/casa/bamboo/agent5/xml-data/build-dir/CASA-REMT3GI-TTM228PY38
05-Oct-2026 12:29:47 Package working directory
05-Oct-2026 12:29:47 nosedir/
05-Oct-2026 12:29:47 nosedir/test_task_gencal/
05-Oct-2026 12:29:47 nosedir/test_task_gencal/test_task_gencal.py
05-Oct-2026 12:29:47 nosedir/test_task_gencal/conftest.py
05-Oct-2026 12:29:47 nosedir/test_task_gencal/casa-20261005-162916.log
05-Oct-2026 12:29:47 nosedir/test_task_gencal/short_summary.log
05-Oct-2026 12:29:47 nosedir/xml/
05-Oct-2026 12:29:47 nosedir/xml/test_task_gencal/
05-Oct-2026 12:29:47 nosedir/xml/test_task_gencal/nose.xml
05-Oct-2026 12:29:47 nosedir/summary_of_failed.log
05-Oct-2026 12:29:47 nosedir/requirements.txt
05-Oct-2026 12:29:47 total 80656
05-Oct-2026 12:29:47 -rw-r--r-- 1 casaci 15001  1066663 Oct  5 16:25 casashell-6.7.7.11-py3-none-any.whl
05-Oct-2026 12:29:47 -rw-r--r-- 1 casaci 15001  1935263 Oct  5 16:25 casatasks-6.7.7.11-py3-none-any.whl
05-Oct-2026 12:29:47 -rw-r--r-- 1 casaci root     33282 Oct  5 16:29 casatasks_test.log
05-Oct-2026 12:29:47 -rw-r--r-- 1 casaci 15001   161014 Oct  5 16:25 casatestutils-6.7.7.11-py3-none-any.whl
05-Oct-2026 12:29:47 -rw-r--r-- 1 casaci 15001 79350287 Oct  5 16:25 casatools-6.7.7.11-cp312-cp312-manylinux_2_28_x86_64.whl
05-Oct-2026 12:29:47 -rw-r--r-- 1 casaci root       861 Oct  5 16:29 requirements.txt
05-Oct-2026 12:29:47 -rw-r--r-- 1 casaci root      3411 Oct  5 16:29 test_task_gencal.xml
05-Oct-2026 12:29:47 -rw-r--r-- 1 casaci root     20836 Oct  5 16:29 work-manylinux_228_casatasks-3.12.tar.gz
05-Oct-2026 12:29:47 Done packaging working directory
05-Oct-2026 12:29:47 Finished task 'Tar work directory' with result: Success
05-Oct-2026 12:29:47 Starting task 'Parse tests' of type 'com.atlassian.bamboo.plugins.testresultparser:task.testresultparser.junit'
05-Oct-2026 12:29:47 Parsing test results under /opt/ci_workspace/casa/bamboo/agent5/xml-data/build-dir/CASA-REMT3GI-TTM228PY38...
05-Oct-2026 12:29:47 Failing task since 1 failing test cases were found.
05-Oct-2026 12:29:47 Finished task 'Parse tests' with result: Failed
05-Oct-2026 12:29:47 Running post build plugin 'Docker Container Cleanup'
05-Oct-2026 12:29:47
Beginning to execute external process for build 'CASA - Release Engineering Master Test 3.12 go.nrao.edu IERS - Test Tasks Many Linux 2.28 Rocky 8.10 Py3.12 #4 (CASA-REMT3GI-TTM228PY38-4)'
... running command line:
/usr/bin/docker rm -f wheel-container-test-153550853
... in: /opt/ci_workspace/casa/bamboo/agent5/xml-data/build-dir/CASA-REMT3GI-TTM228PY38
05-Oct-2026 12:29:49 wheel-container-test-153550853
05-Oct-2026 12:29:49 Running post build plugin 'NCover Results Collector'
05-Oct-2026 12:29:49 Running post build plugin 'Build Results Label Collector'
05-Oct-2026 12:29:49 Running post build plugin 'Clover Results Collector'
05-Oct-2026 12:29:49 Running post build plugin 'npm Cache Cleanup'
05-Oct-2026 12:29:49 Running post build plugin 'Artifact Copier'
05-Oct-2026 12:29:49 Publishing an artifact: Workdir
05-Oct-2026 12:29:49 Finished publishing of artifact Non required job artifact Http Compression On : [Workdir], patterns: [work*.tar.gz] anchored at: [wheeldirectory/] in 36.72 ms
05-Oct-2026 12:29:49 Publishing an artifact: requirements.txt
05-Oct-2026 12:29:49 Finished publishing of artifact Non required job artifact Http Compression On : [requirements.txt], patterns: [requirements.txt] anchored at: [wheeldirectory/] in 15.09 ms
05-Oct-2026 12:29:49 Publishing an artifact: XML Directories
05-Oct-2026 12:29:49 Finished publishing of artifact Non required job artifact Http Compression On : [XML Directories], patterns: [**/*.xml] anchored at: [wheeldirectory/] in 11.88 ms
05-Oct-2026 12:29:49 Finalising the build...
05-Oct-2026 12:29:49 Stopping timer.
05-Oct-2026 12:29:49 Build CASA-REMT3GI-TTM228PY38-4 completed.
05-Oct-2026 12:29:49 Running on server: post build plugin 'Build Hanging Detection Configuration'
05-Oct-2026 12:29:49 Running on server: post build plugin 'NCover Results Collector'
05-Oct-2026 12:29:49 Running on server: post build plugin 'Build Labeller'
05-Oct-2026 12:29:49 Running on server: post build plugin 'Clover Delta Calculator'
05-Oct-2026 12:29:49 Running on server: post build plugin 'Maven Dependencies Postprocessor'
05-Oct-2026 12:29:49 All post build plugins have finished
05-Oct-2026 12:29:49 Generating build results summary...
05-Oct-2026 12:29:49 Saving build results to disk...
05-Oct-2026 12:29:49 Store variable context...
05-Oct-2026 12:29:49 Finished building CASA-REMT3GI-TTM228PY38-4.