Test Tools and Tasks using https://go.nrao.edu/iers/

Build: #4 failed

Job: Test Tasks Many Linux 2.28 Rocky 8.10 Py3.12 failed

Job result summary

Completed
Duration
3 minutes
Agent
casaci-4.cv.nrao.edu test agent5
Total tests
28
Failing since
#3 (Manual run by Akeem Wells – )

Tests

  • 28 tests in total
  • 1 test failed
  • 1 failure is new
  • 28 seconds taken in total.
New test failures 1
Status Test Duration
Collapse Failed test_task_gencal gencal_eoptest.test_eop
< 1 sec
AssertionError: False is not true
test_task_gencal.py:911: in test_eop
    self.assertTrue(th.compTables(caltab, reference, ['WEIGHT'], [0.001, 1e-14], mode="both"))
E   AssertionError: False is not true

Error summary

The build generated some errors. See the full build log for more details.

Error response from daemon: No such container: wheel-container-test-153550853
Error response from daemon: No such container: wheel-container-test-153550853
  % Total    % Received % Xferd  Average Speed   Time    Time     Time  Current
                                 Dload  Upload   Total   Spent    Left  Speed

  0     0    0     0    0     0      0      0 --:--:-- --:--:-- --:--:--     0
100 6002k  100 6002k    0     0  73.2M      0 --:--:-- --:--:-- --:--:-- 73.2M
[947305] Failed to execute script 'atlutil' due to unhandled exception!
Traceback (most recent call last):
  File "atlutil.py", line 200, in <module>
  File "atlutil.py", line 165, in has_fix_version
KeyError: 'fields'
Already on 'master'