Test Tools and Tasks using https://go.nrao.edu/iers/

Build: #4 failed

Job: Test Tools Many Linux 2.28 Rocky 8.10 Py3.12 failed

Build log

The build generated 53,209 lines of output.   The output is too long and has been truncated to the last 1,000 lines. Download or view full build log.

05-Oct-2026 12:36:10 2026-10-05 16:36:10        INFO        name::        No table opened.
05-Oct-2026 12:36:10 test_tool_image_deviation.py::ia_deviation_test::test005
05-Oct-2026 12:36:10 Every third pixel is a grid point, using anchor [2,2]
05-Oct-2026 12:36:10 PASSED
05-Oct-2026 12:36:10
05-Oct-2026 12:36:10 2026-10-05 16:36:10        INFO        StatImageCreator::_computeStat        Using rectangular region of specified dimensions 10.001 pix x 10.001 pix (because of centering and rounding to use whole pixels, actual dimensions of bounding box are 11 pix x 11 pix) to choose pixels for computing STDDEV using the classical algorithm around each of 64 grid points in 2 planes.
05-Oct-2026 12:36:10 2026-10-05 16:36:10        INFO        StatImageCreator::_doInterpolation        Interpolate using LINEAR algorithm.
05-Oct-2026 12:36:10 2026-10-05 16:36:10        INFO        ImageRegion::fromRecord        Selected bounding box :
05-Oct-2026 12:36:10 2026-10-05 16:36:10        INFO        ImageRegion::fromRecord+            [5, 5, 0] to [85, 85, 1]  (00:03:00.021, -00.45.00.077, I to 23:57:39.990, +00.35.00.036, Q)
05-Oct-2026 12:36:10 2026-10-05 16:36:10        INFO        StatImageCreator::_computeStat        Using rectangular region of specified dimensions 10.001 pix x 10.001 pix (because of centering and rounding to use whole pixels, actual dimensions of bounding box are 11 pix x 11 pix) to choose pixels for computing STDDEV using the classical algorithm around each of 36 grid points in 2 planes.
05-Oct-2026 12:36:10 2026-10-05 16:36:10        INFO        StatImageCreator::_doInterpolation        Interpolate using LINEAR algorithm.
05-Oct-2026 12:36:10 2026-10-05 16:36:10        INFO        ImageRegion::fromRecord        Selected bounding box :
05-Oct-2026 12:36:10 2026-10-05 16:36:10        INFO        ImageRegion::fromRecord+            [27, 27, 0] to [66, 66, 0]  (00:01:32.003, -00.23.00.010, I to 23:58:55.999, +00.16.00.003, I)
05-Oct-2026 12:36:10 2026-10-05 16:36:10        INFO        ImageRegion::fromRecord        Selected bounding box :
05-Oct-2026 12:36:10 2026-10-05 16:36:10        INFO        ImageRegion::fromRecord+            [22, 22, 0] to [61, 61, 0]  (00:01:32.003, -00.23.00.010, I to 23:58:55.999, +00.16.00.003, I)
05-Oct-2026 12:36:10 2026-10-05 16:36:10        INFO        name::        No table opened.
05-Oct-2026 12:36:10 2026-10-05 16:36:10        INFO        showcache::        The Table Cache is empty.
05-Oct-2026 12:36:10 2026-10-05 16:36:10        INFO        name::        No table opened.
05-Oct-2026 12:36:10 2026-10-05 16:36:10        INFO        name::        No table opened.
05-Oct-2026 12:36:10 test_tool_image_deviation.py::ia_deviation_test::test006
05-Oct-2026 12:36:10 Test that regions work as expected
05-Oct-2026 12:36:10 PASSED
05-Oct-2026 12:36:10
05-Oct-2026 12:36:10 2026-10-05 16:36:10        INFO        ImageFactory::createImage        Created Paged image 'mycirc.im' of shape [100, 100] with float valued pixels.
05-Oct-2026 12:36:10 2026-10-05 16:36:11        INFO        StatImageCreator::useReferencePixelAsAnchor        Anchor being set at pixel [50,50], at/near image reference pixel.
05-Oct-2026 12:36:10 2026-10-05 16:36:11        INFO        StatImageCreator::_computeStat        Using circular region of radius 20 pix (because of centering and rounding to use whole pixels, actual dimensions of bounding box are 41 pix x 41 pix and there are 1257 good pixels in the circle that are being used) to choose pixels for computing SUM using the classical algorithm around each of 25 grid points in 1 planes.
05-Oct-2026 12:36:10 2026-10-05 16:36:11        INFO        StatImageCreator::_doInterpolation        Interpolate using CUBIC algorithm.
05-Oct-2026 12:36:10 2026-10-05 16:36:11        INFO        name::        No table opened.
05-Oct-2026 12:36:10 2026-10-05 16:36:11        INFO        showcache::        The Table Cache is empty.
05-Oct-2026 12:36:10 2026-10-05 16:36:11        INFO        name::        No table opened.
05-Oct-2026 12:36:10 2026-10-05 16:36:11        INFO        name::        No table opened.
05-Oct-2026 12:36:10 test_tool_image_deviation.py::ia_deviation_test::test_circle
05-Oct-2026 12:36:10 test circles work correctly CAS-10296
05-Oct-2026 12:36:10 PASSED
05-Oct-2026 12:36:10
05-Oct-2026 12:36:10 2026-10-05 16:36:11        INFO        ImageFactory::createImage        Created Temp image  of shape [10, 10] with float valued pixels.
05-Oct-2026 12:36:10 2026-10-05 16:36:11        INFO        StatImageCreator::_computeStat        Using rectangular region of specified dimensions 4 pix x 4 pix (because of centering and rounding to use whole pixels, actual dimensions of bounding box are 5 pix x 5 pix) to choose pixels for computing STDDEV using the classical algorithm around each of 9 grid points in 1 planes.
05-Oct-2026 12:36:10 2026-10-05 16:36:11        INFO        StatImageCreator::_doInterpolation        Interpolate using LINEAR algorithm.
05-Oct-2026 12:36:10 2026-10-05 16:36:11        INFO        ImageMaskAttacher::makeMask        Created mask `mask0'
05-Oct-2026 12:36:10 2026-10-05 16:36:11        INFO        ImageFactory::createImage        Created Temp image  of shape [10, 10, 2] with float valued pixels.
05-Oct-2026 12:36:10 2026-10-05 16:36:11        INFO        StatImageCreator::_computeStat        Using rectangular region of specified dimensions 4 pix x 4 pix (because of centering and rounding to use whole pixels, actual dimensions of bounding box are 5 pix x 5 pix) to choose pixels for computing STDDEV using the classical algorithm around each of 9 grid points in 2 planes.
05-Oct-2026 12:36:10 2026-10-05 16:36:11        INFO        StatImageCreator::_doInterpolation        Interpolate using LINEAR algorithm.
05-Oct-2026 12:36:10 2026-10-05 16:36:11        INFO        ImageMaskAttacher::makeMask        Created mask `mask0'
05-Oct-2026 12:36:10 2026-10-05 16:36:11        INFO        name::        No table opened.
05-Oct-2026 12:36:10 2026-10-05 16:36:11        INFO        showcache::        The Table Cache is empty.
05-Oct-2026 12:36:10 2026-10-05 16:36:11        INFO        name::        No table opened.
05-Oct-2026 12:36:10 2026-10-05 16:36:11        INFO        name::        No table opened.
05-Oct-2026 12:36:10 test_tool_image_deviation.py::ia_deviation_test::test_mask
05-Oct-2026 12:36:10 PASSED
05-Oct-2026 12:36:10
05-Oct-2026 12:36:10 2026-10-05 16:36:11        INFO        ImageFactory::createImage        Created Temp image  of shape [20, 20] with float valued pixels.
05-Oct-2026 12:36:10 2026-10-05 16:36:11        INFO        StatImageCreator::_computeStat        Using rectangular region of specified dimensions 4 pix x 4 pix (because of centering and rounding to use whole pixels, actual dimensions of bounding box are 5 pix x 5 pix) to choose pixels for computing STDDEV using the classical algorithm around each of 25 grid points in 1 planes.
05-Oct-2026 12:36:10 2026-10-05 16:36:11        INFO        StatImageCreator::_doInterpolation        Interpolate using CUBIC algorithm.
05-Oct-2026 12:36:10 2026-10-05 16:36:11        INFO        StatImageCreator::useReferencePixelAsAnchor        Anchor being set at pixel [10,10], at/near image reference pixel.
05-Oct-2026 12:36:10 2026-10-05 16:36:11        INFO        StatImageCreator::_computeStat        Using rectangular region of specified dimensions 4 pix x 4 pix (because of centering and rounding to use whole pixels, actual dimensions of bounding box are 5 pix x 5 pix) to choose pixels for computing STDDEV using the classical algorithm around each of 25 grid points in 1 planes.
05-Oct-2026 12:36:10 2026-10-05 16:36:11        INFO        StatImageCreator::_doInterpolation        Interpolate using CUBIC algorithm.
05-Oct-2026 12:36:10 2026-10-05 16:36:11        INFO        name::        No table opened.
05-Oct-2026 12:36:10 2026-10-05 16:36:11        INFO        showcache::        The Table Cache is empty.
05-Oct-2026 12:36:10 2026-10-05 16:36:11        INFO        name::        No table opened.
05-Oct-2026 12:36:10 2026-10-05 16:36:11        INFO        name::        No table opened.
05-Oct-2026 12:36:10 test_tool_image_deviation.py::ia_deviation_test::test_refpix
05-Oct-2026 12:36:10 Test using reference pixel
05-Oct-2026 12:36:10 PASSED
05-Oct-2026 12:36:10
05-Oct-2026 12:36:10 - generated xml file: /home/casatest/casa6/casatestutils/nosedir/xml/test_tool_image_deviation/nose.xml -
05-Oct-2026 12:36:10 ========================= 8 passed, 1 warning in 3.69s =========================
05-Oct-2026 12:36:10 ============================= test session starts ==============================
05-Oct-2026 12:36:10 platform linux -- Python 3.12.9, pytest-9.1.1, pluggy-1.6.0 -- /home/casatest/venv/bin/python3.12
05-Oct-2026 12:36:10 cachedir: .pytest_cache
05-Oct-2026 12:36:10 rootdir: /home/casatest/casa6/casatestutils/nosedir/test_tool_coordsys
05-Oct-2026 12:36:10 configfile: pytest.ini
05-Oct-2026 12:36:10 collecting ... collected 74 items
05-Oct-2026 12:36:10
05-Oct-2026 12:36:10
05-Oct-2026 12:36:10 2026-10-05 16:36:11        SEVERE        coordsys::toworldmany        You must provide a vector of doubles.
05-Oct-2026 12:36:10 2026-10-05 16:36:11        SEVERE        coordsys::toworldmany        Exception Reported: 2026-10-05 16:36:11        SEVERE        coordsys::toworldmany        You must provide a vector of doubles.
05-Oct-2026 12:36:10 2026-10-05 16:36:11        INFO        name::        No table opened.
05-Oct-2026 12:36:10 2026-10-05 16:36:11        INFO        showcache::        The Table Cache is empty.
05-Oct-2026 12:36:10 2026-10-05 16:36:11        INFO        name::        No table opened.
05-Oct-2026 12:36:10 2026-10-05 16:36:11        INFO        name::        No table opened.
05-Oct-2026 12:36:10 test_tool_coordsys.py::coordsys_test::test_CAS_2724
05-Oct-2026 12:36:10 PASSED
05-Oct-2026 12:36:10
05-Oct-2026 12:36:10 2026-10-05 16:36:11        INFO        name::        No table opened.
05-Oct-2026 12:36:10 2026-10-05 16:36:11        INFO        showcache::        The Table Cache is empty.
05-Oct-2026 12:36:10 2026-10-05 16:36:11        INFO        name::        No table opened.
05-Oct-2026 12:36:10 2026-10-05 16:36:11        INFO        name::        No table opened.
05-Oct-2026 12:36:10 test_tool_coordsys.py::coordsys_test::test_addCoordinate
05-Oct-2026 12:36:10 Test that coordinates can be added
05-Oct-2026 12:36:10 PASSED
05-Oct-2026 12:36:10
05-Oct-2026 12:36:10 2026-10-05 16:36:11        INFO        name::        No table opened.
05-Oct-2026 12:36:10 2026-10-05 16:36:11        INFO        showcache::        The Table Cache is empty.
05-Oct-2026 12:36:10 2026-10-05 16:36:11        INFO        name::        No table opened.
05-Oct-2026 12:36:10 2026-10-05 16:36:11        INFO        name::        No table opened.
05-Oct-2026 12:36:10 test_tool_coordsys.py::coordsys_test::test_axesmap
05-Oct-2026 12:36:10 Test that maps are the same
05-Oct-2026 12:36:10 PASSED
05-Oct-2026 12:36:10
05-Oct-2026 12:36:10 2026-10-05 16:36:11        INFO        name::        No table opened.
05-Oct-2026 12:36:10 2026-10-05 16:36:11        INFO        showcache::        The Table Cache is empty.
05-Oct-2026 12:36:10 2026-10-05 16:36:11        INFO        name::        No table opened.
05-Oct-2026 12:36:10 2026-10-05 16:36:11        INFO        name::        No table opened.
05-Oct-2026 12:36:10 test_tool_coordsys.py::coordsys_test::test_constructedSetUp
05-Oct-2026 12:36:10 Test that the coordsys was set up with the right number of coords and type
05-Oct-2026 12:36:11 PASSED
05-Oct-2026 12:36:11
05-Oct-2026 12:36:11 2026-10-05 16:36:11        INFO        name::        No table opened.
05-Oct-2026 12:36:11 2026-10-05 16:36:11        INFO        showcache::        The Table Cache is empty.
05-Oct-2026 12:36:11 2026-10-05 16:36:11        INFO        name::        No table opened.
05-Oct-2026 12:36:11 2026-10-05 16:36:11        INFO        name::        No table opened.
05-Oct-2026 12:36:11 test_tool_coordsys.py::coordsys_test::test_constructor
05-Oct-2026 12:36:11 Test constructors
05-Oct-2026 12:36:11 PASSED
05-Oct-2026 12:36:11
05-Oct-2026 12:36:11 2026-10-05 16:36:11        INFO        name::        No table opened.
05-Oct-2026 12:36:11 2026-10-05 16:36:11        INFO        showcache::        The Table Cache is empty.
05-Oct-2026 12:36:11 2026-10-05 16:36:11        INFO        name::        No table opened.
05-Oct-2026 12:36:11 2026-10-05 16:36:11        INFO        name::        No table opened.
05-Oct-2026 12:36:11 test_tool_coordsys.py::coordsys_test::test_convert
05-Oct-2026 12:36:11 Test the conversion from abs pix to rel pix
05-Oct-2026 12:36:11 PASSED
05-Oct-2026 12:36:11
05-Oct-2026 12:36:11 2026-10-05 16:36:11        INFO        name::        No table opened.
05-Oct-2026 12:36:11 2026-10-05 16:36:11        INFO        showcache::        The Table Cache is empty.
05-Oct-2026 12:36:11 2026-10-05 16:36:11        INFO        name::        No table opened.
05-Oct-2026 12:36:11 2026-10-05 16:36:11        INFO        name::        No table opened.
05-Oct-2026 12:36:11 test_tool_coordsys.py::coordsys_test::test_convertMany
05-Oct-2026 12:36:11 PASSED
05-Oct-2026 12:36:11
05-Oct-2026 12:36:11 2026-10-05 16:36:11        INFO        name::        No table opened.
05-Oct-2026 12:36:11 2026-10-05 16:36:11        INFO        showcache::        The Table Cache is empty.
05-Oct-2026 12:36:11 2026-10-05 16:36:11        INFO        name::        No table opened.
05-Oct-2026 12:36:11 2026-10-05 16:36:11        INFO        name::        No table opened.
05-Oct-2026 12:36:11 test_tool_coordsys.py::coordsys_test::test_copy
05-Oct-2026 12:36:11 Test that the coordsys can be copied
05-Oct-2026 12:36:11 PASSED
05-Oct-2026 12:36:11
05-Oct-2026 12:36:11 2026-10-05 16:36:11        INFO        name::        No table opened.
05-Oct-2026 12:36:11 2026-10-05 16:36:11        INFO        showcache::        The Table Cache is empty.
05-Oct-2026 12:36:11 2026-10-05 16:36:11        INFO        name::        No table opened.
05-Oct-2026 12:36:11 2026-10-05 16:36:11        INFO        name::        No table opened.
05-Oct-2026 12:36:11 test_tool_coordsys.py::coordsys_test::test_createDirectionAxes
05-Oct-2026 12:36:11 Test that a coordsys with direction axes can be created properly
05-Oct-2026 12:36:11 PASSED
05-Oct-2026 12:36:11
05-Oct-2026 12:36:11 2026-10-05 16:36:11        INFO        name::        No table opened.
05-Oct-2026 12:36:11 2026-10-05 16:36:11        INFO        showcache::        The Table Cache is empty.
05-Oct-2026 12:36:11 2026-10-05 16:36:11        INFO        name::        No table opened.
05-Oct-2026 12:36:11 2026-10-05 16:36:11        INFO        name::        No table opened.
05-Oct-2026 12:36:11 test_tool_coordsys.py::coordsys_test::test_createLinearAxes
05-Oct-2026 12:36:11 "Test that coordsys with linear axes can be created properly
05-Oct-2026 12:36:11 PASSED
05-Oct-2026 12:36:11
05-Oct-2026 12:36:11 2026-10-05 16:36:11        INFO        name::        No table opened.
05-Oct-2026 12:36:11 2026-10-05 16:36:11        INFO        showcache::        The Table Cache is empty.
05-Oct-2026 12:36:11 2026-10-05 16:36:11        INFO        name::        No table opened.
05-Oct-2026 12:36:11 2026-10-05 16:36:11        INFO        name::        No table opened.
05-Oct-2026 12:36:11 test_tool_coordsys.py::coordsys_test::test_createMixedAxes
05-Oct-2026 12:36:11 Test that a coordsys with mixed axes types can be created properly
05-Oct-2026 12:36:11 PASSED
05-Oct-2026 12:36:11
05-Oct-2026 12:36:11 2026-10-05 16:36:11        INFO        name::        No table opened.
05-Oct-2026 12:36:11 2026-10-05 16:36:11        INFO        showcache::        The Table Cache is empty.
05-Oct-2026 12:36:11 2026-10-05 16:36:11        INFO        name::        No table opened.
05-Oct-2026 12:36:11 2026-10-05 16:36:11        INFO        name::        No table opened.
05-Oct-2026 12:36:11 test_tool_coordsys.py::coordsys_test::test_createSpectralAxes
05-Oct-2026 12:36:11 Test that coordsys with spectral axes can be created properly
05-Oct-2026 12:36:11 PASSED
05-Oct-2026 12:36:11
05-Oct-2026 12:36:11 2026-10-05 16:36:11        INFO        name::        No table opened.
05-Oct-2026 12:36:11 2026-10-05 16:36:11        INFO        showcache::        The Table Cache is empty.
05-Oct-2026 12:36:11 2026-10-05 16:36:11        INFO        name::        No table opened.
05-Oct-2026 12:36:11 2026-10-05 16:36:11        INFO        name::        No table opened.
05-Oct-2026 12:36:11 test_tool_coordsys.py::coordsys_test::test_createStokesAxes
05-Oct-2026 12:36:11 Test that coordsys with stokes axes can be created properly
05-Oct-2026 12:36:11 PASSED
05-Oct-2026 12:36:11
05-Oct-2026 12:36:11 2026-10-05 16:36:11        INFO        name::        No table opened.
05-Oct-2026 12:36:11 2026-10-05 16:36:11        INFO        showcache::        The Table Cache is empty.
05-Oct-2026 12:36:11 2026-10-05 16:36:11        INFO        name::        No table opened.
05-Oct-2026 12:36:11 2026-10-05 16:36:11        INFO        name::        No table opened.
05-Oct-2026 12:36:11 test_tool_coordsys.py::coordsys_test::test_createTabularAxes
05-Oct-2026 12:36:11 Test that coordsys with tabular axes can be created properly
05-Oct-2026 12:36:11 PASSED
05-Oct-2026 12:36:11
05-Oct-2026 12:36:11 2026-10-05 16:36:11        INFO        name::        No table opened.
05-Oct-2026 12:36:11 2026-10-05 16:36:11        INFO        showcache::        The Table Cache is empty.
05-Oct-2026 12:36:11 2026-10-05 16:36:11        INFO        name::        No table opened.
05-Oct-2026 12:36:11 2026-10-05 16:36:11        INFO        name::        No table opened.
05-Oct-2026 12:36:11 test_tool_coordsys.py::coordsys_test::test_epoch
05-Oct-2026 12:36:11 Test that you can set and get the epoch
05-Oct-2026 12:36:11 PASSED
05-Oct-2026 12:36:11
05-Oct-2026 12:36:11 2026-10-05 16:36:11        INFO        ImageFactory::createImage        Created Temp image  of shape [20, 20, 4, 20] with float valued pixels.
05-Oct-2026 12:36:11 2026-10-05 16:36:11        SEVERE        coordsys::findaxis        Error: Exception: Value of axis cannot be negative.
05-Oct-2026 12:36:11 2026-10-05 16:36:11        SEVERE        coordsys::findaxis+        ... thrown by casac::record* casac::coordsys::findaxis(bool, long int) at File: src/tools/coordsys/coordsys_cmpt.cc, line: 581
05-Oct-2026 12:36:11 2026-10-05 16:36:11        SEVERE        coordsys::findaxis        Error: (/source/casa6/casatools/casacore/coordinates/Coordinates/CoordinateSystem.cc : 903) Failed AlwaysAssert axisInCoordinateSystem < nWorldAxes()
05-Oct-2026 12:36:11 2026-10-05 16:36:11        INFO        name::        No table opened.
05-Oct-2026 12:36:11 2026-10-05 16:36:11        INFO        showcache::        The Table Cache is empty.
05-Oct-2026 12:36:11 2026-10-05 16:36:11        INFO        name::        No table opened.
05-Oct-2026 12:36:11 2026-10-05 16:36:11        INFO        name::        No table opened.
05-Oct-2026 12:36:11 test_tool_coordsys.py::coordsys_test::test_findaxis
05-Oct-2026 12:36:11 Test the findaxis() method
05-Oct-2026 12:36:11 PASSED
05-Oct-2026 12:36:11
05-Oct-2026 12:36:11 2026-10-05 16:36:11        INFO        ImageFactory::createImage        Created Temp image  of shape [4, 4, 4, 4] with float valued pixels.
05-Oct-2026 12:36:11 2026-10-05 16:36:11        SEVERE        CoordinateSystem::getWorldAxesOrder (file /source/casa6/casatools/casacore/coordinates/Coordinates/CoordinateSystem.cc, line 4663)        No axis matches requested axis ra. Image axis names are [right ascension, declination, stokes, frequency]
05-Oct-2026 12:36:11 2026-10-05 16:36:11        SEVERE        coordsys::findaxisbyname        Error: 2026-10-05 16:36:11        SEVERE        CoordinateSystem::getWorldAxesOrder (file /source/casa6/casatools/casacore/coordinates/Coordinates/CoordinateSystem.cc, line 4663)        No axis matches requested axis ra. Image axis names are [right ascension, declination, stokes, frequency]
05-Oct-2026 12:36:11 2026-10-05 16:36:11        INFO        name::        No table opened.
05-Oct-2026 12:36:11 2026-10-05 16:36:11        INFO        showcache::        The Table Cache is empty.
05-Oct-2026 12:36:11 2026-10-05 16:36:11        INFO        name::        No table opened.
05-Oct-2026 12:36:11 2026-10-05 16:36:11        INFO        name::        No table opened.
05-Oct-2026 12:36:11 test_tool_coordsys.py::coordsys_test::test_findaxisbyname
05-Oct-2026 12:36:11 PASSED
05-Oct-2026 12:36:11
05-Oct-2026 12:36:11 2026-10-05 16:36:11        INFO        ImageFactory::createImage        Created Temp image  of shape [20, 20, 4, 20] with float valued pixels.
05-Oct-2026 12:36:11 2026-10-05 16:36:11        INFO        name::        No table opened.
05-Oct-2026 12:36:11 2026-10-05 16:36:11        INFO        showcache::        The Table Cache is empty.
05-Oct-2026 12:36:11 2026-10-05 16:36:11        INFO        name::        No table opened.
05-Oct-2026 12:36:11 2026-10-05 16:36:11        INFO        name::        No table opened.
05-Oct-2026 12:36:11 test_tool_coordsys.py::coordsys_test::test_findcoordinate
05-Oct-2026 12:36:11 Test the findcoordinate() method
05-Oct-2026 12:36:11 PASSED
05-Oct-2026 12:36:11
05-Oct-2026 12:36:11 2026-10-05 16:36:11        INFO        name::        No table opened.
05-Oct-2026 12:36:11 2026-10-05 16:36:11        INFO        showcache::        The Table Cache is empty.
05-Oct-2026 12:36:11 2026-10-05 16:36:11        INFO        name::        No table opened.
05-Oct-2026 12:36:11 2026-10-05 16:36:11        INFO        name::        No table opened.
05-Oct-2026 12:36:11 test_tool_coordsys.py::coordsys_test::test_frequencyToVelocity
05-Oct-2026 12:36:11 Test frequency to velocity conversion
05-Oct-2026 12:36:11 PASSED
05-Oct-2026 12:36:11
05-Oct-2026 12:36:11 2026-10-05 16:36:11        INFO        name::        No table opened.
05-Oct-2026 12:36:11 2026-10-05 16:36:11        INFO        showcache::        The Table Cache is empty.
05-Oct-2026 12:36:11 2026-10-05 16:36:11        INFO        name::        No table opened.
05-Oct-2026 12:36:11 2026-10-05 16:36:11        INFO        name::        No table opened.
05-Oct-2026 12:36:11 test_tool_coordsys.py::coordsys_test::test_frequencyToVelocityDiff
05-Oct-2026 12:36:11 Test the velocity diff
05-Oct-2026 12:36:11 PASSED
05-Oct-2026 12:36:11
05-Oct-2026 12:36:11 2026-10-05 16:36:11        INFO        name::        No table opened.
05-Oct-2026 12:36:11 2026-10-05 16:36:11        INFO        showcache::        The Table Cache is empty.
05-Oct-2026 12:36:11 2026-10-05 16:36:11        INFO        name::        No table opened.
05-Oct-2026 12:36:11 2026-10-05 16:36:11        INFO        name::        No table opened.
05-Oct-2026 12:36:11 test_tool_coordsys.py::coordsys_test::test_frequencyVelocityBasic
05-Oct-2026 12:36:11 Test conversion between freq and velocity
05-Oct-2026 12:36:11 PASSED
05-Oct-2026 12:36:11
05-Oct-2026 12:36:11 2026-10-05 16:36:11        SEVERE        coordsys::frequencytovelocity        Failed to set frequency units of Jy because Units are not compatible dimensionally
05-Oct-2026 12:36:11 2026-10-05 16:36:11        SEVERE        coordsys::velocitytofrequency        Failed to set frequency units of Jy because Units are not compatible dimensionally
05-Oct-2026 12:36:11 2026-10-05 16:36:11        SEVERE        coordsys::frequencytovelocity        There is no spectral coordinate in this CoordinateSystem
05-Oct-2026 12:36:11 2026-10-05 16:36:11        INFO        name::        No table opened.
05-Oct-2026 12:36:11 2026-10-05 16:36:11        INFO        showcache::        The Table Cache is empty.
05-Oct-2026 12:36:11 2026-10-05 16:36:11        INFO        name::        No table opened.
05-Oct-2026 12:36:11 2026-10-05 16:36:11        INFO        name::        No table opened.
05-Oct-2026 12:36:11 test_tool_coordsys.py::coordsys_test::test_frequencyVelocityInvalidInput
05-Oct-2026 12:36:11 Test frequencytovelocity and velocitytofrequency with invalid inputs
05-Oct-2026 12:36:11 PASSED
05-Oct-2026 12:36:11
05-Oct-2026 12:36:11 2026-10-05 16:36:11        INFO        name::        No table opened.
05-Oct-2026 12:36:11 2026-10-05 16:36:11        INFO        showcache::        The Table Cache is empty.
05-Oct-2026 12:36:11 2026-10-05 16:36:11        INFO        name::        No table opened.
05-Oct-2026 12:36:11 2026-10-05 16:36:11        INFO        name::        No table opened.
05-Oct-2026 12:36:11 test_tool_coordsys.py::coordsys_test::test_fromRecord
05-Oct-2026 12:36:11 Test that a record can be converted to a coordsys
05-Oct-2026 12:36:11 PASSED
05-Oct-2026 12:36:11
05-Oct-2026 12:36:11 2026-10-05 16:36:11        INFO        name::        No table opened.
05-Oct-2026 12:36:11 2026-10-05 16:36:11        INFO        showcache::        The Table Cache is empty.
05-Oct-2026 12:36:11 2026-10-05 16:36:11        INFO        name::        No table opened.
05-Oct-2026 12:36:11 2026-10-05 16:36:11        INFO        name::        No table opened.
05-Oct-2026 12:36:11 test_tool_coordsys.py::coordsys_test::test_incrementDefaultUnits
05-Oct-2026 12:36:11 Test increment with default coordsys units
05-Oct-2026 12:36:11 PASSED
05-Oct-2026 12:36:11
05-Oct-2026 12:36:11 2026-10-05 16:36:11        INFO        name::        No table opened.
05-Oct-2026 12:36:11 2026-10-05 16:36:11        INFO        showcache::        The Table Cache is empty.
05-Oct-2026 12:36:11 2026-10-05 16:36:11        INFO        name::        No table opened.
05-Oct-2026 12:36:11 2026-10-05 16:36:11        INFO        name::        No table opened.
05-Oct-2026 12:36:11 test_tool_coordsys.py::coordsys_test::test_incrementRad
05-Oct-2026 12:36:11 Test increment with radian units
05-Oct-2026 12:36:11 PASSED
05-Oct-2026 12:36:11
05-Oct-2026 12:36:11 2026-10-05 16:36:11        SEVERE        coordsys::recordToWorldVector        Failed to convert string formatted world [i, like, doggies] to double
05-Oct-2026 12:36:11 2026-10-05 16:36:11        INFO        name::        No table opened.
05-Oct-2026 12:36:11 2026-10-05 16:36:11        INFO        showcache::        The Table Cache is empty.
05-Oct-2026 12:36:11 2026-10-05 16:36:11        INFO        name::        No table opened.
05-Oct-2026 12:36:11 2026-10-05 16:36:11        INFO        name::        No table opened.
05-Oct-2026 12:36:11 test_tool_coordsys.py::coordsys_test::test_incrementSetIncorrect
05-Oct-2026 12:36:11 Test increment with incorrect values
05-Oct-2026 12:36:11 PASSED
05-Oct-2026 12:36:11
05-Oct-2026 12:36:11 2026-10-05 16:36:11        SEVERE        coordsys::stringToType        A coordinate of type lin does not exist
05-Oct-2026 12:36:11 2026-10-05 16:36:11        SEVERE        coordsys::increment        exceptions reported: 2026-10-05 16:36:11        SEVERE        coordsys::stringToType        A coordinate of type lin does not exist
05-Oct-2026 12:36:11 2026-10-05 16:36:11        INFO        name::        No table opened.
05-Oct-2026 12:36:11 2026-10-05 16:36:11        INFO        showcache::        The Table Cache is empty.
05-Oct-2026 12:36:11 2026-10-05 16:36:11        INFO        name::        No table opened.
05-Oct-2026 12:36:11 2026-10-05 16:36:11        INFO        name::        No table opened.
05-Oct-2026 12:36:11 test_tool_coordsys.py::coordsys_test::test_incrementSpectral
05-Oct-2026 12:36:11 Test increment using spectral type
05-Oct-2026 12:36:11 PASSED
05-Oct-2026 12:36:11
05-Oct-2026 12:36:11 2026-10-05 16:36:11        INFO        name::        No table opened.
05-Oct-2026 12:36:11 2026-10-05 16:36:11        INFO        showcache::        The Table Cache is empty.
05-Oct-2026 12:36:11 2026-10-05 16:36:11        INFO        name::        No table opened.
05-Oct-2026 12:36:11 2026-10-05 16:36:11        INFO        name::        No table opened.
05-Oct-2026 12:36:11 test_tool_coordsys.py::coordsys_test::test_linearTransformDirection
05-Oct-2026 12:36:11 Test set linear transform type to direction
05-Oct-2026 12:36:11 PASSED
05-Oct-2026 12:36:11
05-Oct-2026 12:36:11 2026-10-05 16:36:11        INFO        name::        No table opened.
05-Oct-2026 12:36:11 2026-10-05 16:36:11        INFO        showcache::        The Table Cache is empty.
05-Oct-2026 12:36:11 2026-10-05 16:36:11        INFO        name::        No table opened.
05-Oct-2026 12:36:11 2026-10-05 16:36:11        INFO        name::        No table opened.
05-Oct-2026 12:36:11 test_tool_coordsys.py::coordsys_test::test_linearTransformLinear
05-Oct-2026 12:36:11 Test set linear transform type to linear
05-Oct-2026 12:36:11 PASSED
05-Oct-2026 12:36:11
05-Oct-2026 12:36:11 2026-10-05 16:36:11        INFO        name::        No table opened.
05-Oct-2026 12:36:11 2026-10-05 16:36:11        INFO        showcache::        The Table Cache is empty.
05-Oct-2026 12:36:11 2026-10-05 16:36:11        INFO        name::        No table opened.
05-Oct-2026 12:36:11 2026-10-05 16:36:11        INFO        name::        No table opened.
05-Oct-2026 12:36:11 test_tool_coordsys.py::coordsys_test::test_linearTransformSpectral
05-Oct-2026 12:36:11 Test set linear transform type to spectral 
05-Oct-2026 12:36:11 PASSED
05-Oct-2026 12:36:11
05-Oct-2026 12:36:11 2026-10-05 16:36:11        INFO        name::        No table opened.
05-Oct-2026 12:36:11 2026-10-05 16:36:11        INFO        showcache::        The Table Cache is empty.
05-Oct-2026 12:36:11 2026-10-05 16:36:11        INFO        name::        No table opened.
05-Oct-2026 12:36:11 2026-10-05 16:36:11        INFO        name::        No table opened.
05-Oct-2026 12:36:11 test_tool_coordsys.py::coordsys_test::test_linearTransformStokes
05-Oct-2026 12:36:11 Test set linear transform type to stokes
05-Oct-2026 12:36:11 PASSED
05-Oct-2026 12:36:11
05-Oct-2026 12:36:11 2026-10-05 16:36:11        INFO        name::        No table opened.
05-Oct-2026 12:36:11 2026-10-05 16:36:11        INFO        showcache::        The Table Cache is empty.
05-Oct-2026 12:36:11 2026-10-05 16:36:11        INFO        name::        No table opened.
05-Oct-2026 12:36:11 2026-10-05 16:36:11        INFO        name::        No table opened.
05-Oct-2026 12:36:11 test_tool_coordsys.py::coordsys_test::test_linearTransformTabular
05-Oct-2026 12:36:11 Test set linear transform type to tabular
05-Oct-2026 12:36:11 PASSED
05-Oct-2026 12:36:11
05-Oct-2026 12:36:11 2026-10-05 16:36:11        INFO        name::        No table opened.
05-Oct-2026 12:36:11 2026-10-05 16:36:11        INFO        showcache::        The Table Cache is empty.
05-Oct-2026 12:36:11 2026-10-05 16:36:11        INFO        name::        No table opened.
05-Oct-2026 12:36:11 2026-10-05 16:36:11        INFO        name::        No table opened.
05-Oct-2026 12:36:11 test_tool_coordsys.py::coordsys_test::test_names
05-Oct-2026 12:36:11 Test that you can set and get names
05-Oct-2026 12:36:11 PASSED
05-Oct-2026 12:36:11
05-Oct-2026 12:36:11 2026-10-05 16:36:11        INFO        name::        No table opened.
05-Oct-2026 12:36:11 2026-10-05 16:36:11        INFO        showcache::        The Table Cache is empty.
05-Oct-2026 12:36:11 2026-10-05 16:36:11        INFO        name::        No table opened.
05-Oct-2026 12:36:11 2026-10-05 16:36:11        INFO        name::        No table opened.
05-Oct-2026 12:36:11 test_tool_coordsys.py::coordsys_test::test_naxes
05-Oct-2026 12:36:11 Test the naxes param with 0 or multiple axes
05-Oct-2026 12:36:11 PASSED
05-Oct-2026 12:36:11
05-Oct-2026 12:36:11 2026-10-05 16:36:11        INFO        name::        No table opened.
05-Oct-2026 12:36:11 2026-10-05 16:36:11        INFO        showcache::        The Table Cache is empty.
05-Oct-2026 12:36:11 2026-10-05 16:36:11        INFO        name::        No table opened.
05-Oct-2026 12:36:11 2026-10-05 16:36:11        INFO        name::        No table opened.
05-Oct-2026 12:36:11 test_tool_coordsys.py::coordsys_test::test_observer
05-Oct-2026 12:36:11 Test that you can set and get the observer
05-Oct-2026 12:36:11 PASSED
05-Oct-2026 12:36:11
05-Oct-2026 12:36:11 2026-10-05 16:36:11        INFO        name::        No table opened.
05-Oct-2026 12:36:11 2026-10-05 16:36:11        INFO        showcache::        The Table Cache is empty.
05-Oct-2026 12:36:11 2026-10-05 16:36:11        INFO        name::        No table opened.
05-Oct-2026 12:36:11 2026-10-05 16:36:11        INFO        name::        No table opened.
05-Oct-2026 12:36:11 test_tool_coordsys.py::coordsys_test::test_parentName
05-Oct-2026 12:36:11 Test that you can set and get the parent name
05-Oct-2026 12:36:11 PASSED
05-Oct-2026 12:36:11
05-Oct-2026 12:36:11 2026-10-05 16:36:11        INFO        name::        No table opened.
05-Oct-2026 12:36:11 2026-10-05 16:36:11        INFO        showcache::        The Table Cache is empty.
05-Oct-2026 12:36:11 2026-10-05 16:36:11        INFO        name::        No table opened.
05-Oct-2026 12:36:11 2026-10-05 16:36:11        INFO        name::        No table opened.
05-Oct-2026 12:36:11 test_tool_coordsys.py::coordsys_test::test_projection
05-Oct-2026 12:36:11 Test that the projection can be set
05-Oct-2026 12:36:11 PASSED
05-Oct-2026 12:36:11
05-Oct-2026 12:36:11 2026-10-05 16:36:11        INFO        name::        No table opened.
05-Oct-2026 12:36:11 2026-10-05 16:36:11        INFO        showcache::        The Table Cache is empty.
05-Oct-2026 12:36:11 2026-10-05 16:36:11        INFO        name::        No table opened.
05-Oct-2026 12:36:11 2026-10-05 16:36:11        INFO        name::        No table opened.
05-Oct-2026 12:36:11 test_tool_coordsys.py::coordsys_test::test_refCode
05-Oct-2026 12:36:11 Test that a reference code can be set
05-Oct-2026 12:36:11 PASSED
05-Oct-2026 12:36:11
05-Oct-2026 12:36:11 2026-10-05 16:36:11        INFO        name::        No table opened.
05-Oct-2026 12:36:11 2026-10-05 16:36:11        INFO        showcache::        The Table Cache is empty.
05-Oct-2026 12:36:11 2026-10-05 16:36:11        INFO        name::        No table opened.
05-Oct-2026 12:36:11 2026-10-05 16:36:11        INFO        name::        No table opened.
05-Oct-2026 12:36:11 test_tool_coordsys.py::coordsys_test::test_refPixel
05-Oct-2026 12:36:11 Test that you can get and set the reference pixel
05-Oct-2026 12:36:11 PASSED
05-Oct-2026 12:36:11
05-Oct-2026 12:36:11 2026-10-05 16:36:11        INFO        name::        No table opened.
05-Oct-2026 12:36:11 2026-10-05 16:36:11        INFO        showcache::        The Table Cache is empty.
05-Oct-2026 12:36:11 2026-10-05 16:36:11        INFO        name::        No table opened.
05-Oct-2026 12:36:11 2026-10-05 16:36:11        INFO        name::        No table opened.
05-Oct-2026 12:36:11 test_tool_coordsys.py::coordsys_test::test_referenceConvert
05-Oct-2026 12:36:11 Set values with reference conversion
05-Oct-2026 12:36:11 PASSED
05-Oct-2026 12:36:11
05-Oct-2026 12:36:11 2026-10-05 16:36:11        INFO        name::        No table opened.
05-Oct-2026 12:36:11 2026-10-05 16:36:11        INFO        showcache::        The Table Cache is empty.
05-Oct-2026 12:36:11 2026-10-05 16:36:11        INFO        name::        No table opened.
05-Oct-2026 12:36:11 2026-10-05 16:36:11        INFO        name::        No table opened.
05-Oct-2026 12:36:11 test_tool_coordsys.py::coordsys_test::test_referenceLocation
05-Oct-2026 12:36:11 Test that setreferencelocation correctly sets ref value
05-Oct-2026 12:36:11 PASSED
05-Oct-2026 12:36:11
05-Oct-2026 12:36:11 2026-10-05 16:36:11        SEVERE        coordsys::recordToWorldVector        Failed to convert string formatted world [i, like, doggies] to double
05-Oct-2026 12:36:11 2026-10-05 16:36:11        INFO        name::        No table opened.
05-Oct-2026 12:36:11 2026-10-05 16:36:11        INFO        showcache::        The Table Cache is empty.
05-Oct-2026 12:36:11 2026-10-05 16:36:11        INFO        name::        No table opened.
05-Oct-2026 12:36:11 2026-10-05 16:36:11        INFO        name::        No table opened.
05-Oct-2026 12:36:11 test_tool_coordsys.py::coordsys_test::test_referenceValueSetIncorrect
05-Oct-2026 12:36:11 Test setting the value incorrectly
05-Oct-2026 12:36:11 PASSED
05-Oct-2026 12:36:11
05-Oct-2026 12:36:11 2026-10-05 16:36:11        INFO        name::        No table opened.
05-Oct-2026 12:36:11 2026-10-05 16:36:11        INFO        showcache::        The Table Cache is empty.
05-Oct-2026 12:36:11 2026-10-05 16:36:11        INFO        name::        No table opened.
05-Oct-2026 12:36:11 2026-10-05 16:36:11        INFO        name::        No table opened.
05-Oct-2026 12:36:11 test_tool_coordsys.py::coordsys_test::test_referenceValueSetSpectral
05-Oct-2026 12:36:11 Test set reference value with spectral type
05-Oct-2026 12:36:11 PASSED
05-Oct-2026 12:36:11
05-Oct-2026 12:36:11 2026-10-05 16:36:11        INFO        name::        No table opened.
05-Oct-2026 12:36:11 2026-10-05 16:36:11        INFO        showcache::        The Table Cache is empty.
05-Oct-2026 12:36:11 2026-10-05 16:36:11        INFO        name::        No table opened.
05-Oct-2026 12:36:11 2026-10-05 16:36:11        INFO        name::        No table opened.
05-Oct-2026 12:36:11 test_tool_coordsys.py::coordsys_test::test_referenceValueSetValDefaultUnits
05-Oct-2026 12:36:11 Test set reference value using default units
05-Oct-2026 12:36:11 PASSED
05-Oct-2026 12:36:11
05-Oct-2026 12:36:11 2026-10-05 16:36:11        INFO        name::        No table opened.
05-Oct-2026 12:36:11 2026-10-05 16:36:11        INFO        showcache::        The Table Cache is empty.
05-Oct-2026 12:36:11 2026-10-05 16:36:11        INFO        name::        No table opened.
05-Oct-2026 12:36:11 2026-10-05 16:36:11        INFO        name::        No table opened.
05-Oct-2026 12:36:11 test_tool_coordsys.py::coordsys_test::test_referenceValueSetValRad
05-Oct-2026 12:36:11 Test set reference value in radians
05-Oct-2026 12:36:11 PASSED
05-Oct-2026 12:36:11
05-Oct-2026 12:36:11 2026-10-05 16:36:11        INFO        name::        No table opened.
05-Oct-2026 12:36:11 2026-10-05 16:36:11        INFO        showcache::        The Table Cache is empty.
05-Oct-2026 12:36:11 2026-10-05 16:36:11        INFO        name::        No table opened.
05-Oct-2026 12:36:11 2026-10-05 16:36:11        INFO        name::        No table opened.
05-Oct-2026 12:36:11 test_tool_coordsys.py::coordsys_test::test_reorder
05-Oct-2026 12:36:11 Test that the coords are reordered
05-Oct-2026 12:36:11 PASSED
05-Oct-2026 12:36:11
05-Oct-2026 12:36:11 2026-10-05 16:36:11        SEVERE        coordsys::reorder        order vector must be of length 4
05-Oct-2026 12:36:11 2026-10-05 16:36:11        INFO        name::        No table opened.
05-Oct-2026 12:36:11 2026-10-05 16:36:11        INFO        showcache::        The Table Cache is empty.
05-Oct-2026 12:36:11 2026-10-05 16:36:11        INFO        name::        No table opened.
05-Oct-2026 12:36:11 2026-10-05 16:36:11        INFO        name::        No table opened.
05-Oct-2026 12:36:11 test_tool_coordsys.py::coordsys_test::test_reorderInvalid
05-Oct-2026 12:36:11 Test that invalid inputs for reorder raises exceptions
05-Oct-2026 12:36:11 PASSED
05-Oct-2026 12:36:11
05-Oct-2026 12:36:11 2026-10-05 16:36:11        WARN        coordsys::replace        Replacement incurred warning
05-Oct-2026 12:36:11 2026-10-05 16:36:11        INFO        name::        No table opened.
05-Oct-2026 12:36:11 2026-10-05 16:36:11        INFO        showcache::        The Table Cache is empty.
05-Oct-2026 12:36:11 2026-10-05 16:36:11        INFO        name::        No table opened.
05-Oct-2026 12:36:11 2026-10-05 16:36:11        INFO        name::        No table opened.
05-Oct-2026 12:36:11 test_tool_coordsys.py::coordsys_test::test_replace
05-Oct-2026 12:36:11 Test that a coord types can be replaced
05-Oct-2026 12:36:11 PASSED
05-Oct-2026 12:36:11
05-Oct-2026 12:36:11 2026-10-05 16:36:11        SEVERE        coordsys::replace        Coordinates must have the same number of axes
05-Oct-2026 12:36:11 2026-10-05 16:36:11        INFO        name::        No table opened.
05-Oct-2026 12:36:11 2026-10-05 16:36:11        INFO        showcache::        The Table Cache is empty.
05-Oct-2026 12:36:11 2026-10-05 16:36:11        INFO        name::        No table opened.
05-Oct-2026 12:36:11 2026-10-05 16:36:11        INFO        name::        No table opened.
05-Oct-2026 12:36:11 test_tool_coordsys.py::coordsys_test::test_replaceIncorrect
05-Oct-2026 12:36:11 Test that incorrect inputs for replace result in failures
05-Oct-2026 12:36:11 PASSED
05-Oct-2026 12:36:11
05-Oct-2026 12:36:11 2026-10-05 16:36:11        INFO        name::        No table opened.
05-Oct-2026 12:36:11 2026-10-05 16:36:11        INFO        showcache::        The Table Cache is empty.
05-Oct-2026 12:36:11 2026-10-05 16:36:11        INFO        name::        No table opened.
05-Oct-2026 12:36:11 2026-10-05 16:36:11        INFO        name::        No table opened.
05-Oct-2026 12:36:11 test_tool_coordsys.py::coordsys_test::test_restFreq
05-Oct-2026 12:36:11 Test that the rest frequency can be set
05-Oct-2026 12:36:11 PASSED
05-Oct-2026 12:36:11
05-Oct-2026 12:36:11 2026-10-05 16:36:11        INFO        name::        No table opened.
05-Oct-2026 12:36:11 2026-10-05 16:36:11        INFO        showcache::        The Table Cache is empty.
05-Oct-2026 12:36:11 2026-10-05 16:36:11        INFO        name::        No table opened.
05-Oct-2026 12:36:11 2026-10-05 16:36:11        INFO        name::        No table opened.
05-Oct-2026 12:36:11 test_tool_coordsys.py::coordsys_test::test_setDirection
05-Oct-2026 12:36:11 Test that direction can be set
05-Oct-2026 12:36:11 PASSED
05-Oct-2026 12:36:11
05-Oct-2026 12:36:11 2026-10-05 16:36:11        INFO        name::        No table opened.
05-Oct-2026 12:36:11 2026-10-05 16:36:11        INFO        showcache::        The Table Cache is empty.
05-Oct-2026 12:36:11 2026-10-05 16:36:11        INFO        name::        No table opened.
05-Oct-2026 12:36:11 2026-10-05 16:36:11        INFO        name::        No table opened.
05-Oct-2026 12:36:11 test_tool_coordsys.py::coordsys_test::test_setDirectionPixVal
05-Oct-2026 12:36:11 Test that direction is set correctly with ref pix and val
05-Oct-2026 12:36:11 PASSED
05-Oct-2026 12:36:11
05-Oct-2026 12:36:11 2026-10-05 16:36:11        INFO        name::        No table opened.
05-Oct-2026 12:36:11 2026-10-05 16:36:11        INFO        showcache::        The Table Cache is empty.
05-Oct-2026 12:36:11 2026-10-05 16:36:11        INFO        name::        No table opened.
05-Oct-2026 12:36:11 2026-10-05 16:36:11        INFO        name::        No table opened.
05-Oct-2026 12:36:11 test_tool_coordsys.py::coordsys_test::test_setDirectionVal
05-Oct-2026 12:36:11 Test that direction is set correctly with ref val
05-Oct-2026 12:36:11 PASSED
05-Oct-2026 12:36:11
05-Oct-2026 12:36:11 2026-10-05 16:36:11        INFO        name::        No table opened.
05-Oct-2026 12:36:11 2026-10-05 16:36:11        INFO        showcache::        The Table Cache is empty.
05-Oct-2026 12:36:11 2026-10-05 16:36:11        INFO        name::        No table opened.
05-Oct-2026 12:36:11 2026-10-05 16:36:11        INFO        name::        No table opened.
05-Oct-2026 12:36:11 test_tool_coordsys.py::coordsys_test::test_setSpectral
05-Oct-2026 12:36:11 PASSED
05-Oct-2026 12:36:11
05-Oct-2026 12:36:11 2026-10-05 16:36:11        SEVERE        coordsys::findCoordinate        No coordinate of type Spectral in this CoordinateSystem
05-Oct-2026 12:36:11 2026-10-05 16:36:11        INFO        name::        No table opened.
05-Oct-2026 12:36:11 2026-10-05 16:36:11        INFO        showcache::        The Table Cache is empty.
05-Oct-2026 12:36:11 2026-10-05 16:36:11        INFO        name::        No table opened.
05-Oct-2026 12:36:11 2026-10-05 16:36:11        INFO        name::        No table opened.
05-Oct-2026 12:36:11 test_tool_coordsys.py::coordsys_test::test_setSpectralInvalidInput
05-Oct-2026 12:36:11 PASSED
05-Oct-2026 12:36:11
05-Oct-2026 12:36:11 2026-10-05 16:36:11        INFO        name::        No table opened.
05-Oct-2026 12:36:11 2026-10-05 16:36:11        INFO        showcache::        The Table Cache is empty.
05-Oct-2026 12:36:11 2026-10-05 16:36:11        INFO        name::        No table opened.
05-Oct-2026 12:36:11 2026-10-05 16:36:11        INFO        name::        No table opened.
05-Oct-2026 12:36:11 test_tool_coordsys.py::coordsys_test::test_setTabular
05-Oct-2026 12:36:11 Test that with tabular coordinates reference and pixel values can be set
05-Oct-2026 12:36:11 PASSED
05-Oct-2026 12:36:11
05-Oct-2026 12:36:11 2026-10-05 16:36:11        SEVERE        coordsys::settabular        Specified TabularCoordinate could not be found
05-Oct-2026 12:36:11 2026-10-05 16:36:11        SEVERE        coordsys::settabular        Pixel and world vectors must be the same length
05-Oct-2026 12:36:11 2026-10-05 16:36:11        SEVERE        coordsys::settabular        Pixel and world vectors must be the same length
05-Oct-2026 12:36:11 2026-10-05 16:36:11        INFO        coordsys::settabular        Old world vector length = 3
05-Oct-2026 12:36:11 2026-10-05 16:36:11        SEVERE        coordsys::settabular        Pixel and world vectors must be the same length
05-Oct-2026 12:36:11 2026-10-05 16:36:11        INFO        coordsys::settabular        Old pixel vector length = 3
05-Oct-2026 12:36:11 2026-10-05 16:36:11        SEVERE        coordsys::settabular        Pixel and world vectors must be the same length
05-Oct-2026 12:36:11 2026-10-05 16:36:11        INFO        name::        No table opened.
05-Oct-2026 12:36:11 2026-10-05 16:36:11        INFO        showcache::        The Table Cache is empty.
05-Oct-2026 12:36:11 2026-10-05 16:36:11        INFO        name::        No table opened.
05-Oct-2026 12:36:11 2026-10-05 16:36:11        INFO        name::        No table opened.
05-Oct-2026 12:36:11 test_tool_coordsys.py::coordsys_test::test_setTabularIncorrect
05-Oct-2026 12:36:11 Test that incorrect inputs will raise exceptions
05-Oct-2026 12:36:11 PASSED
05-Oct-2026 12:36:11
05-Oct-2026 12:36:11 2026-10-05 16:36:11        INFO        name::        No table opened.
05-Oct-2026 12:36:11 2026-10-05 16:36:11        INFO        showcache::        The Table Cache is empty.
05-Oct-2026 12:36:11 2026-10-05 16:36:11        INFO        name::        No table opened.
05-Oct-2026 12:36:11 2026-10-05 16:36:11        INFO        name::        No table opened.
05-Oct-2026 12:36:11 test_tool_coordsys.py::coordsys_test::test_stokes
05-Oct-2026 12:36:11 Test that you can create a coordsys with the given stokes values
05-Oct-2026 12:36:11 PASSED
05-Oct-2026 12:36:11
05-Oct-2026 12:36:11 2026-10-05 16:36:11        INFO        name::        No table opened.
05-Oct-2026 12:36:11 2026-10-05 16:36:11        INFO        showcache::        The Table Cache is empty.
05-Oct-2026 12:36:11 2026-10-05 16:36:11        INFO        name::        No table opened.
05-Oct-2026 12:36:11 2026-10-05 16:36:11        INFO        name::        No table opened.
05-Oct-2026 12:36:11 test_tool_coordsys.py::coordsys_test::test_stokesSetValue
05-Oct-2026 12:36:11 Test that you can set the stokes values after creation
05-Oct-2026 12:36:11 PASSED
05-Oct-2026 12:36:11
05-Oct-2026 12:36:11 2026-10-05 16:36:11        SEVERE        coordsys::findCoordinate        No coordinate of type Stokes in this CoordinateSystem
05-Oct-2026 12:36:11 2026-10-05 16:36:11        SEVERE        coordsys::findCoordinate        No coordinate of type Stokes in this CoordinateSystem
05-Oct-2026 12:36:11 2026-10-05 16:36:11        INFO        name::        No table opened.
05-Oct-2026 12:36:11 2026-10-05 16:36:11        INFO        showcache::        The Table Cache is empty.
05-Oct-2026 12:36:11 2026-10-05 16:36:11        INFO        name::        No table opened.
05-Oct-2026 12:36:11 2026-10-05 16:36:11        INFO        name::        No table opened.
05-Oct-2026 12:36:11 test_tool_coordsys.py::coordsys_test::test_stokesWrongValues
05-Oct-2026 12:36:11 Test that incorrect values raise exceptions
05-Oct-2026 12:36:11 PASSED
05-Oct-2026 12:36:11
05-Oct-2026 12:36:11 2026-10-05 16:36:11        INFO        name::        No table opened.
05-Oct-2026 12:36:11 2026-10-05 16:36:11        INFO        showcache::        The Table Cache is empty.
05-Oct-2026 12:36:11 2026-10-05 16:36:11        INFO        name::        No table opened.
05-Oct-2026 12:36:11 2026-10-05 16:36:11        INFO        name::        No table opened.
05-Oct-2026 12:36:11 test_tool_coordsys.py::coordsys_test::test_telescope
05-Oct-2026 12:36:11 Test that you can set and get the telescope
05-Oct-2026 12:36:11 PASSED
05-Oct-2026 12:36:11
05-Oct-2026 12:36:11 2026-10-05 16:36:11        SEVERE        coordsys::checkAbsRel        The value is absolute, not relative', origin='coordsys.checkAbsRel
05-Oct-2026 12:36:11 2026-10-05 16:36:11        SEVERE        coordsys::checkAbsRel        The value is relative, not absolute', origin='coordsys.checkAbsRel
05-Oct-2026 12:36:11 2026-10-05 16:36:11        SEVERE        coordsys::checkAbsRel        The value is absolute, not relative', origin='coordsys.checkAbsRel
05-Oct-2026 12:36:11 2026-10-05 16:36:11        SEVERE        coordsys::checkAbsRel        The value is relative, not absolute', origin='coordsys.checkAbsRel
05-Oct-2026 12:36:11 2026-10-05 16:36:11        INFO        name::        No table opened.
05-Oct-2026 12:36:11 2026-10-05 16:36:11        INFO        showcache::        The Table Cache is empty.
05-Oct-2026 12:36:11 2026-10-05 16:36:11        INFO        name::        No table opened.
05-Oct-2026 12:36:11 2026-10-05 16:36:11        INFO        name::        No table opened.
05-Oct-2026 12:36:11 test_tool_coordsys.py::coordsys_test::test_toAbsRelInvalidInput
05-Oct-2026 12:36:11 Test expected failure cases of toabs and torel
05-Oct-2026 12:36:11 PASSED
05-Oct-2026 12:36:11
05-Oct-2026 12:36:11 2026-10-05 16:36:11        INFO        name::        No table opened.
05-Oct-2026 12:36:11 2026-10-05 16:36:11        INFO        showcache::        The Table Cache is empty.
05-Oct-2026 12:36:11 2026-10-05 16:36:11        INFO        name::        No table opened.
05-Oct-2026 12:36:11 2026-10-05 16:36:11        INFO        name::        No table opened.
05-Oct-2026 12:36:11 test_tool_coordsys.py::coordsys_test::test_toAbsRelMany
05-Oct-2026 12:36:11 Test conversion of many to rel and abs
05-Oct-2026 12:36:11 w list:  [0.000e+00 0.000e+00 1.000e+00 1.415e+09 0.000e+00 0.000e+00]
05-Oct-2026 12:36:11 ww list:  [[0.000e+00 0.000e+00 1.000e+00 1.415e+09 0.000e+00]
05-Oct-2026 12:36:11 [0.000e+00 0.000e+00 1.000e+00 1.415e+09 0.000e+00]
05-Oct-2026 12:36:11 [0.000e+00 0.000e+00 1.000e+00 1.415e+09 0.000e+00]
05-Oct-2026 12:36:11 [0.000e+00 0.000e+00 1.000e+00 1.415e+09 0.000e+00]
05-Oct-2026 12:36:11 [0.000e+00 0.000e+00 1.000e+00 1.415e+09 0.000e+00]
05-Oct-2026 12:36:11 [0.000e+00 0.000e+00 1.000e+00 1.415e+09 0.000e+00]]
05-Oct-2026 12:36:11 absworld list:  [[ 0.000e+00  0.000e+00  1.000e+00 -5.200e+03  0.000e+00]
05-Oct-2026 12:36:11 [ 0.000e+00  0.000e+00  1.000e+00  5.200e+03  0.000e+00]
05-Oct-2026 12:36:11 [ 0.000e+00  0.000e+00  1.000e+00  1.415e+09  0.000e+00]
05-Oct-2026 12:36:11 [ 0.000e+00  0.000e+00  1.000e+00  1.415e+09  0.000e+00]
05-Oct-2026 12:36:11 [ 0.000e+00  0.000e+00  1.000e+00  1.415e+09  0.000e+00]
05-Oct-2026 12:36:11 [ 0.000e+00  0.000e+00  1.000e+00  1.415e+09  0.000e+00]]
05-Oct-2026 12:36:11 (np.float64(0.0), np.float64(0.0))
05-Oct-2026 12:36:11 (np.float64(0.0), np.float64(0.0))
05-Oct-2026 12:36:11 (np.float64(1.0), np.float64(0.0))
05-Oct-2026 12:36:11 (np.float64(1415000000.0), np.float64(0.0))
05-Oct-2026 12:36:11 (np.float64(0.0), np.float64(0.0))
05-Oct-2026 12:36:11 (np.float64(0.0), np.float64(0.0))
05-Oct-2026 12:36:11 (np.float64(0.0), np.float64(0.0))
05-Oct-2026 12:36:11 (np.float64(0.0), np.float64(0.0))
05-Oct-2026 12:36:11 (np.float64(1.0), np.float64(0.0))
05-Oct-2026 12:36:11 (np.float64(1415000000.0), np.float64(0.0))
05-Oct-2026 12:36:11 (np.float64(0.0), np.float64(0.0))
05-Oct-2026 12:36:11 (np.float64(0.0), np.float64(0.0))
05-Oct-2026 12:36:11 (np.float64(0.0), np.float64(1.0))
05-Oct-2026 12:36:11 (np.float64(0.0), np.float64(1.0))
05-Oct-2026 12:36:11 (np.float64(1.0), np.float64(1.0))
05-Oct-2026 12:36:11 (np.float64(1415000000.0), np.float64(1.0))
05-Oct-2026 12:36:11 (np.float64(0.0), np.float64(1.0))
05-Oct-2026 12:36:11 (np.float64(0.0), np.float64(1.0))
05-Oct-2026 12:36:11 (np.float64(0.0), np.float64(-5199.999999994527))
05-Oct-2026 12:36:11 (np.float64(0.0), np.float64(5199.999999994549))
05-Oct-2026 12:36:11 (np.float64(1.0), np.float64(1415000000.0))
05-Oct-2026 12:36:11 (np.float64(1415000000.0), np.float64(1415000000.0))
05-Oct-2026 12:36:11 (np.float64(0.0), np.float64(1415000000.0))
05-Oct-2026 12:36:11 (np.float64(0.0), np.float64(1415000000.0))
05-Oct-2026 12:36:11 (np.float64(0.0), np.float64(0.0))
05-Oct-2026 12:36:11 (np.float64(0.0), np.float64(0.0))
05-Oct-2026 12:36:11 (np.float64(1.0), np.float64(0.0))
05-Oct-2026 12:36:11 (np.float64(1415000000.0), np.float64(0.0))
05-Oct-2026 12:36:11 (np.float64(0.0), np.float64(0.0))
05-Oct-2026 12:36:11 (np.float64(0.0), np.float64(0.0))
05-Oct-2026 12:36:11 PASSED
05-Oct-2026 12:36:11
05-Oct-2026 12:36:11 2026-10-05 16:36:11        INFO        name::        No table opened.
05-Oct-2026 12:36:11 2026-10-05 16:36:11        INFO        showcache::        The Table Cache is empty.
05-Oct-2026 12:36:11 2026-10-05 16:36:11        INFO        name::        No table opened.
05-Oct-2026 12:36:11 2026-10-05 16:36:11        INFO        name::        No table opened.
05-Oct-2026 12:36:11 test_tool_coordsys.py::coordsys_test::test_toAbsRelRefPix
05-Oct-2026 12:36:11 Test that converting from pixel coordinates gives the correct value
05-Oct-2026 12:36:11 PASSED
05-Oct-2026 12:36:11
05-Oct-2026 12:36:11 2026-10-05 16:36:11        INFO        name::        No table opened.
05-Oct-2026 12:36:11 2026-10-05 16:36:11        INFO        showcache::        The Table Cache is empty.
05-Oct-2026 12:36:11 2026-10-05 16:36:11        INFO        name::        No table opened.
05-Oct-2026 12:36:11 2026-10-05 16:36:11        INFO        name::        No table opened.
05-Oct-2026 12:36:11 test_tool_coordsys.py::coordsys_test::test_toAbsRelWorld
05-Oct-2026 12:36:11 Test that converting from world coordinates gives the correct value
05-Oct-2026 12:36:11 PASSED
05-Oct-2026 12:36:11
05-Oct-2026 12:36:11 2026-10-05 16:36:11        INFO        name::        No table opened.
05-Oct-2026 12:36:11 2026-10-05 16:36:11        INFO        showcache::        The Table Cache is empty.
05-Oct-2026 12:36:11 2026-10-05 16:36:11        INFO        name::        No table opened.
05-Oct-2026 12:36:11 2026-10-05 16:36:11        INFO        name::        No table opened.
05-Oct-2026 12:36:11 test_tool_coordsys.py::coordsys_test::test_toPixel
05-Oct-2026 12:36:11 Test topixel parameter
05-Oct-2026 12:36:11 PASSED
05-Oct-2026 12:36:11
05-Oct-2026 12:36:11 2026-10-05 16:36:11        INFO        name::        No table opened.
05-Oct-2026 12:36:11 2026-10-05 16:36:11        INFO        showcache::        The Table Cache is empty.
05-Oct-2026 12:36:11 2026-10-05 16:36:11        INFO        name::        No table opened.
05-Oct-2026 12:36:11 2026-10-05 16:36:11        INFO        name::        No table opened.
05-Oct-2026 12:36:11 test_tool_coordsys.py::coordsys_test::test_toPixelMany
05-Oct-2026 12:36:11 Test topixelmany parameter
05-Oct-2026 12:36:11 PASSED
05-Oct-2026 12:36:11
05-Oct-2026 12:36:11 2026-10-05 16:36:11        INFO        name::        No table opened.
05-Oct-2026 12:36:11 2026-10-05 16:36:11        INFO        showcache::        The Table Cache is empty.
05-Oct-2026 12:36:11 2026-10-05 16:36:11        INFO        name::        No table opened.
05-Oct-2026 12:36:11 2026-10-05 16:36:11        INFO        name::        No table opened.
05-Oct-2026 12:36:11 test_tool_coordsys.py::coordsys_test::test_toRecord
05-Oct-2026 12:36:11 Test that the coordsys can be converted to a record
05-Oct-2026 12:36:11 PASSED
05-Oct-2026 12:36:11
05-Oct-2026 12:36:11 2026-10-05 16:36:11        INFO        name::        No table opened.
05-Oct-2026 12:36:11 2026-10-05 16:36:11        INFO        showcache::        The Table Cache is empty.
05-Oct-2026 12:36:11 2026-10-05 16:36:11        INFO        name::        No table opened.
05-Oct-2026 12:36:11 2026-10-05 16:36:11        INFO        name::        No table opened.
05-Oct-2026 12:36:11 test_tool_coordsys.py::coordsys_test::test_toWorld
05-Oct-2026 12:36:11 Test the toworld conversion
05-Oct-2026 12:36:11 PASSED
05-Oct-2026 12:36:11
05-Oct-2026 12:36:11 2026-10-05 16:36:11        INFO        name::        No table opened.
05-Oct-2026 12:36:11 2026-10-05 16:36:11        INFO        showcache::        The Table Cache is empty.
05-Oct-2026 12:36:11 2026-10-05 16:36:11        INFO        name::        No table opened.
05-Oct-2026 12:36:11 2026-10-05 16:36:11        INFO        name::        No table opened.
05-Oct-2026 12:36:11 test_tool_coordsys.py::coordsys_test::test_toWorldMany
05-Oct-2026 12:36:11 Test the toworldmany parameter
05-Oct-2026 12:36:11 PASSED
05-Oct-2026 12:36:11
05-Oct-2026 12:36:11 2026-10-05 16:36:11        INFO        ImageFactory::createImage        Created Temp image  of shape [4, 4, 4, 4] with float valued pixels.
05-Oct-2026 12:36:11 2026-10-05 16:36:11        INFO        name::        No table opened.
05-Oct-2026 12:36:11 2026-10-05 16:36:11        INFO        showcache::        The Table Cache is empty.
05-Oct-2026 12:36:11 2026-10-05 16:36:11        INFO        name::        No table opened.
05-Oct-2026 12:36:11 2026-10-05 16:36:11        INFO        name::        No table opened.
05-Oct-2026 12:36:11 test_tool_coordsys.py::coordsys_test::test_transpose
05-Oct-2026 12:36:11 Test the transpose() method
05-Oct-2026 12:36:11 PASSED
05-Oct-2026 12:36:11
05-Oct-2026 12:36:11 2026-10-05 16:36:11        INFO        name::        No table opened.
05-Oct-2026 12:36:11 2026-10-05 16:36:11        INFO        showcache::        The Table Cache is empty.
05-Oct-2026 12:36:11 2026-10-05 16:36:11        INFO        name::        No table opened.
05-Oct-2026 12:36:11 2026-10-05 16:36:11        INFO        name::        No table opened.
05-Oct-2026 12:36:11 test_tool_coordsys.py::coordsys_test::test_units
05-Oct-2026 12:36:11 Test that you can set and get unit names
05-Oct-2026 12:36:11 PASSED
05-Oct-2026 12:36:11
05-Oct-2026 12:36:11 2026-10-05 16:36:11        INFO        name::        No table opened.
05-Oct-2026 12:36:11 2026-10-05 16:36:11        INFO        showcache::        The Table Cache is empty.
05-Oct-2026 12:36:11 2026-10-05 16:36:11        INFO        name::        No table opened.
05-Oct-2026 12:36:11 2026-10-05 16:36:11        INFO        name::        No table opened.
05-Oct-2026 12:36:11 test_tool_coordsys.py::coordsys_test::test_velocityToFrequency
05-Oct-2026 12:36:11 Test velocity To frequency conversion
05-Oct-2026 12:36:11 PASSED
05-Oct-2026 12:36:11
05-Oct-2026 12:36:11 2026-10-05 16:36:11        INFO        name::        No table opened.
05-Oct-2026 12:36:11 2026-10-05 16:36:11        INFO        showcache::        The Table Cache is empty.
05-Oct-2026 12:36:11 2026-10-05 16:36:11        INFO        name::        No table opened.
05-Oct-2026 12:36:11 2026-10-05 16:36:11        INFO        name::        No table opened.
05-Oct-2026 12:36:11 test_tool_coordsys.py::coordsys_test::test_velocityToFrequencyDiff
05-Oct-2026 12:36:11 Test the drequency diff
05-Oct-2026 12:36:11 PASSED
05-Oct-2026 12:36:11
05-Oct-2026 12:36:11 - generated xml file: /home/casatest/casa6/casatestutils/nosedir/xml/test_tool_coordsys/nose.xml -
05-Oct-2026 12:36:11 ======================== 74 passed, 1 warning in 0.45s =========================
05-Oct-2026 12:36:11 ============================= test session starts ==============================
05-Oct-2026 12:36:11 platform linux -- Python 3.12.9, pytest-9.1.1, pluggy-1.6.0 -- /home/casatest/venv/bin/python3.12
05-Oct-2026 12:36:11 cachedir: .pytest_cache
05-Oct-2026 12:36:11 rootdir: /home/casatest/casa6/casatestutils/nosedir/test_tool_componentlist
05-Oct-2026 12:36:11 configfile: pytest.ini
05-Oct-2026 12:36:11 collecting ... collected 4 items
05-Oct-2026 12:36:11
05-Oct-2026 12:36:11
05-Oct-2026 12:36:11 test_tool_componentlist.py::componentlist_test::test_getfluxerror
05-Oct-2026 12:36:11 Test cl.getfluxerror()
05-Oct-2026 12:36:11 PASSED
05-Oct-2026 12:36:11
05-Oct-2026 12:36:11 2026-10-05 16:36:12        WARN        componentlist::close        componentlist closed
05-Oct-2026 12:36:11 2026-10-05 16:36:12        WARN        componentlist::close        componentlist closed
05-Oct-2026 12:36:11 test_tool_componentlist.py::componentlist_test::test_plp
05-Oct-2026 12:36:11 Test adding/updating plp spectral component
05-Oct-2026 12:36:11 PASSED
05-Oct-2026 12:36:11
05-Oct-2026 12:36:11 2026-10-05 16:36:12        INFO        componentlist::summarize        SUMMARY OF COMPONENT
05-Oct-2026 12:36:11 2026-10-05 16:36:12        INFO        componentlist::summarize+        Shape: Gaussian
05-Oct-2026 12:36:11 2026-10-05 16:36:12        INFO        componentlist::summarize+        Flux density: [(1,0), (0,0), (0,0), (0,0)] Jy +/- [(0,0), (0,0), (0,0), (0,0)]
05-Oct-2026 12:36:11 2026-10-05 16:36:12        INFO        componentlist::summarize+        Spectral model: Constant
05-Oct-2026 12:36:11 2026-10-05 16:36:12        INFO        componentlist::summarize+        Position: Position ---
05-Oct-2026 12:36:11 2026-10-05 16:36:12        INFO        componentlist::summarize+               --- long:   10:30:00.000 (fixed)
05-Oct-2026 12:36:11 2026-10-05 16:36:12        INFO        componentlist::summarize+               --- lat:  - 20.00.00.00 (fixed)
05-Oct-2026 12:36:11 2026-10-05 16:36:12        INFO        componentlist::summarize+        
05-Oct-2026 12:36:11 2026-10-05 16:36:12        INFO        componentlist::summarize+        Size:
05-Oct-2026 12:36:11 2026-10-05 16:36:12        INFO        componentlist::summarize+               --- major axis FWHM:     4.00 arcsec (fixed)
05-Oct-2026 12:36:11 2026-10-05 16:36:12        INFO        componentlist::summarize+               --- minor axis FWHM:     2.00 arcsec (fixed)
05-Oct-2026 12:36:11 2026-10-05 16:36:12        INFO        componentlist::summarize+               --- position angle: 30.0deg (fixed)
05-Oct-2026 12:36:11 2026-10-05 16:36:12        SEVERE        componentlist::summarize        Exception Reported: List has only 1 components, but zero-based component 1 specified. Please specify a component less than 1
05-Oct-2026 12:36:11 test_tool_componentlist.py::componentlist_test::test_summarize
05-Oct-2026 12:36:11 Test the cl.summarize() method
05-Oct-2026 12:36:11 PASSED
05-Oct-2026 12:36:11
05-Oct-2026 12:36:11 2026-10-05 16:36:12        SEVERE        componentlist::putkeyword        Exception Reported: Exception: A table is not attached to this ComponentList.
05-Oct-2026 12:36:11 2026-10-05 16:36:12        SEVERE        componentlist::putkeyword+        ... thrown by void casa::ComponentList::putKeyword(const casacore::String&, const casac::variant&) at File: /source/casa6/casatools/src/code/components/ComponentModels/ComponentList.cc, line: 1238
05-Oct-2026 12:36:11 2026-10-05 16:36:12        SEVERE        componentlist::getkeyword        Exception Reported: Exception: A table is not attached to this ComponentList.
05-Oct-2026 12:36:11 2026-10-05 16:36:12        SEVERE        componentlist::getkeyword+        ... thrown by casac::variant* casa::ComponentList::getKeyword(const casacore::String&) const at File: /source/casa6/casatools/src/code/components/ComponentModels/ComponentList.cc, line: 1248
05-Oct-2026 12:36:11 2026-10-05 16:36:12        SEVERE        componentlist::haskeyword        Exception Reported: Exception: A table is not attached to this ComponentList.
05-Oct-2026 12:36:11 2026-10-05 16:36:12        SEVERE        componentlist::haskeyword+        ... thrown by bool casa::ComponentList::hasKeyword(const casacore::String&) const at File: /source/casa6/casatools/src/code/components/ComponentModels/ComponentList.cc, line: 1233
05-Oct-2026 12:36:11 2026-10-05 16:36:12        SEVERE        componentlist::putkeyword        Exception Reported: Exception: A table is not attached to this ComponentList.
05-Oct-2026 12:36:11 2026-10-05 16:36:12        SEVERE        componentlist::putkeyword+        ... thrown by void casa::ComponentList::putKeyword(const casacore::String&, const casac::variant&) at File: /source/casa6/casatools/src/code/components/ComponentModels/ComponentList.cc, line: 1238
05-Oct-2026 12:36:11 2026-10-05 16:36:12        SEVERE        componentlist::getkeyword        Exception Reported: Exception: A table is not attached to this ComponentList.
05-Oct-2026 12:36:11 2026-10-05 16:36:12        SEVERE        componentlist::getkeyword+        ... thrown by casac::variant* casa::ComponentList::getKeyword(const casacore::String&) const at File: /source/casa6/casatools/src/code/components/ComponentModels/ComponentList.cc, line: 1248
05-Oct-2026 12:36:11 2026-10-05 16:36:12        SEVERE        componentlist::haskeyword        Exception Reported: Exception: A table is not attached to this ComponentList.
05-Oct-2026 12:36:11 2026-10-05 16:36:12        SEVERE        componentlist::haskeyword+        ... thrown by bool casa::ComponentList::hasKeyword(const casacore::String&) const at File: /source/casa6/casatools/src/code/components/ComponentModels/ComponentList.cc, line: 1233
05-Oct-2026 12:36:11 test_tool_componentlist.py::componentlist_test::test_table_keyword_interface
05-Oct-2026 12:36:11 Test putting, getting, querying table keywords
05-Oct-2026 12:36:11 PASSED
05-Oct-2026 12:36:11
05-Oct-2026 12:36:11 - generated xml file: /home/casatest/casa6/casatestutils/nosedir/xml/test_tool_componentlist/nose.xml -
05-Oct-2026 12:36:11 ========================= 4 passed, 1 warning in 0.28s =========================
05-Oct-2026 12:36:11
05-Oct-2026 12:36:11
05-Oct-2026 12:36:11 Setting Working Directory: /home/casatest/casa6/casatestutils/nosedir/test_tool_image_pbcor/
05-Oct-2026 12:36:11 Test Directory: /home/casatest/casa6/casatestutils/nosedir/test_tool_image_pbcor
05-Oct-2026 12:36:11
05-Oct-2026 12:36:11 Running Command: pytest --junitxml=/home/casatest/casa6/casatestutils/nosedir/xml/test_tool_image_pbcor/nose.xml -s --disable-pytest-warnings --verbose -ra --tb=short /home/casatest/casa6/casatestutils/nosedir/test_tool_image_pbcor/
05-Oct-2026 12:36:11
05-Oct-2026 12:36:11 Setting Working Directory: /home/casatest/casa6/casatestutils/nosedir/test_tool_imagepol/
05-Oct-2026 12:36:11 Test Directory: /home/casatest/casa6/casatestutils/nosedir/test_tool_imagepol
05-Oct-2026 12:36:11
05-Oct-2026 12:36:11 Running Command: pytest --junitxml=/home/casatest/casa6/casatestutils/nosedir/xml/test_tool_imagepol/nose.xml -s --disable-pytest-warnings --verbose -ra --tb=short /home/casatest/casa6/casatestutils/nosedir/test_tool_imagepol/
05-Oct-2026 12:36:11
05-Oct-2026 12:36:11 Setting Working Directory: /home/casatest/casa6/casatestutils/nosedir/test_tool_image_statistics/
05-Oct-2026 12:36:11 Test Directory: /home/casatest/casa6/casatestutils/nosedir/test_tool_image_statistics
05-Oct-2026 12:36:11
05-Oct-2026 12:36:11 Running Command: pytest --junitxml=/home/casatest/casa6/casatestutils/nosedir/xml/test_tool_image_statistics/nose.xml -s --disable-pytest-warnings --verbose -ra --tb=short /home/casatest/casa6/casatestutils/nosedir/test_tool_image_statistics/
05-Oct-2026 12:36:11
05-Oct-2026 12:36:11 Setting Working Directory: /home/casatest/casa6/casatestutils/nosedir/test_tool_ms_createmultims/
05-Oct-2026 12:36:11 Test Directory: /home/casatest/casa6/casatestutils/nosedir/test_tool_ms_createmultims
05-Oct-2026 12:36:11
05-Oct-2026 12:36:11 Running Command: pytest --junitxml=/home/casatest/casa6/casatestutils/nosedir/xml/test_tool_ms_createmultims/nose.xml -s --disable-pytest-warnings --verbose -ra --tb=short /home/casatest/casa6/casatestutils/nosedir/test_tool_ms_createmultims/
05-Oct-2026 12:36:11
05-Oct-2026 12:36:11 Setting Working Directory: /home/casatest/casa6/casatestutils/nosedir/test_tool_measures/
05-Oct-2026 12:36:11 Test Directory: /home/casatest/casa6/casatestutils/nosedir/test_tool_measures
05-Oct-2026 12:36:11
05-Oct-2026 12:36:11 Running Command: pytest --junitxml=/home/casatest/casa6/casatestutils/nosedir/xml/test_tool_measures/nose.xml -s --disable-pytest-warnings --verbose -ra --tb=short /home/casatest/casa6/casatestutils/nosedir/test_tool_measures/
05-Oct-2026 12:36:11
05-Oct-2026 12:36:11 Setting Working Directory: /home/casatest/casa6/casatestutils/nosedir/test_tool_sdm/
05-Oct-2026 12:36:11 Test Directory: /home/casatest/casa6/casatestutils/nosedir/test_tool_sdm
05-Oct-2026 12:36:11
05-Oct-2026 12:36:11 Running Command: pytest --junitxml=/home/casatest/casa6/casatestutils/nosedir/xml/test_tool_sdm/nose.xml -s --disable-pytest-warnings --verbose -ra --tb=short /home/casatest/casa6/casatestutils/nosedir/test_tool_sdm/
05-Oct-2026 12:36:11
05-Oct-2026 12:36:11 Setting Working Directory: /home/casatest/casa6/casatestutils/nosedir/test_tool_image_regrid/
05-Oct-2026 12:36:11 Test Directory: /home/casatest/casa6/casatestutils/nosedir/test_tool_image_regrid
05-Oct-2026 12:36:11
05-Oct-2026 12:36:11 Running Command: pytest --junitxml=/home/casatest/casa6/casatestutils/nosedir/xml/test_tool_image_regrid/nose.xml -s --disable-pytest-warnings --verbose -ra --tb=short /home/casatest/casa6/casatestutils/nosedir/test_tool_image_regrid/
05-Oct-2026 12:36:11
05-Oct-2026 12:36:11 Setting Working Directory: /home/casatest/casa6/casatestutils/nosedir/test_tool_ms/
05-Oct-2026 12:36:11 Test Directory: /home/casatest/casa6/casatestutils/nosedir/test_tool_ms
05-Oct-2026 12:36:11
05-Oct-2026 12:36:11 Running Command: pytest --junitxml=/home/casatest/casa6/casatestutils/nosedir/xml/test_tool_ms/nose.xml -s --disable-pytest-warnings --verbose -ra --tb=short /home/casatest/casa6/casatestutils/nosedir/test_tool_ms/
05-Oct-2026 12:36:11
05-Oct-2026 12:36:11 Setting Working Directory: /home/casatest/casa6/casatestutils/nosedir/test_tool_image_rebin/
05-Oct-2026 12:36:11 Test Directory: /home/casatest/casa6/casatestutils/nosedir/test_tool_image_rebin
05-Oct-2026 12:36:11
05-Oct-2026 12:36:11 Running Command: pytest --junitxml=/home/casatest/casa6/casatestutils/nosedir/xml/test_tool_image_rebin/nose.xml -s --disable-pytest-warnings --verbose -ra --tb=short /home/casatest/casa6/casatestutils/nosedir/test_tool_image_rebin/
05-Oct-2026 12:36:11
05-Oct-2026 12:36:11 Setting Working Directory: /home/casatest/casa6/casatestutils/nosedir/test_tool_calanalysis/
05-Oct-2026 12:36:11 Test Directory: /home/casatest/casa6/casatestutils/nosedir/test_tool_calanalysis
05-Oct-2026 12:36:11
05-Oct-2026 12:36:11 Running Command: pytest --junitxml=/home/casatest/casa6/casatestutils/nosedir/xml/test_tool_calanalysis/nose.xml -s --disable-pytest-warnings --verbose -ra --tb=short /home/casatest/casa6/casatestutils/nosedir/test_tool_calanalysis/
05-Oct-2026 12:36:11
05-Oct-2026 12:36:11 Setting Working Directory: /home/casatest/casa6/casatestutils/nosedir/test_tool_synthesisutils/
05-Oct-2026 12:36:11 Test Directory: /home/casatest/casa6/casatestutils/nosedir/test_tool_synthesisutils
05-Oct-2026 12:36:11
05-Oct-2026 12:36:11 Running Command: pytest --junitxml=/home/casatest/casa6/casatestutils/nosedir/xml/test_tool_synthesisutils/nose.xml -s --disable-pytest-warnings --verbose -ra --tb=short /home/casatest/casa6/casatestutils/nosedir/test_tool_synthesisutils/
05-Oct-2026 12:36:11
05-Oct-2026 12:36:11 Setting Working Directory: /home/casatest/casa6/casatestutils/nosedir/test_tool_simulator/
05-Oct-2026 12:36:11 Test Directory: /home/casatest/casa6/casatestutils/nosedir/test_tool_simulator
05-Oct-2026 12:36:11
05-Oct-2026 12:36:11 Running Command: pytest --junitxml=/home/casatest/casa6/casatestutils/nosedir/xml/test_tool_simulator/nose.xml -s --disable-pytest-warnings --verbose -ra --tb=short /home/casatest/casa6/casatestutils/nosedir/test_tool_simulator/
05-Oct-2026 12:36:11
05-Oct-2026 12:36:11 Setting Working Directory: /home/casatest/casa6/casatestutils/nosedir/test_tool_sdm_toms/
05-Oct-2026 12:36:11 Test Directory: /home/casatest/casa6/casatestutils/nosedir/test_tool_sdm_toms
05-Oct-2026 12:36:11
05-Oct-2026 12:36:11 Running Command: pytest --junitxml=/home/casatest/casa6/casatestutils/nosedir/xml/test_tool_sdm_toms/nose.xml -s --disable-pytest-warnings --verbose -ra --tb=short /home/casatest/casa6/casatestutils/nosedir/test_tool_sdm_toms/
05-Oct-2026 12:36:11
05-Oct-2026 12:36:11 Setting Working Directory: /home/casatest/casa6/casatestutils/nosedir/test_tool_calibrater/
05-Oct-2026 12:36:11 Test Directory: /home/casatest/casa6/casatestutils/nosedir/test_tool_calibrater
05-Oct-2026 12:36:11
05-Oct-2026 12:36:11 Running Command: pytest --junitxml=/home/casatest/casa6/casatestutils/nosedir/xml/test_tool_calibrater/nose.xml -s --disable-pytest-warnings --verbose -ra --tb=short /home/casatest/casa6/casatestutils/nosedir/test_tool_calibrater/
05-Oct-2026 12:36:11
05-Oct-2026 12:36:11 Setting Working Directory: /home/casatest/casa6/casatestutils/nosedir/test_tool_logsink/
05-Oct-2026 12:36:11 Test Directory: /home/casatest/casa6/casatestutils/nosedir/test_tool_logsink
05-Oct-2026 12:36:11
05-Oct-2026 12:36:11 Running Command: pytest --junitxml=/home/casatest/casa6/casatestutils/nosedir/xml/test_tool_logsink/nose.xml -s --disable-pytest-warnings --verbose -ra --tb=short /home/casatest/casa6/casatestutils/nosedir/test_tool_logsink/
05-Oct-2026 12:36:11
05-Oct-2026 12:36:11 Setting Working Directory: /home/casatest/casa6/casatestutils/nosedir/test_tool_image_deviation/
05-Oct-2026 12:36:11 Test Directory: /home/casatest/casa6/casatestutils/nosedir/test_tool_image_deviation
05-Oct-2026 12:36:11
05-Oct-2026 12:36:11 Running Command: pytest --junitxml=/home/casatest/casa6/casatestutils/nosedir/xml/test_tool_image_deviation/nose.xml -s --disable-pytest-warnings --verbose -ra --tb=short /home/casatest/casa6/casatestutils/nosedir/test_tool_image_deviation/
05-Oct-2026 12:36:11
05-Oct-2026 12:36:11 Setting Working Directory: /home/casatest/casa6/casatestutils/nosedir/test_tool_coordsys/
05-Oct-2026 12:36:11 Test Directory: /home/casatest/casa6/casatestutils/nosedir/test_tool_coordsys
05-Oct-2026 12:36:11
05-Oct-2026 12:36:11 Running Command: pytest --junitxml=/home/casatest/casa6/casatestutils/nosedir/xml/test_tool_coordsys/nose.xml -s --disable-pytest-warnings --verbose -ra --tb=short /home/casatest/casa6/casatestutils/nosedir/test_tool_coordsys/
05-Oct-2026 12:36:11
05-Oct-2026 12:36:11 Setting Working Directory: /home/casatest/casa6/casatestutils/nosedir/test_tool_componentlist/
05-Oct-2026 12:36:11 Test Directory: /home/casatest/casa6/casatestutils/nosedir/test_tool_componentlist
05-Oct-2026 12:36:11
05-Oct-2026 12:36:11 Running Command: pytest --junitxml=/home/casatest/casa6/casatestutils/nosedir/xml/test_tool_componentlist/nose.xml -s --disable-pytest-warnings --verbose -ra --tb=short /home/casatest/casa6/casatestutils/nosedir/test_tool_componentlist/
05-Oct-2026 12:36:11 total 77816
05-Oct-2026 12:36:11 -rw-r--r-- 1 casaci 15001   161014 Oct  5 16:25 casatestutils-6.7.7.11-py3-none-any.whl
05-Oct-2026 12:36:11 -rw-r--r-- 1 casaci 15001 79350287 Oct  5 16:25 casatools-6.7.7.11-cp312-cp312-manylinux_2_28_x86_64.whl
05-Oct-2026 12:36:11 -rw-r--r-- 1 casaci root      4340 Oct  5 16:36 test_tool_agentflagger.xml
05-Oct-2026 12:36:11 -rw-r--r-- 1 casaci root      1006 Oct  5 16:36 test_tool_calanalysis.xml
05-Oct-2026 12:36:11 -rw-r--r-- 1 casaci root      2656 Oct  5 16:36 test_tool_calibrater.xml
05-Oct-2026 12:36:11 -rw-r--r-- 1 casaci root       687 Oct  5 16:36 test_tool_componentlist.xml
05-Oct-2026 12:36:11 -rw-r--r-- 1 casaci root      7467 Oct  5 16:36 test_tool_coordsys.xml
05-Oct-2026 12:36:11 -rw-r--r-- 1 casaci root     12935 Oct  5 16:36 test_tool_image.xml
05-Oct-2026 12:36:11 -rw-r--r-- 1 casaci root      2220 Oct  5 16:36 test_tool_image_collapse.xml
05-Oct-2026 12:36:11 -rw-r--r-- 1 casaci root      1048 Oct  5 16:36 test_tool_image_deviation.xml
05-Oct-2026 12:36:11 -rw-r--r-- 1 casaci root      2574 Oct  5 16:36 test_tool_image_fitprofile.xml
05-Oct-2026 12:36:11 -rw-r--r-- 1 casaci root      1178 Oct  5 16:36 test_tool_image_pbcor.xml
05-Oct-2026 12:36:11 -rw-r--r-- 1 casaci root       883 Oct  5 16:36 test_tool_image_pv.xml
05-Oct-2026 12:36:11 -rw-r--r-- 1 casaci root      1006 Oct  5 16:36 test_tool_image_rebin.xml
05-Oct-2026 12:36:11 -rw-r--r-- 1 casaci root      1336 Oct  5 16:36 test_tool_image_regrid.xml
05-Oct-2026 12:36:11 -rw-r--r-- 1 casaci root      1639 Oct  5 16:36 test_tool_image_statistics.xml
05-Oct-2026 12:36:11 -rw-r--r-- 1 casaci root       765 Oct  5 16:36 test_tool_image_subimage.xml
05-Oct-2026 12:36:11 -rw-r--r-- 1 casaci root       890 Oct  5 16:36 test_tool_image_transpose.xml
05-Oct-2026 12:36:11 -rw-r--r-- 1 casaci root      1966 Oct  5 16:36 test_tool_imagepol.xml
05-Oct-2026 12:36:11 -rw-r--r-- 1 casaci root       838 Oct  5 16:36 test_tool_linearmosaic.xml
05-Oct-2026 12:36:11 -rw-r--r-- 1 casaci root       669 Oct  5 16:36 test_tool_logsink.xml
05-Oct-2026 12:36:11 -rw-r--r-- 1 casaci root       549 Oct  5 16:36 test_tool_measures.xml
05-Oct-2026 12:36:11 -rw-r--r-- 1 casaci root      5224 Oct  5 16:36 test_tool_ms.xml
05-Oct-2026 12:36:11 -rw-r--r-- 1 casaci root       367 Oct  5 16:36 test_tool_ms_createmultims.xml
05-Oct-2026 12:36:11 -rw-r--r-- 1 casaci root      2096 Oct  5 16:36 test_tool_ms_statwt.xml
05-Oct-2026 12:36:11 -rw-r--r-- 1 casaci root      8633 Oct  5 16:36 test_tool_msmetadata.xml
05-Oct-2026 12:36:11 -rw-r--r-- 1 casaci root       359 Oct  5 16:36 test_tool_msuvbinner.xml
05-Oct-2026 12:36:11 -rw-r--r-- 1 casaci root      1171 Oct  5 16:36 test_tool_quanta.xml
05-Oct-2026 12:36:11 -rw-r--r-- 1 casaci root      3975 Oct  5 16:36 test_tool_regionmanager.xml
05-Oct-2026 12:36:11 -rw-r--r-- 1 casaci root      2071 Oct  5 16:36 test_tool_sdm.xml
05-Oct-2026 12:36:11 -rw-r--r-- 1 casaci root      2190 Oct  5 16:36 test_tool_sdm_toms.xml
05-Oct-2026 12:36:11 -rw-r--r-- 1 casaci root       670 Oct  5 16:36 test_tool_simulator.xml
05-Oct-2026 12:36:11 -rw-r--r-- 1 casaci root      2025 Oct  5 16:36 test_tool_synthesisutils.xml
05-Oct-2026 12:36:11 -rw-r--r-- 1 casaci root      1462 Oct  5 16:36 test_tool_table.xml
05-Oct-2026 12:36:11 -rw-r--r-- 1 casaci root      1717 Oct  5 16:36 test_tool_vpmanager.xml
05-Oct-2026 12:36:11 Finished task 'Test wheel' with result: Success
05-Oct-2026 12:36:11
Substituting variable: ${bamboo.python_version} with 3.12
05-Oct-2026 12:36:11
Substituting variable: ${bamboo.agentId} with 153550849
05-Oct-2026 12:36:11
Substituting variable: ${bamboo.agentId} with 153550849
05-Oct-2026 12:36:11
Substituting variable: ${bamboo.agentId} with 153550849
05-Oct-2026 12:36:11
Substituting variable: ${bamboo.agentId} with 153550849
05-Oct-2026 12:36:11 Starting task 'Tar work directory' of type 'com.atlassian.bamboo.plugins.scripttask:task.builder.script'
05-Oct-2026 12:36:11
Beginning to execute external process for build 'CASA - Release Engineering Master Test 3.12 go.nrao.edu IERS - Test Tools Many Linux 2.28 Rocky 8.10 Py3.12 #4 (CASA-REMT3GI-TTOMLPY38-4)'
... running command line:
/opt/ci_workspace/casa/bamboo/agent1/temp/CASA-REMT3GI-TTOMLPY38-4-ScriptBuildTask-8340333389859653070.sh
... in: /opt/ci_workspace/casa/bamboo/agent1/xml-data/build-dir/CASA-REMT3GI-TTOMLPY38
05-Oct-2026 12:36:11 Package working directory
05-Oct-2026 12:36:12 tar: nosedir: Cannot stat: No such file or directory
05-Oct-2026 12:36:12 tar: Exiting with failure status due to previous errors
05-Oct-2026 12:36:12 total 77820
05-Oct-2026 12:36:12 -rw-r--r-- 1 casaci 15001   161014 Oct  5 16:25 casatestutils-6.7.7.11-py3-none-any.whl
05-Oct-2026 12:36:12 -rw-r--r-- 1 casaci 15001 79350287 Oct  5 16:25 casatools-6.7.7.11-cp312-cp312-manylinux_2_28_x86_64.whl
05-Oct-2026 12:36:12 -rw-r--r-- 1 casaci root      4340 Oct  5 16:36 test_tool_agentflagger.xml
05-Oct-2026 12:36:12 -rw-r--r-- 1 casaci root      1006 Oct  5 16:36 test_tool_calanalysis.xml
05-Oct-2026 12:36:12 -rw-r--r-- 1 casaci root      2656 Oct  5 16:36 test_tool_calibrater.xml
05-Oct-2026 12:36:12 -rw-r--r-- 1 casaci root       687 Oct  5 16:36 test_tool_componentlist.xml
05-Oct-2026 12:36:12 -rw-r--r-- 1 casaci root      7467 Oct  5 16:36 test_tool_coordsys.xml
05-Oct-2026 12:36:12 -rw-r--r-- 1 casaci root     12935 Oct  5 16:36 test_tool_image.xml
05-Oct-2026 12:36:12 -rw-r--r-- 1 casaci root      2220 Oct  5 16:36 test_tool_image_collapse.xml
05-Oct-2026 12:36:12 -rw-r--r-- 1 casaci root      1048 Oct  5 16:36 test_tool_image_deviation.xml
05-Oct-2026 12:36:12 -rw-r--r-- 1 casaci root      2574 Oct  5 16:36 test_tool_image_fitprofile.xml
05-Oct-2026 12:36:12 -rw-r--r-- 1 casaci root      1178 Oct  5 16:36 test_tool_image_pbcor.xml
05-Oct-2026 12:36:12 -rw-r--r-- 1 casaci root       883 Oct  5 16:36 test_tool_image_pv.xml
05-Oct-2026 12:36:12 -rw-r--r-- 1 casaci root      1006 Oct  5 16:36 test_tool_image_rebin.xml
05-Oct-2026 12:36:12 -rw-r--r-- 1 casaci root      1336 Oct  5 16:36 test_tool_image_regrid.xml
05-Oct-2026 12:36:12 -rw-r--r-- 1 casaci root      1639 Oct  5 16:36 test_tool_image_statistics.xml
05-Oct-2026 12:36:12 -rw-r--r-- 1 casaci root       765 Oct  5 16:36 test_tool_image_subimage.xml
05-Oct-2026 12:36:12 -rw-r--r-- 1 casaci root       890 Oct  5 16:36 test_tool_image_transpose.xml
05-Oct-2026 12:36:12 -rw-r--r-- 1 casaci root      1966 Oct  5 16:36 test_tool_imagepol.xml
05-Oct-2026 12:36:12 -rw-r--r-- 1 casaci root       838 Oct  5 16:36 test_tool_linearmosaic.xml
05-Oct-2026 12:36:12 -rw-r--r-- 1 casaci root       669 Oct  5 16:36 test_tool_logsink.xml
05-Oct-2026 12:36:12 -rw-r--r-- 1 casaci root       549 Oct  5 16:36 test_tool_measures.xml
05-Oct-2026 12:36:12 -rw-r--r-- 1 casaci root      5224 Oct  5 16:36 test_tool_ms.xml
05-Oct-2026 12:36:12 -rw-r--r-- 1 casaci root       367 Oct  5 16:36 test_tool_ms_createmultims.xml
05-Oct-2026 12:36:12 -rw-r--r-- 1 casaci root      2096 Oct  5 16:36 test_tool_ms_statwt.xml
05-Oct-2026 12:36:12 -rw-r--r-- 1 casaci root      8633 Oct  5 16:36 test_tool_msmetadata.xml
05-Oct-2026 12:36:12 -rw-r--r-- 1 casaci root       359 Oct  5 16:36 test_tool_msuvbinner.xml
05-Oct-2026 12:36:12 -rw-r--r-- 1 casaci root      1171 Oct  5 16:36 test_tool_quanta.xml
05-Oct-2026 12:36:12 -rw-r--r-- 1 casaci root      3975 Oct  5 16:36 test_tool_regionmanager.xml
05-Oct-2026 12:36:12 -rw-r--r-- 1 casaci root      2071 Oct  5 16:36 test_tool_sdm.xml
05-Oct-2026 12:36:12 -rw-r--r-- 1 casaci root      2190 Oct  5 16:36 test_tool_sdm_toms.xml
05-Oct-2026 12:36:12 -rw-r--r-- 1 casaci root       670 Oct  5 16:36 test_tool_simulator.xml
05-Oct-2026 12:36:12 -rw-r--r-- 1 casaci root      2025 Oct  5 16:36 test_tool_synthesisutils.xml
05-Oct-2026 12:36:12 -rw-r--r-- 1 casaci root      1462 Oct  5 16:36 test_tool_table.xml
05-Oct-2026 12:36:12 -rw-r--r-- 1 casaci root      1717 Oct  5 16:36 test_tool_vpmanager.xml
05-Oct-2026 12:36:12 -rw-r--r-- 1 casaci root        45 Oct  5 16:36 work-manylinux228-3.12.tar.gz
05-Oct-2026 12:36:12 Done packaging working directory
05-Oct-2026 12:36:12 Finished task 'Tar work directory' with result: Success
05-Oct-2026 12:36:12 Starting task 'Parse tests' of type 'com.atlassian.bamboo.plugins.testresultparser:task.testresultparser.junit'
05-Oct-2026 12:36:12 Parsing test results under /opt/ci_workspace/casa/bamboo/agent1/xml-data/build-dir/CASA-REMT3GI-TTOMLPY38...
05-Oct-2026 12:36:12 Failing task since 1 failing test cases were found.
05-Oct-2026 12:36:12 Finished task 'Parse tests' with result: Failed
05-Oct-2026 12:36:12 Running post build plugin 'Docker Container Cleanup'
05-Oct-2026 12:36:12
Beginning to execute external process for build 'CASA - Release Engineering Master Test 3.12 go.nrao.edu IERS - Test Tools Many Linux 2.28 Rocky 8.10 Py3.12 #4 (CASA-REMT3GI-TTOMLPY38-4)'
... running command line:
/usr/bin/docker rm -f wheel-container-test-153550849
... in: /opt/ci_workspace/casa/bamboo/agent1/xml-data/build-dir/CASA-REMT3GI-TTOMLPY38
05-Oct-2026 12:36:14 wheel-container-test-153550849
05-Oct-2026 12:36:14 Running post build plugin 'NCover Results Collector'
05-Oct-2026 12:36:14 Running post build plugin 'Build Results Label Collector'
05-Oct-2026 12:36:14 Running post build plugin 'Clover Results Collector'
05-Oct-2026 12:36:14 Running post build plugin 'npm Cache Cleanup'
05-Oct-2026 12:36:14 Running post build plugin 'Artifact Copier'
05-Oct-2026 12:36:14 Publishing an artifact: Workdir
05-Oct-2026 12:36:14 Finished publishing of artifact Non required job artifact Http Compression On : [Workdir], patterns: [work*.tar.gz] anchored at: [wheeldirectory/] in 38.61 ms
05-Oct-2026 12:36:14 Publishing an artifact: XML Directories
05-Oct-2026 12:36:14 Finished publishing of artifact Non required job artifact Http Compression On : [XML Directories], patterns: [**/*.xml] anchored at: [wheeldirectory/] in 97.30 ms
05-Oct-2026 12:36:14 Finalising the build...
05-Oct-2026 12:36:14 Stopping timer.
05-Oct-2026 12:36:14 Build CASA-REMT3GI-TTOMLPY38-4 completed.
05-Oct-2026 12:36:14 Running on server: post build plugin 'Build Hanging Detection Configuration'
05-Oct-2026 12:36:14 Running on server: post build plugin 'NCover Results Collector'
05-Oct-2026 12:36:14 Running on server: post build plugin 'Build Labeller'
05-Oct-2026 12:36:14 Running on server: post build plugin 'Clover Delta Calculator'
05-Oct-2026 12:36:14 Running on server: post build plugin 'Maven Dependencies Postprocessor'
05-Oct-2026 12:36:14 All post build plugins have finished
05-Oct-2026 12:36:14 Generating build results summary...
05-Oct-2026 12:36:14 Saving build results to disk...
05-Oct-2026 12:36:14 Store variable context...
05-Oct-2026 12:36:14 Finished building CASA-REMT3GI-TTOMLPY38-4.